Mock Version: 4.1
Mock Version: 4.1
Mock Version: 4.1
ENTER ['do_with_status'](['bash', '--login', '-c', '/usr/bin/rpmbuild -bs --noclean --target aarch64 --nodeps /builddir/build/SPECS/python-uvloop.spec'], chrootPath='/var/lib/mock/dist-ocs23-python311-arm-build-79797-4647/root'env={'TERM': 'vt100', 'SHELL': '/bin/bash', 'HOME': '/builddir', 'HOSTNAME': 'mock', 'PATH': '/usr/bin:/bin:/usr/sbin:/sbin', 'PROMPT_COMMAND': 'printf "\\033]0;<mock-chroot>\\007"', 'PS1': '<mock-chroot> \\s-\\v\\$ ', 'LANG': 'C.UTF-8'}shell=Falselogger=<mockbuild.trace_decorator.getLog object at 0xffff86c77ca0>timeout=86400uid=981gid=135user='mockbuild'nspawn_args=['--capability=cap_ipc_lock', '--bind=/tmp/mock-resolv.bd62_0q7:/etc/resolv.conf', '--bind=/dev/btrfs-control', '--bind=/dev/mapper/control', '--bind=/dev/loop-control', '--bind=/dev/loop0', '--bind=/dev/loop1', '--bind=/dev/loop2', '--bind=/dev/loop3', '--bind=/dev/loop4', '--bind=/dev/loop5', '--bind=/dev/loop6', '--bind=/dev/loop7', '--bind=/dev/loop8', '--bind=/dev/loop9', '--bind=/dev/loop10', '--bind=/dev/loop11']unshare_net=TrueprintOutput=False)
Using nspawn with args ['--capability=cap_ipc_lock', '--bind=/tmp/mock-resolv.bd62_0q7:/etc/resolv.conf', '--bind=/dev/btrfs-control', '--bind=/dev/mapper/control', '--bind=/dev/loop-control', '--bind=/dev/loop0', '--bind=/dev/loop1', '--bind=/dev/loop2', '--bind=/dev/loop3', '--bind=/dev/loop4', '--bind=/dev/loop5', '--bind=/dev/loop6', '--bind=/dev/loop7', '--bind=/dev/loop8', '--bind=/dev/loop9', '--bind=/dev/loop10', '--bind=/dev/loop11']
Executing command: ['/usr/bin/systemd-nspawn', '-q', '-M', 'ac84d3ac00214302844096cbbfb5a2d2', '-D', '/var/lib/mock/dist-ocs23-python311-arm-build-79797-4647/root', '-a', '-u', 'mockbuild', '--capability=cap_ipc_lock', '--bind=/tmp/mock-resolv.bd62_0q7:/etc/resolv.conf', '--bind=/dev/btrfs-control', '--bind=/dev/mapper/control', '--bind=/dev/loop-control', '--bind=/dev/loop0', '--bind=/dev/loop1', '--bind=/dev/loop2', '--bind=/dev/loop3', '--bind=/dev/loop4', '--bind=/dev/loop5', '--bind=/dev/loop6', '--bind=/dev/loop7', '--bind=/dev/loop8', '--bind=/dev/loop9', '--bind=/dev/loop10', '--bind=/dev/loop11', '--console=pipe', '--setenv=TERM=vt100', '--setenv=SHELL=/bin/bash', '--setenv=HOME=/builddir', '--setenv=HOSTNAME=mock', '--setenv=PATH=/usr/bin:/bin:/usr/sbin:/sbin', '--setenv=PROMPT_COMMAND=printf "\\033]0;<mock-chroot>\\007"', '--setenv=PS1=<mock-chroot> \\s-\\v\\$ ', '--setenv=LANG=C.UTF-8', '--resolv-conf=off', 'bash', '--login', '-c', '/usr/bin/rpmbuild -bs --noclean --target aarch64 --nodeps /builddir/build/SPECS/python-uvloop.spec'] with env {'TERM': 'vt100', 'SHELL': '/bin/bash', 'HOME': '/builddir', 'HOSTNAME': 'mock', 'PATH': '/usr/bin:/bin:/usr/sbin:/sbin', 'PROMPT_COMMAND': 'printf "\\033]0;<mock-chroot>\\007"', 'PS1': '<mock-chroot> \\s-\\v\\$ ', 'LANG': 'C.UTF-8', 'SYSTEMD_NSPAWN_TMPFS_TMP': '0', 'SYSTEMD_SECCOMP': '0'} and shell False
Building target platforms: aarch64
Building for target aarch64
Wrote: /builddir/build/SRPMS/python-uvloop-0.17.0-4.ocs23.src.rpm
Child return code was: 0
ENTER ['do_with_status'](['bash', '--login', '-c', '/usr/bin/rpmbuild -bb --noclean --target aarch64 --nodeps /builddir/build/SPECS/python-uvloop.spec'], chrootPath='/var/lib/mock/dist-ocs23-python311-arm-build-79797-4647/root'env={'TERM': 'vt100', 'SHELL': '/bin/bash', 'HOME': '/builddir', 'HOSTNAME': 'mock', 'PATH': '/usr/bin:/bin:/usr/sbin:/sbin', 'PROMPT_COMMAND': 'printf "\\033]0;<mock-chroot>\\007"', 'PS1': '<mock-chroot> \\s-\\v\\$ ', 'LANG': 'C.UTF-8'}shell=Falselogger=<mockbuild.trace_decorator.getLog object at 0xffff86c77ca0>timeout=86400uid=981gid=135user='mockbuild'nspawn_args=['--capability=cap_ipc_lock', '--bind=/tmp/mock-resolv.bd62_0q7:/etc/resolv.conf', '--bind=/dev/btrfs-control', '--bind=/dev/mapper/control', '--bind=/dev/loop-control', '--bind=/dev/loop0', '--bind=/dev/loop1', '--bind=/dev/loop2', '--bind=/dev/loop3', '--bind=/dev/loop4', '--bind=/dev/loop5', '--bind=/dev/loop6', '--bind=/dev/loop7', '--bind=/dev/loop8', '--bind=/dev/loop9', '--bind=/dev/loop10', '--bind=/dev/loop11']unshare_net=TrueprintOutput=False)
Using nspawn with args ['--capability=cap_ipc_lock', '--bind=/tmp/mock-resolv.bd62_0q7:/etc/resolv.conf', '--bind=/dev/btrfs-control', '--bind=/dev/mapper/control', '--bind=/dev/loop-control', '--bind=/dev/loop0', '--bind=/dev/loop1', '--bind=/dev/loop2', '--bind=/dev/loop3', '--bind=/dev/loop4', '--bind=/dev/loop5', '--bind=/dev/loop6', '--bind=/dev/loop7', '--bind=/dev/loop8', '--bind=/dev/loop9', '--bind=/dev/loop10', '--bind=/dev/loop11']
Executing command: ['/usr/bin/systemd-nspawn', '-q', '-M', '7edf874e69dd4b4fad5aa57099361d0f', '-D', '/var/lib/mock/dist-ocs23-python311-arm-build-79797-4647/root', '-a', '-u', 'mockbuild', '--capability=cap_ipc_lock', '--bind=/tmp/mock-resolv.bd62_0q7:/etc/resolv.conf', '--bind=/dev/btrfs-control', '--bind=/dev/mapper/control', '--bind=/dev/loop-control', '--bind=/dev/loop0', '--bind=/dev/loop1', '--bind=/dev/loop2', '--bind=/dev/loop3', '--bind=/dev/loop4', '--bind=/dev/loop5', '--bind=/dev/loop6', '--bind=/dev/loop7', '--bind=/dev/loop8', '--bind=/dev/loop9', '--bind=/dev/loop10', '--bind=/dev/loop11', '--console=pipe', '--setenv=TERM=vt100', '--setenv=SHELL=/bin/bash', '--setenv=HOME=/builddir', '--setenv=HOSTNAME=mock', '--setenv=PATH=/usr/bin:/bin:/usr/sbin:/sbin', '--setenv=PROMPT_COMMAND=printf "\\033]0;<mock-chroot>\\007"', '--setenv=PS1=<mock-chroot> \\s-\\v\\$ ', '--setenv=LANG=C.UTF-8', '--resolv-conf=off', 'bash', '--login', '-c', '/usr/bin/rpmbuild -bb --noclean --target aarch64 --nodeps /builddir/build/SPECS/python-uvloop.spec'] with env {'TERM': 'vt100', 'SHELL': '/bin/bash', 'HOME': '/builddir', 'HOSTNAME': 'mock', 'PATH': '/usr/bin:/bin:/usr/sbin:/sbin', 'PROMPT_COMMAND': 'printf "\\033]0;<mock-chroot>\\007"', 'PS1': '<mock-chroot> \\s-\\v\\$ ', 'LANG': 'C.UTF-8', 'SYSTEMD_NSPAWN_TMPFS_TMP': '0', 'SYSTEMD_SECCOMP': '0'} and shell False
Building target platforms: aarch64
Building for target aarch64
Executing(%prep): /bin/sh -e /var/tmp/rpm-tmp.eYkXmQ
+ umask 022
+ cd /builddir/build/BUILD
+ cd /builddir/build/BUILD
+ rm -rf uvloop-0.17.0
+ /usr/lib/rpm/rpmuncompress -x /builddir/build/SOURCES/uvloop-0.17.0.tar.gz
+ STATUS=0
+ '[' 0 -ne 0 ']'
+ cd uvloop-0.17.0
+ /usr/bin/chmod -Rf a+rX,u+w,g-w,o-w .
+ /usr/lib/rpm/rpmuncompress /builddir/build/SOURCES/fix-deadlock-in-testcase.patch
+ /usr/bin/patch -p1 -s --fuzz=0 --no-backup-if-mismatch -f
+ sed -i -e /self.cython_always/s/False/True/ setup.py
+ sed -i -e /self.use_system_libuv/s/False/True/ setup.py
+ rm -vrf vendor/
removed directory 'vendor/libuv'
removed directory 'vendor/'
+ RPM_EC=0
++ jobs -p
+ exit 0
Executing(%build): /bin/sh -e /var/tmp/rpm-tmp.JBru8I
+ umask 022
+ cd /builddir/build/BUILD
+ PYTHONPATH=:/usr/lib/python3.10/site-packages/:/usr/lib64/python3.10/site-packages/
+ export PYTHONPATH
+ CFLAGS='-O2 -flto=auto -ffat-lto-objects -fexceptions -g -grecord-gcc-switches -pipe -Wall -Werror=format-security -Wp,-D_FORTIFY_SOURCE=2 -Wp,-D_GLIBCXX_ASSERTIONS -specs=/usr/lib/rpm/OpenCloudOS/OpenCloudOS-hardened-cc1 -fstack-protector-strong  -mbranch-protection=standard -fasynchronous-unwind-tables -fstack-clash-protection'
+ export CFLAGS
+ CXXFLAGS='-O2 -flto=auto -ffat-lto-objects -fexceptions -g -grecord-gcc-switches -pipe -Wall -Werror=format-security -Wp,-D_FORTIFY_SOURCE=2 -Wp,-D_GLIBCXX_ASSERTIONS -specs=/usr/lib/rpm/OpenCloudOS/OpenCloudOS-hardened-cc1 -fstack-protector-strong  -mbranch-protection=standard -fasynchronous-unwind-tables -fstack-clash-protection'
+ export CXXFLAGS
+ FFLAGS='-O2 -flto=auto -ffat-lto-objects -fexceptions -g -grecord-gcc-switches -pipe -Wall -Werror=format-security -Wp,-D_FORTIFY_SOURCE=2 -Wp,-D_GLIBCXX_ASSERTIONS -specs=/usr/lib/rpm/OpenCloudOS/OpenCloudOS-hardened-cc1 -fstack-protector-strong  -mbranch-protection=standard -fasynchronous-unwind-tables -fstack-clash-protection -I/usr/lib64/gfortran/modules'
+ export FFLAGS
+ FCFLAGS='-O2 -flto=auto -ffat-lto-objects -fexceptions -g -grecord-gcc-switches -pipe -Wall -Werror=format-security -Wp,-D_FORTIFY_SOURCE=2 -Wp,-D_GLIBCXX_ASSERTIONS -specs=/usr/lib/rpm/OpenCloudOS/OpenCloudOS-hardened-cc1 -fstack-protector-strong  -mbranch-protection=standard -fasynchronous-unwind-tables -fstack-clash-protection -I/usr/lib64/gfortran/modules'
+ export FCFLAGS
+ LDFLAGS='-Wl,-z,relro -Wl,--as-needed  -Wl,-z,now -specs=/usr/lib/rpm/OpenCloudOS/OpenCloudOS-hardened-ld  -Wl,--build-id=sha1'
+ export LDFLAGS
+ LT_SYS_LIBRARY_PATH=/usr/lib64:
+ export LT_SYS_LIBRARY_PATH
+ CC=gcc
+ export CC
+ CXX=g++
+ export CXX
+ cd uvloop-0.17.0
+ CFLAGS='-O2 -flto=auto -ffat-lto-objects -fexceptions -g -grecord-gcc-switches -pipe -Wall -Werror=format-security -Wp,-D_FORTIFY_SOURCE=2 -Wp,-D_GLIBCXX_ASSERTIONS -specs=/usr/lib/rpm/OpenCloudOS/OpenCloudOS-hardened-cc1 -fstack-protector-strong  -mbranch-protection=standard -fasynchronous-unwind-tables -fstack-clash-protection'
+ LDFLAGS='-Wl,-z,relro -Wl,--as-needed  -Wl,-z,now -specs=/usr/lib/rpm/OpenCloudOS/OpenCloudOS-hardened-ld  -Wl,--build-id=sha1'
+ /usr/bin/python3 setup.py build '--executable=/usr/bin/python3 -s'
running build
running build_py
creating build
creating build/lib.linux-aarch64-cpython-311
creating build/lib.linux-aarch64-cpython-311/uvloop
copying uvloop/_version.py -> build/lib.linux-aarch64-cpython-311/uvloop
copying uvloop/_noop.py -> build/lib.linux-aarch64-cpython-311/uvloop
copying uvloop/_testbase.py -> build/lib.linux-aarch64-cpython-311/uvloop
copying uvloop/__init__.py -> build/lib.linux-aarch64-cpython-311/uvloop
running egg_info
creating uvloop.egg-info
writing uvloop.egg-info/PKG-INFO
writing dependency_links to uvloop.egg-info/dependency_links.txt
writing requirements to uvloop.egg-info/requires.txt
writing top-level names to uvloop.egg-info/top_level.txt
writing manifest file 'uvloop.egg-info/SOURCES.txt'
Compiling uvloop/loop.pyx because it changed.
[1/1] Cythonizing uvloop/loop.pyx
reading manifest file 'uvloop.egg-info/SOURCES.txt'
reading manifest template 'MANIFEST.in'
warning: no files found matching '*' under directory 'vendor/libuv'
warning: no previously-included files matching '*' found under directory 'vendor/libuv/.git'
warning: no previously-included files matching '*' found under directory 'vendor/libuv/docs'
warning: no previously-included files matching '*' found under directory 'vendor/libuv/img'
adding license file 'LICENSE-APACHE'
adding license file 'LICENSE-MIT'
writing manifest file 'uvloop.egg-info/SOURCES.txt'
/usr/lib/python3.11/site-packages/setuptools/command/build_py.py:202: SetuptoolsDeprecationWarning:     Installing 'uvloop.handles' as data is deprecated, please list it in `packages`.
    !!
    ############################
    # Package would be ignored #
    ############################
    Python recognizes 'uvloop.handles' as an importable package,
    but it is not listed in the `packages` configuration of setuptools.
    'uvloop.handles' has been automatically added to the distribution only
    because it may contain data files, but this behavior is likely to change
    in future versions of setuptools (and therefore is considered deprecated).
    Please make sure that 'uvloop.handles' is included as a package by using
    the `packages` configuration field or the proper discovery methods
    (for example by using `find_namespace_packages(...)`/`find_namespace:`
    instead of `find_packages(...)`/`find:`).
    You can read more about "package discovery" and "data files" on setuptools
    documentation page.
!!
  check.warn(importable)
/usr/lib/python3.11/site-packages/setuptools/command/build_py.py:202: SetuptoolsDeprecationWarning:     Installing 'uvloop.includes' as data is deprecated, please list it in `packages`.
    !!
    ############################
    # Package would be ignored #
    ############################
    Python recognizes 'uvloop.includes' as an importable package,
    but it is not listed in the `packages` configuration of setuptools.
    'uvloop.includes' has been automatically added to the distribution only
    because it may contain data files, but this behavior is likely to change
    in future versions of setuptools (and therefore is considered deprecated).
    Please make sure that 'uvloop.includes' is included as a package by using
    the `packages` configuration field or the proper discovery methods
    (for example by using `find_namespace_packages(...)`/`find_namespace:`
    instead of `find_packages(...)`/`find:`).
    You can read more about "package discovery" and "data files" on setuptools
    documentation page.
!!
  check.warn(importable)
copying uvloop/cbhandles.pxd -> build/lib.linux-aarch64-cpython-311/uvloop
copying uvloop/cbhandles.pyx -> build/lib.linux-aarch64-cpython-311/uvloop
copying uvloop/dns.pyx -> build/lib.linux-aarch64-cpython-311/uvloop
copying uvloop/errors.pyx -> build/lib.linux-aarch64-cpython-311/uvloop
copying uvloop/loop.c -> build/lib.linux-aarch64-cpython-311/uvloop
copying uvloop/loop.pxd -> build/lib.linux-aarch64-cpython-311/uvloop
copying uvloop/loop.pyi -> build/lib.linux-aarch64-cpython-311/uvloop
copying uvloop/loop.pyx -> build/lib.linux-aarch64-cpython-311/uvloop
copying uvloop/lru.pyx -> build/lib.linux-aarch64-cpython-311/uvloop
copying uvloop/pseudosock.pyx -> build/lib.linux-aarch64-cpython-311/uvloop
copying uvloop/py.typed -> build/lib.linux-aarch64-cpython-311/uvloop
copying uvloop/request.pxd -> build/lib.linux-aarch64-cpython-311/uvloop
copying uvloop/request.pyx -> build/lib.linux-aarch64-cpython-311/uvloop
copying uvloop/server.pxd -> build/lib.linux-aarch64-cpython-311/uvloop
copying uvloop/server.pyx -> build/lib.linux-aarch64-cpython-311/uvloop
copying uvloop/sslproto.pxd -> build/lib.linux-aarch64-cpython-311/uvloop
copying uvloop/sslproto.pyx -> build/lib.linux-aarch64-cpython-311/uvloop
creating build/lib.linux-aarch64-cpython-311/uvloop/handles
copying uvloop/handles/async_.pxd -> build/lib.linux-aarch64-cpython-311/uvloop/handles
copying uvloop/handles/async_.pyx -> build/lib.linux-aarch64-cpython-311/uvloop/handles
copying uvloop/handles/basetransport.pxd -> build/lib.linux-aarch64-cpython-311/uvloop/handles
copying uvloop/handles/basetransport.pyx -> build/lib.linux-aarch64-cpython-311/uvloop/handles
copying uvloop/handles/check.pxd -> build/lib.linux-aarch64-cpython-311/uvloop/handles
copying uvloop/handles/check.pyx -> build/lib.linux-aarch64-cpython-311/uvloop/handles
copying uvloop/handles/fsevent.pxd -> build/lib.linux-aarch64-cpython-311/uvloop/handles
copying uvloop/handles/fsevent.pyx -> build/lib.linux-aarch64-cpython-311/uvloop/handles
copying uvloop/handles/handle.pxd -> build/lib.linux-aarch64-cpython-311/uvloop/handles
copying uvloop/handles/handle.pyx -> build/lib.linux-aarch64-cpython-311/uvloop/handles
copying uvloop/handles/idle.pxd -> build/lib.linux-aarch64-cpython-311/uvloop/handles
copying uvloop/handles/idle.pyx -> build/lib.linux-aarch64-cpython-311/uvloop/handles
copying uvloop/handles/pipe.pxd -> build/lib.linux-aarch64-cpython-311/uvloop/handles
copying uvloop/handles/pipe.pyx -> build/lib.linux-aarch64-cpython-311/uvloop/handles
copying uvloop/handles/poll.pxd -> build/lib.linux-aarch64-cpython-311/uvloop/handles
copying uvloop/handles/poll.pyx -> build/lib.linux-aarch64-cpython-311/uvloop/handles
copying uvloop/handles/process.pxd -> build/lib.linux-aarch64-cpython-311/uvloop/handles
copying uvloop/handles/process.pyx -> build/lib.linux-aarch64-cpython-311/uvloop/handles
copying uvloop/handles/stream.pxd -> build/lib.linux-aarch64-cpython-311/uvloop/handles
copying uvloop/handles/stream.pyx -> build/lib.linux-aarch64-cpython-311/uvloop/handles
copying uvloop/handles/streamserver.pxd -> build/lib.linux-aarch64-cpython-311/uvloop/handles
copying uvloop/handles/streamserver.pyx -> build/lib.linux-aarch64-cpython-311/uvloop/handles
copying uvloop/handles/tcp.pxd -> build/lib.linux-aarch64-cpython-311/uvloop/handles
copying uvloop/handles/tcp.pyx -> build/lib.linux-aarch64-cpython-311/uvloop/handles
copying uvloop/handles/timer.pxd -> build/lib.linux-aarch64-cpython-311/uvloop/handles
copying uvloop/handles/timer.pyx -> build/lib.linux-aarch64-cpython-311/uvloop/handles
copying uvloop/handles/udp.pxd -> build/lib.linux-aarch64-cpython-311/uvloop/handles
copying uvloop/handles/udp.pyx -> build/lib.linux-aarch64-cpython-311/uvloop/handles
creating build/lib.linux-aarch64-cpython-311/uvloop/includes
copying uvloop/includes/__init__.py -> build/lib.linux-aarch64-cpython-311/uvloop/includes
copying uvloop/includes/compat.h -> build/lib.linux-aarch64-cpython-311/uvloop/includes
copying uvloop/includes/consts.pxi -> build/lib.linux-aarch64-cpython-311/uvloop/includes
copying uvloop/includes/debug.h -> build/lib.linux-aarch64-cpython-311/uvloop/includes
copying uvloop/includes/debug.pxd -> build/lib.linux-aarch64-cpython-311/uvloop/includes
copying uvloop/includes/flowcontrol.pxd -> build/lib.linux-aarch64-cpython-311/uvloop/includes
copying uvloop/includes/fork_handler.h -> build/lib.linux-aarch64-cpython-311/uvloop/includes
copying uvloop/includes/python.pxd -> build/lib.linux-aarch64-cpython-311/uvloop/includes
copying uvloop/includes/stdlib.pxi -> build/lib.linux-aarch64-cpython-311/uvloop/includes
copying uvloop/includes/system.pxd -> build/lib.linux-aarch64-cpython-311/uvloop/includes
copying uvloop/includes/uv.pxd -> build/lib.linux-aarch64-cpython-311/uvloop/includes
running build_ext
building 'uvloop.loop' extension
creating build/temp.linux-aarch64-cpython-311
creating build/temp.linux-aarch64-cpython-311/uvloop
gcc -Wsign-compare -DDYNAMIC_ANNOTATIONS_ENABLED=1 -DNDEBUG -O2 -fexceptions -g -grecord-gcc-switches -pipe -Wall -Werror=format-security -Wp,-D_FORTIFY_SOURCE=2 -Wp,-D_GLIBCXX_ASSERTIONS -fstack-protector-strong -mbranch-protection=standard -fasynchronous-unwind-tables -fstack-clash-protection -O2 -fexceptions -g -grecord-gcc-switches -pipe -Wall -Werror=format-security -Wp,-D_FORTIFY_SOURCE=2 -Wp,-D_GLIBCXX_ASSERTIONS -fstack-protector-strong -mbranch-protection=standard -fasynchronous-unwind-tables -fstack-clash-protection -O2 -fexceptions -g -grecord-gcc-switches -pipe -Wall -Werror=format-security -Wp,-D_FORTIFY_SOURCE=2 -Wp,-D_GLIBCXX_ASSERTIONS -fstack-protector-strong -mbranch-protection=standard -fasynchronous-unwind-tables -fstack-clash-protection -O2 -flto=auto -ffat-lto-objects -fexceptions -g -grecord-gcc-switches -pipe -Wall -Werror=format-security -Wp,-D_FORTIFY_SOURCE=2 -Wp,-D_GLIBCXX_ASSERTIONS -specs=/usr/lib/rpm/OpenCloudOS/OpenCloudOS-hardened-cc1 -fstack-protector-strong -mbranch-protection=standard -fasynchronous-unwind-tables -fstack-clash-protection -fPIC -I/usr/include/python3.11 -c uvloop/loop.c -o build/temp.linux-aarch64-cpython-311/uvloop/loop.o -O2
gcc -shared -Wl,-z,relro -Wl,--as-needed -Wl,-z,now -Wl,--build-id=sha1 -Wl,-z,relro -Wl,--as-needed -Wl,-z,now -Wl,--build-id=sha1 -Wl,-z,relro -Wl,--as-needed -Wl,-z,now -specs=/usr/lib/rpm/OpenCloudOS/OpenCloudOS-hardened-ld -Wl,--build-id=sha1 -O2 -flto=auto -ffat-lto-objects -fexceptions -g -grecord-gcc-switches -pipe -Wall -Werror=format-security -Wp,-D_FORTIFY_SOURCE=2 -Wp,-D_GLIBCXX_ASSERTIONS -specs=/usr/lib/rpm/OpenCloudOS/OpenCloudOS-hardened-cc1 -fstack-protector-strong -mbranch-protection=standard -fasynchronous-unwind-tables -fstack-clash-protection build/temp.linux-aarch64-cpython-311/uvloop/loop.o -L/usr/lib64 -luv -lrt -lpthread -o build/lib.linux-aarch64-cpython-311/uvloop/loop.cpython-311-aarch64-linux-gnu.so
+ RPM_EC=0
++ jobs -p
+ exit 0
Executing(%install): /bin/sh -e /var/tmp/rpm-tmp.NwZ5wu
+ umask 022
+ cd /builddir/build/BUILD
+ PYTHONPATH=:/usr/lib/python3.10/site-packages/:/usr/lib64/python3.10/site-packages/
+ export PYTHONPATH
+ '[' /builddir/build/BUILDROOT/python-uvloop-0.17.0-4.ocs23.aarch64 '!=' / ']'
+ rm -rf /builddir/build/BUILDROOT/python-uvloop-0.17.0-4.ocs23.aarch64
++ dirname /builddir/build/BUILDROOT/python-uvloop-0.17.0-4.ocs23.aarch64
+ mkdir -p /builddir/build/BUILDROOT
+ mkdir /builddir/build/BUILDROOT/python-uvloop-0.17.0-4.ocs23.aarch64
+ cd uvloop-0.17.0
+ CFLAGS='-O2 -flto=auto -ffat-lto-objects -fexceptions -g -grecord-gcc-switches -pipe -Wall -Werror=format-security -Wp,-D_FORTIFY_SOURCE=2 -Wp,-D_GLIBCXX_ASSERTIONS -specs=/usr/lib/rpm/OpenCloudOS/OpenCloudOS-hardened-cc1 -fstack-protector-strong  -mbranch-protection=standard -fasynchronous-unwind-tables -fstack-clash-protection'
+ LDFLAGS='-Wl,-z,relro -Wl,--as-needed  -Wl,-z,now -specs=/usr/lib/rpm/OpenCloudOS/OpenCloudOS-hardened-ld  -Wl,--build-id=sha1'
+ /usr/bin/python3 setup.py install -O1 --skip-build --root /builddir/build/BUILDROOT/python-uvloop-0.17.0-4.ocs23.aarch64
running install
/usr/lib/python3.11/site-packages/setuptools/command/install.py:34: SetuptoolsDeprecationWarning: setup.py install is deprecated. Use build and pip and other standards-based tools.
  warnings.warn(
running install_lib
creating /builddir/build/BUILDROOT/python-uvloop-0.17.0-4.ocs23.aarch64/usr
creating /builddir/build/BUILDROOT/python-uvloop-0.17.0-4.ocs23.aarch64/usr/lib64
creating /builddir/build/BUILDROOT/python-uvloop-0.17.0-4.ocs23.aarch64/usr/lib64/python3.11
creating /builddir/build/BUILDROOT/python-uvloop-0.17.0-4.ocs23.aarch64/usr/lib64/python3.11/site-packages
creating /builddir/build/BUILDROOT/python-uvloop-0.17.0-4.ocs23.aarch64/usr/lib64/python3.11/site-packages/uvloop
copying build/lib.linux-aarch64-cpython-311/uvloop/loop.c -> /builddir/build/BUILDROOT/python-uvloop-0.17.0-4.ocs23.aarch64/usr/lib64/python3.11/site-packages/uvloop
copying build/lib.linux-aarch64-cpython-311/uvloop/_version.py -> /builddir/build/BUILDROOT/python-uvloop-0.17.0-4.ocs23.aarch64/usr/lib64/python3.11/site-packages/uvloop
copying build/lib.linux-aarch64-cpython-311/uvloop/errors.pyx -> /builddir/build/BUILDROOT/python-uvloop-0.17.0-4.ocs23.aarch64/usr/lib64/python3.11/site-packages/uvloop
copying build/lib.linux-aarch64-cpython-311/uvloop/server.pyx -> /builddir/build/BUILDROOT/python-uvloop-0.17.0-4.ocs23.aarch64/usr/lib64/python3.11/site-packages/uvloop
copying build/lib.linux-aarch64-cpython-311/uvloop/py.typed -> /builddir/build/BUILDROOT/python-uvloop-0.17.0-4.ocs23.aarch64/usr/lib64/python3.11/site-packages/uvloop
copying build/lib.linux-aarch64-cpython-311/uvloop/request.pyx -> /builddir/build/BUILDROOT/python-uvloop-0.17.0-4.ocs23.aarch64/usr/lib64/python3.11/site-packages/uvloop
copying build/lib.linux-aarch64-cpython-311/uvloop/request.pxd -> /builddir/build/BUILDROOT/python-uvloop-0.17.0-4.ocs23.aarch64/usr/lib64/python3.11/site-packages/uvloop
copying build/lib.linux-aarch64-cpython-311/uvloop/_noop.py -> /builddir/build/BUILDROOT/python-uvloop-0.17.0-4.ocs23.aarch64/usr/lib64/python3.11/site-packages/uvloop
copying build/lib.linux-aarch64-cpython-311/uvloop/dns.pyx -> /builddir/build/BUILDROOT/python-uvloop-0.17.0-4.ocs23.aarch64/usr/lib64/python3.11/site-packages/uvloop
copying build/lib.linux-aarch64-cpython-311/uvloop/cbhandles.pxd -> /builddir/build/BUILDROOT/python-uvloop-0.17.0-4.ocs23.aarch64/usr/lib64/python3.11/site-packages/uvloop
copying build/lib.linux-aarch64-cpython-311/uvloop/loop.pxd -> /builddir/build/BUILDROOT/python-uvloop-0.17.0-4.ocs23.aarch64/usr/lib64/python3.11/site-packages/uvloop
copying build/lib.linux-aarch64-cpython-311/uvloop/sslproto.pyx -> /builddir/build/BUILDROOT/python-uvloop-0.17.0-4.ocs23.aarch64/usr/lib64/python3.11/site-packages/uvloop
copying build/lib.linux-aarch64-cpython-311/uvloop/loop.cpython-311-aarch64-linux-gnu.so -> /builddir/build/BUILDROOT/python-uvloop-0.17.0-4.ocs23.aarch64/usr/lib64/python3.11/site-packages/uvloop
creating /builddir/build/BUILDROOT/python-uvloop-0.17.0-4.ocs23.aarch64/usr/lib64/python3.11/site-packages/uvloop/includes
copying build/lib.linux-aarch64-cpython-311/uvloop/includes/fork_handler.h -> /builddir/build/BUILDROOT/python-uvloop-0.17.0-4.ocs23.aarch64/usr/lib64/python3.11/site-packages/uvloop/includes
copying build/lib.linux-aarch64-cpython-311/uvloop/includes/uv.pxd -> /builddir/build/BUILDROOT/python-uvloop-0.17.0-4.ocs23.aarch64/usr/lib64/python3.11/site-packages/uvloop/includes
copying build/lib.linux-aarch64-cpython-311/uvloop/includes/flowcontrol.pxd -> /builddir/build/BUILDROOT/python-uvloop-0.17.0-4.ocs23.aarch64/usr/lib64/python3.11/site-packages/uvloop/includes
copying build/lib.linux-aarch64-cpython-311/uvloop/includes/stdlib.pxi -> /builddir/build/BUILDROOT/python-uvloop-0.17.0-4.ocs23.aarch64/usr/lib64/python3.11/site-packages/uvloop/includes
copying build/lib.linux-aarch64-cpython-311/uvloop/includes/python.pxd -> /builddir/build/BUILDROOT/python-uvloop-0.17.0-4.ocs23.aarch64/usr/lib64/python3.11/site-packages/uvloop/includes
copying build/lib.linux-aarch64-cpython-311/uvloop/includes/compat.h -> /builddir/build/BUILDROOT/python-uvloop-0.17.0-4.ocs23.aarch64/usr/lib64/python3.11/site-packages/uvloop/includes
copying build/lib.linux-aarch64-cpython-311/uvloop/includes/system.pxd -> /builddir/build/BUILDROOT/python-uvloop-0.17.0-4.ocs23.aarch64/usr/lib64/python3.11/site-packages/uvloop/includes
copying build/lib.linux-aarch64-cpython-311/uvloop/includes/consts.pxi -> /builddir/build/BUILDROOT/python-uvloop-0.17.0-4.ocs23.aarch64/usr/lib64/python3.11/site-packages/uvloop/includes
copying build/lib.linux-aarch64-cpython-311/uvloop/includes/debug.pxd -> /builddir/build/BUILDROOT/python-uvloop-0.17.0-4.ocs23.aarch64/usr/lib64/python3.11/site-packages/uvloop/includes
copying build/lib.linux-aarch64-cpython-311/uvloop/includes/debug.h -> /builddir/build/BUILDROOT/python-uvloop-0.17.0-4.ocs23.aarch64/usr/lib64/python3.11/site-packages/uvloop/includes
copying build/lib.linux-aarch64-cpython-311/uvloop/includes/__init__.py -> /builddir/build/BUILDROOT/python-uvloop-0.17.0-4.ocs23.aarch64/usr/lib64/python3.11/site-packages/uvloop/includes
copying build/lib.linux-aarch64-cpython-311/uvloop/cbhandles.pyx -> /builddir/build/BUILDROOT/python-uvloop-0.17.0-4.ocs23.aarch64/usr/lib64/python3.11/site-packages/uvloop
copying build/lib.linux-aarch64-cpython-311/uvloop/pseudosock.pyx -> /builddir/build/BUILDROOT/python-uvloop-0.17.0-4.ocs23.aarch64/usr/lib64/python3.11/site-packages/uvloop
copying build/lib.linux-aarch64-cpython-311/uvloop/server.pxd -> /builddir/build/BUILDROOT/python-uvloop-0.17.0-4.ocs23.aarch64/usr/lib64/python3.11/site-packages/uvloop
copying build/lib.linux-aarch64-cpython-311/uvloop/_testbase.py -> /builddir/build/BUILDROOT/python-uvloop-0.17.0-4.ocs23.aarch64/usr/lib64/python3.11/site-packages/uvloop
creating /builddir/build/BUILDROOT/python-uvloop-0.17.0-4.ocs23.aarch64/usr/lib64/python3.11/site-packages/uvloop/handles
copying build/lib.linux-aarch64-cpython-311/uvloop/handles/timer.pxd -> /builddir/build/BUILDROOT/python-uvloop-0.17.0-4.ocs23.aarch64/usr/lib64/python3.11/site-packages/uvloop/handles
copying build/lib.linux-aarch64-cpython-311/uvloop/handles/timer.pyx -> /builddir/build/BUILDROOT/python-uvloop-0.17.0-4.ocs23.aarch64/usr/lib64/python3.11/site-packages/uvloop/handles
copying build/lib.linux-aarch64-cpython-311/uvloop/handles/streamserver.pyx -> /builddir/build/BUILDROOT/python-uvloop-0.17.0-4.ocs23.aarch64/usr/lib64/python3.11/site-packages/uvloop/handles
copying build/lib.linux-aarch64-cpython-311/uvloop/handles/stream.pxd -> /builddir/build/BUILDROOT/python-uvloop-0.17.0-4.ocs23.aarch64/usr/lib64/python3.11/site-packages/uvloop/handles
copying build/lib.linux-aarch64-cpython-311/uvloop/handles/poll.pxd -> /builddir/build/BUILDROOT/python-uvloop-0.17.0-4.ocs23.aarch64/usr/lib64/python3.11/site-packages/uvloop/handles
copying build/lib.linux-aarch64-cpython-311/uvloop/handles/tcp.pyx -> /builddir/build/BUILDROOT/python-uvloop-0.17.0-4.ocs23.aarch64/usr/lib64/python3.11/site-packages/uvloop/handles
copying build/lib.linux-aarch64-cpython-311/uvloop/handles/async_.pyx -> /builddir/build/BUILDROOT/python-uvloop-0.17.0-4.ocs23.aarch64/usr/lib64/python3.11/site-packages/uvloop/handles
copying build/lib.linux-aarch64-cpython-311/uvloop/handles/async_.pxd -> /builddir/build/BUILDROOT/python-uvloop-0.17.0-4.ocs23.aarch64/usr/lib64/python3.11/site-packages/uvloop/handles
copying build/lib.linux-aarch64-cpython-311/uvloop/handles/process.pxd -> /builddir/build/BUILDROOT/python-uvloop-0.17.0-4.ocs23.aarch64/usr/lib64/python3.11/site-packages/uvloop/handles
copying build/lib.linux-aarch64-cpython-311/uvloop/handles/process.pyx -> /builddir/build/BUILDROOT/python-uvloop-0.17.0-4.ocs23.aarch64/usr/lib64/python3.11/site-packages/uvloop/handles
copying build/lib.linux-aarch64-cpython-311/uvloop/handles/handle.pxd -> /builddir/build/BUILDROOT/python-uvloop-0.17.0-4.ocs23.aarch64/usr/lib64/python3.11/site-packages/uvloop/handles
copying build/lib.linux-aarch64-cpython-311/uvloop/handles/tcp.pxd -> /builddir/build/BUILDROOT/python-uvloop-0.17.0-4.ocs23.aarch64/usr/lib64/python3.11/site-packages/uvloop/handles
copying build/lib.linux-aarch64-cpython-311/uvloop/handles/idle.pxd -> /builddir/build/BUILDROOT/python-uvloop-0.17.0-4.ocs23.aarch64/usr/lib64/python3.11/site-packages/uvloop/handles
copying build/lib.linux-aarch64-cpython-311/uvloop/handles/check.pxd -> /builddir/build/BUILDROOT/python-uvloop-0.17.0-4.ocs23.aarch64/usr/lib64/python3.11/site-packages/uvloop/handles
copying build/lib.linux-aarch64-cpython-311/uvloop/handles/streamserver.pxd -> /builddir/build/BUILDROOT/python-uvloop-0.17.0-4.ocs23.aarch64/usr/lib64/python3.11/site-packages/uvloop/handles
copying build/lib.linux-aarch64-cpython-311/uvloop/handles/handle.pyx -> /builddir/build/BUILDROOT/python-uvloop-0.17.0-4.ocs23.aarch64/usr/lib64/python3.11/site-packages/uvloop/handles
copying build/lib.linux-aarch64-cpython-311/uvloop/handles/fsevent.pxd -> /builddir/build/BUILDROOT/python-uvloop-0.17.0-4.ocs23.aarch64/usr/lib64/python3.11/site-packages/uvloop/handles
copying build/lib.linux-aarch64-cpython-311/uvloop/handles/poll.pyx -> /builddir/build/BUILDROOT/python-uvloop-0.17.0-4.ocs23.aarch64/usr/lib64/python3.11/site-packages/uvloop/handles
copying build/lib.linux-aarch64-cpython-311/uvloop/handles/pipe.pyx -> /builddir/build/BUILDROOT/python-uvloop-0.17.0-4.ocs23.aarch64/usr/lib64/python3.11/site-packages/uvloop/handles
copying build/lib.linux-aarch64-cpython-311/uvloop/handles/check.pyx -> /builddir/build/BUILDROOT/python-uvloop-0.17.0-4.ocs23.aarch64/usr/lib64/python3.11/site-packages/uvloop/handles
copying build/lib.linux-aarch64-cpython-311/uvloop/handles/idle.pyx -> /builddir/build/BUILDROOT/python-uvloop-0.17.0-4.ocs23.aarch64/usr/lib64/python3.11/site-packages/uvloop/handles
copying build/lib.linux-aarch64-cpython-311/uvloop/handles/basetransport.pyx -> /builddir/build/BUILDROOT/python-uvloop-0.17.0-4.ocs23.aarch64/usr/lib64/python3.11/site-packages/uvloop/handles
copying build/lib.linux-aarch64-cpython-311/uvloop/handles/fsevent.pyx -> /builddir/build/BUILDROOT/python-uvloop-0.17.0-4.ocs23.aarch64/usr/lib64/python3.11/site-packages/uvloop/handles
copying build/lib.linux-aarch64-cpython-311/uvloop/handles/udp.pyx -> /builddir/build/BUILDROOT/python-uvloop-0.17.0-4.ocs23.aarch64/usr/lib64/python3.11/site-packages/uvloop/handles
copying build/lib.linux-aarch64-cpython-311/uvloop/handles/stream.pyx -> /builddir/build/BUILDROOT/python-uvloop-0.17.0-4.ocs23.aarch64/usr/lib64/python3.11/site-packages/uvloop/handles
copying build/lib.linux-aarch64-cpython-311/uvloop/handles/pipe.pxd -> /builddir/build/BUILDROOT/python-uvloop-0.17.0-4.ocs23.aarch64/usr/lib64/python3.11/site-packages/uvloop/handles
copying build/lib.linux-aarch64-cpython-311/uvloop/handles/udp.pxd -> /builddir/build/BUILDROOT/python-uvloop-0.17.0-4.ocs23.aarch64/usr/lib64/python3.11/site-packages/uvloop/handles
copying build/lib.linux-aarch64-cpython-311/uvloop/handles/basetransport.pxd -> /builddir/build/BUILDROOT/python-uvloop-0.17.0-4.ocs23.aarch64/usr/lib64/python3.11/site-packages/uvloop/handles
copying build/lib.linux-aarch64-cpython-311/uvloop/loop.pyi -> /builddir/build/BUILDROOT/python-uvloop-0.17.0-4.ocs23.aarch64/usr/lib64/python3.11/site-packages/uvloop
copying build/lib.linux-aarch64-cpython-311/uvloop/__init__.py -> /builddir/build/BUILDROOT/python-uvloop-0.17.0-4.ocs23.aarch64/usr/lib64/python3.11/site-packages/uvloop
copying build/lib.linux-aarch64-cpython-311/uvloop/sslproto.pxd -> /builddir/build/BUILDROOT/python-uvloop-0.17.0-4.ocs23.aarch64/usr/lib64/python3.11/site-packages/uvloop
copying build/lib.linux-aarch64-cpython-311/uvloop/lru.pyx -> /builddir/build/BUILDROOT/python-uvloop-0.17.0-4.ocs23.aarch64/usr/lib64/python3.11/site-packages/uvloop
copying build/lib.linux-aarch64-cpython-311/uvloop/loop.pyx -> /builddir/build/BUILDROOT/python-uvloop-0.17.0-4.ocs23.aarch64/usr/lib64/python3.11/site-packages/uvloop
byte-compiling /builddir/build/BUILDROOT/python-uvloop-0.17.0-4.ocs23.aarch64/usr/lib64/python3.11/site-packages/uvloop/_version.py to _version.cpython-311.pyc
byte-compiling /builddir/build/BUILDROOT/python-uvloop-0.17.0-4.ocs23.aarch64/usr/lib64/python3.11/site-packages/uvloop/_noop.py to _noop.cpython-311.pyc
byte-compiling /builddir/build/BUILDROOT/python-uvloop-0.17.0-4.ocs23.aarch64/usr/lib64/python3.11/site-packages/uvloop/includes/__init__.py to __init__.cpython-311.pyc
byte-compiling /builddir/build/BUILDROOT/python-uvloop-0.17.0-4.ocs23.aarch64/usr/lib64/python3.11/site-packages/uvloop/_testbase.py to _testbase.cpython-311.pyc
byte-compiling /builddir/build/BUILDROOT/python-uvloop-0.17.0-4.ocs23.aarch64/usr/lib64/python3.11/site-packages/uvloop/__init__.py to __init__.cpython-311.pyc
writing byte-compilation script '/tmp/tmpy2s6mzb4.py'
/usr/bin/python3 /tmp/tmpy2s6mzb4.py
removing /tmp/tmpy2s6mzb4.py
running install_egg_info
running egg_info
writing uvloop.egg-info/PKG-INFO
writing dependency_links to uvloop.egg-info/dependency_links.txt
writing requirements to uvloop.egg-info/requires.txt
writing top-level names to uvloop.egg-info/top_level.txt
reading manifest file 'uvloop.egg-info/SOURCES.txt'
reading manifest template 'MANIFEST.in'
warning: no files found matching '*' under directory 'vendor/libuv'
warning: no previously-included files matching '*' found under directory 'vendor/libuv/.git'
warning: no previously-included files matching '*' found under directory 'vendor/libuv/docs'
warning: no previously-included files matching '*' found under directory 'vendor/libuv/img'
adding license file 'LICENSE-APACHE'
adding license file 'LICENSE-MIT'
writing manifest file 'uvloop.egg-info/SOURCES.txt'
Copying uvloop.egg-info to /builddir/build/BUILDROOT/python-uvloop-0.17.0-4.ocs23.aarch64/usr/lib64/python3.11/site-packages/uvloop-0.17.0-py3.11.egg-info
running install_scripts
+ rm -rfv /builddir/build/BUILDROOT/python-uvloop-0.17.0-4.ocs23.aarch64/usr/bin/__pycache__
+ rm -vf /builddir/build/BUILDROOT/python-uvloop-0.17.0-4.ocs23.aarch64/usr/lib64/python3.11/site-packages/uvloop/_testbase.py
removed '/builddir/build/BUILDROOT/python-uvloop-0.17.0-4.ocs23.aarch64/usr/lib64/python3.11/site-packages/uvloop/_testbase.py'
+ rm -vf /builddir/build/BUILDROOT/python-uvloop-0.17.0-4.ocs23.aarch64/usr/lib64/python3.11/site-packages/uvloop/__pycache__/_testbase.cpython-311.opt-1.pyc /builddir/build/BUILDROOT/python-uvloop-0.17.0-4.ocs23.aarch64/usr/lib64/python3.11/site-packages/uvloop/__pycache__/_testbase.cpython-311.pyc
removed '/builddir/build/BUILDROOT/python-uvloop-0.17.0-4.ocs23.aarch64/usr/lib64/python3.11/site-packages/uvloop/__pycache__/_testbase.cpython-311.opt-1.pyc'
removed '/builddir/build/BUILDROOT/python-uvloop-0.17.0-4.ocs23.aarch64/usr/lib64/python3.11/site-packages/uvloop/__pycache__/_testbase.cpython-311.pyc'
+ /usr/bin/find-debuginfo -j8 --strict-build-id -m -i --build-id-seed 0.17.0-4.ocs23 --unique-debug-suffix -0.17.0-4.ocs23.aarch64 --unique-debug-src-base python-uvloop-0.17.0-4.ocs23.aarch64 -S debugsourcefiles.list /builddir/build/BUILD/uvloop-0.17.0
extracting debug info from /builddir/build/BUILDROOT/python-uvloop-0.17.0-4.ocs23.aarch64/usr/lib64/python3.11/site-packages/uvloop/loop.cpython-311-aarch64-linux-gnu.so
14254 blocks
+ /usr/lib/rpm/check-buildroot
+ /usr/lib/rpm/OpenCloudOS/brp-ldconfig
+ /usr/lib/rpm/brp-compress
+ /usr/lib/rpm/OpenCloudOS/brp-strip-lto /usr/bin/strip
+ /usr/lib/rpm/brp-strip-static-archive /usr/bin/strip
+ /usr/lib/rpm/check-rpaths
+ /usr/lib/rpm/OpenCloudOS/brp-mangle-shebangs
+ /usr/lib/rpm/OpenCloudOS/brp-python-bytecompile '' 1 0
Bytecompiling .py files below /builddir/build/BUILDROOT/python-uvloop-0.17.0-4.ocs23.aarch64/usr/lib/debug/usr/lib64/python3.11 using python3.11
Bytecompiling .py files below /builddir/build/BUILDROOT/python-uvloop-0.17.0-4.ocs23.aarch64/usr/lib64/python3.11 using python3.11
+ /usr/lib/rpm/OpenCloudOS/brp-python-hardlink
Executing(%check): /bin/sh -e /var/tmp/rpm-tmp.YLmblP
+ umask 022
+ cd /builddir/build/BUILD
+ PYTHONPATH=:/usr/lib/python3.10/site-packages/:/usr/lib64/python3.10/site-packages/
+ export PYTHONPATH
+ CFLAGS='-O2 -flto=auto -ffat-lto-objects -fexceptions -g -grecord-gcc-switches -pipe -Wall -Werror=format-security -Wp,-D_FORTIFY_SOURCE=2 -Wp,-D_GLIBCXX_ASSERTIONS -specs=/usr/lib/rpm/OpenCloudOS/OpenCloudOS-hardened-cc1 -fstack-protector-strong  -mbranch-protection=standard -fasynchronous-unwind-tables -fstack-clash-protection'
+ export CFLAGS
+ CXXFLAGS='-O2 -flto=auto -ffat-lto-objects -fexceptions -g -grecord-gcc-switches -pipe -Wall -Werror=format-security -Wp,-D_FORTIFY_SOURCE=2 -Wp,-D_GLIBCXX_ASSERTIONS -specs=/usr/lib/rpm/OpenCloudOS/OpenCloudOS-hardened-cc1 -fstack-protector-strong  -mbranch-protection=standard -fasynchronous-unwind-tables -fstack-clash-protection'
+ export CXXFLAGS
+ FFLAGS='-O2 -flto=auto -ffat-lto-objects -fexceptions -g -grecord-gcc-switches -pipe -Wall -Werror=format-security -Wp,-D_FORTIFY_SOURCE=2 -Wp,-D_GLIBCXX_ASSERTIONS -specs=/usr/lib/rpm/OpenCloudOS/OpenCloudOS-hardened-cc1 -fstack-protector-strong  -mbranch-protection=standard -fasynchronous-unwind-tables -fstack-clash-protection -I/usr/lib64/gfortran/modules'
+ export FFLAGS
+ FCFLAGS='-O2 -flto=auto -ffat-lto-objects -fexceptions -g -grecord-gcc-switches -pipe -Wall -Werror=format-security -Wp,-D_FORTIFY_SOURCE=2 -Wp,-D_GLIBCXX_ASSERTIONS -specs=/usr/lib/rpm/OpenCloudOS/OpenCloudOS-hardened-cc1 -fstack-protector-strong  -mbranch-protection=standard -fasynchronous-unwind-tables -fstack-clash-protection -I/usr/lib64/gfortran/modules'
+ export FCFLAGS
+ LDFLAGS='-Wl,-z,relro -Wl,--as-needed  -Wl,-z,now -specs=/usr/lib/rpm/OpenCloudOS/OpenCloudOS-hardened-ld  -Wl,--build-id=sha1'
+ export LDFLAGS
+ LT_SYS_LIBRARY_PATH=/usr/lib64:
+ export LT_SYS_LIBRARY_PATH
+ CC=gcc
+ export CC
+ CXX=g++
+ export CXX
+ cd uvloop-0.17.0
+ sed -i 's:import sys:import sys\nsys.path.append\(os.path.abspath\(os.path.dirname\(__file__\)\)\)\n:' tests/__main__.py
+ /usr/bin/python3 setup.py test
running test
running egg_info
WARNING: Testing via this command is deprecated and will be removed in a future version. Users looking for a generic test entry point independent of test runner are encouraged to use tox.
writing uvloop.egg-info/PKG-INFO
writing dependency_links to uvloop.egg-info/dependency_links.txt
writing requirements to uvloop.egg-info/requires.txt
writing top-level names to uvloop.egg-info/top_level.txt
reading manifest file 'uvloop.egg-info/SOURCES.txt'
reading manifest template 'MANIFEST.in'
warning: no files found matching '*' under directory 'vendor/libuv'
warning: no previously-included files matching '*' found under directory 'vendor/libuv/.git'
warning: no previously-included files matching '*' found under directory 'vendor/libuv/docs'
warning: no previously-included files matching '*' found under directory 'vendor/libuv/img'
adding license file 'LICENSE-APACHE'
adding license file 'LICENSE-MIT'
writing manifest file 'uvloop.egg-info/SOURCES.txt'
running build_ext
copying build/lib.linux-aarch64-cpython-311/uvloop/loop.cpython-311-aarch64-linux-gnu.so -> uvloop
test_dealloc_1 (tests.test_dealloc.TestDealloc.test_dealloc_1) ... ok
test_executors_process_pool_01 (tests.test_executors.TestAIOExecutors.test_executors_process_pool_01) ... ok
test_executors_process_pool_02 (tests.test_executors.TestAIOExecutors.test_executors_process_pool_02) ... ok
test_executors_process_pool_01 (tests.test_executors.TestUVExecutors.test_executors_process_pool_01) ... ok
test_executors_process_pool_02 (tests.test_executors.TestUVExecutors.test_executors_process_pool_02) ... ok
test_fs_event_change (tests.test_fs_event.Test_UV_FS_EVENT_CHANGE.test_fs_event_change) ... ok
test_fs_event_rename (tests.test_fs_event.Test_UV_FS_EVENT_RENAME.test_fs_event_rename) ... ok
test_signals_and_custom_handler_1 (tests.test_signals.Test_AIO_Signals.test_signals_and_custom_handler_1) ... Unknown child process pid 636, will report returncode 255
ok
test_signals_coro_callback (tests.test_signals.Test_AIO_Signals.test_signals_coro_callback) ... ok
test_signals_fork_in_thread (tests.test_signals.Test_AIO_Signals.test_signals_fork_in_thread) ... ok
test_signals_invalid_signal (tests.test_signals.Test_AIO_Signals.test_signals_invalid_signal) ... ok
test_signals_sigint_and_custom_handler (tests.test_signals.Test_AIO_Signals.test_signals_sigint_and_custom_handler) ... ok
test_signals_sigint_pycode_continue (tests.test_signals.Test_AIO_Signals.test_signals_sigint_pycode_continue) ... ok
test_signals_sigint_pycode_stop (tests.test_signals.Test_AIO_Signals.test_signals_sigint_pycode_stop) ... ok
test_signals_sigint_uvcode (tests.test_signals.Test_AIO_Signals.test_signals_sigint_uvcode) ... ok
test_signals_sigint_uvcode_two_loop_runs (tests.test_signals.Test_AIO_Signals.test_signals_sigint_uvcode_two_loop_runs) ... ok
test_signals_wakeup_fd_unchanged (tests.test_signals.Test_AIO_Signals.test_signals_wakeup_fd_unchanged) ... ok
test_asyncio_add_watcher_SIGCHLD_nop (tests.test_signals.Test_UV_Signals.test_asyncio_add_watcher_SIGCHLD_nop) ... skipped 'in 3.8 a ThreadedChildWatcher is used (does not rely on SIGCHLD)'
test_signals_and_custom_handler_1 (tests.test_signals.Test_UV_Signals.test_signals_and_custom_handler_1) ... ok
test_signals_coro_callback (tests.test_signals.Test_UV_Signals.test_signals_coro_callback) ... ok
test_signals_fork_in_thread (tests.test_signals.Test_UV_Signals.test_signals_fork_in_thread) ... ok
test_signals_invalid_signal (tests.test_signals.Test_UV_Signals.test_signals_invalid_signal) ... ok
test_signals_no_SIGCHLD (tests.test_signals.Test_UV_Signals.test_signals_no_SIGCHLD) ... ok
test_signals_sigint_and_custom_handler (tests.test_signals.Test_UV_Signals.test_signals_sigint_and_custom_handler) ... ok
test_signals_sigint_pycode_continue (tests.test_signals.Test_UV_Signals.test_signals_sigint_pycode_continue) ... ok
test_signals_sigint_pycode_stop (tests.test_signals.Test_UV_Signals.test_signals_sigint_pycode_stop) ... ok
test_signals_sigint_uvcode (tests.test_signals.Test_UV_Signals.test_signals_sigint_uvcode) ... ok
test_signals_sigint_uvcode_two_loop_runs (tests.test_signals.Test_UV_Signals.test_signals_sigint_uvcode_two_loop_runs) ... ok
test_signals_wakeup_fd_unchanged (tests.test_signals.Test_UV_Signals.test_signals_wakeup_fd_unchanged) ... ok
test_aiohttp_basic_1 (tests.test_aiohttp.Test_AIO_AioHTTP.test_aiohttp_basic_1) ... 127.0.0.1 [15/Sep/2023:06:54:51 +0000] "GET / HTTP/1.1" 200 180156 "-" "Python/3.11 aiohttp/3.8.4"
127.0.0.1 [15/Sep/2023:06:54:51 +0000] "GET / HTTP/1.1" 200 180156 "-" "Python/3.11 aiohttp/3.8.4"
ok
test_aiohttp_graceful_shutdown (tests.test_aiohttp.Test_AIO_AioHTTP.test_aiohttp_graceful_shutdown) ... 127.0.0.1 [15/Sep/2023:06:54:51 +0000] "GET / HTTP/1.1" 101 0 "-" "Python/3.11 aiohttp/3.8.4"
ok
test_aiohttp_basic_1 (tests.test_aiohttp.Test_UV_AioHTTP.test_aiohttp_basic_1) ... 127.0.0.1 [15/Sep/2023:06:54:51 +0000] "GET / HTTP/1.1" 200 180156 "-" "Python/3.11 aiohttp/3.8.4"
127.0.0.1 [15/Sep/2023:06:54:51 +0000] "GET / HTTP/1.1" 200 180156 "-" "Python/3.11 aiohttp/3.8.4"
ok
test_aiohttp_graceful_shutdown (tests.test_aiohttp.Test_UV_AioHTTP.test_aiohttp_graceful_shutdown) ... 127.0.0.1 [15/Sep/2023:06:54:52 +0000] "GET / HTTP/1.1" 101 0 "-" "Python/3.11 aiohttp/3.8.4"
ok
test_duplicate_methods (tests.test_testbase.TestBaseTest.test_duplicate_methods) ... ok
test_duplicate_methods_parent_1 (tests.test_testbase.TestBaseTest.test_duplicate_methods_parent_1) ... ok
test_duplicate_methods_parent_2 (tests.test_testbase.TestBaseTest.test_duplicate_methods_parent_2) ... ok
test_read_pipe (tests.test_pipes.Test_AIO_Pipes.test_read_pipe) ... ok
test_read_pty_output (tests.test_pipes.Test_AIO_Pipes.test_read_pty_output) ... ok
test_write_buffer_full (tests.test_pipes.Test_AIO_Pipes.test_write_buffer_full) ... ok
test_write_pipe (tests.test_pipes.Test_AIO_Pipes.test_write_pipe) ... ok
test_write_pipe_disconnect_on_close (tests.test_pipes.Test_AIO_Pipes.test_write_pipe_disconnect_on_close) ... ok
test_write_pty (tests.test_pipes.Test_AIO_Pipes.test_write_pty) ... ok
test_read_pipe (tests.test_pipes.Test_UV_Pipes.test_read_pipe) ... ok
test_read_pty_output (tests.test_pipes.Test_UV_Pipes.test_read_pty_output) ... ok
test_write_buffer_full (tests.test_pipes.Test_UV_Pipes.test_write_buffer_full) ... ok
test_write_pipe (tests.test_pipes.Test_UV_Pipes.test_write_pipe) ... ok
test_write_pipe_disconnect_on_close (tests.test_pipes.Test_UV_Pipes.test_write_pipe_disconnect_on_close) ... ok
test_write_pty (tests.test_pipes.Test_UV_Pipes.test_write_pty) ... ok
test_create_unix_connection_2 (tests.test_unix.Test_AIO_Unix.test_create_unix_connection_2) ... ok
test_create_unix_connection_3 (tests.test_unix.Test_AIO_Unix.test_create_unix_connection_3) ... ok
test_create_unix_connection_4 (tests.test_unix.Test_AIO_Unix.test_create_unix_connection_4) ... ok
test_create_unix_connection_5 (tests.test_unix.Test_AIO_Unix.test_create_unix_connection_5) ... ok
test_create_unix_connection_6 (tests.test_unix.Test_AIO_Unix.test_create_unix_connection_6) ... ok
test_create_unix_connection_open_con_sock (tests.test_unix.Test_AIO_Unix.test_create_unix_connection_open_con_sock) ... ok
test_create_unix_connection_open_unix_con_addr (tests.test_unix.Test_AIO_Unix.test_create_unix_connection_open_unix_con_addr) ... ok
test_create_unix_connection_open_unix_con_sock (tests.test_unix.Test_AIO_Unix.test_create_unix_connection_open_unix_con_sock) ... ok
test_create_unix_server_1 (tests.test_unix.Test_AIO_Unix.test_create_unix_server_1) ... ok
test_create_unix_server_2 (tests.test_unix.Test_AIO_Unix.test_create_unix_server_2) ... ok
test_create_unix_server_3 (tests.test_unix.Test_AIO_Unix.test_create_unix_server_3) ... ok
test_create_unix_server_existing_path_sock (tests.test_unix.Test_AIO_Unix.test_create_unix_server_existing_path_sock) ... ok
test_create_unix_connection_ssl_1 (tests.test_unix.Test_AIO_UnixSSL.test_create_unix_connection_ssl_1) ... /builddir/build/BUILD/uvloop-0.17.0/uvloop/_testbase.py:272: DeprecationWarning: ssl.PROTOCOL_TLS is deprecated
  sslcontext = ssl.SSLContext(ssl.PROTOCOL_TLS)
ok
test_create_unix_server_ssl_1 (tests.test_unix.Test_AIO_UnixSSL.test_create_unix_server_ssl_1) ... ok
test_create_unix_connection_2 (tests.test_unix.Test_UV_Unix.test_create_unix_connection_2) ... ok
test_create_unix_connection_3 (tests.test_unix.Test_UV_Unix.test_create_unix_connection_3) ... ok
test_create_unix_connection_4 (tests.test_unix.Test_UV_Unix.test_create_unix_connection_4) ... ok
test_create_unix_connection_5 (tests.test_unix.Test_UV_Unix.test_create_unix_connection_5) ... ok
test_create_unix_connection_6 (tests.test_unix.Test_UV_Unix.test_create_unix_connection_6) ... ok
test_create_unix_connection_open_con_sock (tests.test_unix.Test_UV_Unix.test_create_unix_connection_open_con_sock) ... ok
test_create_unix_connection_open_unix_con_addr (tests.test_unix.Test_UV_Unix.test_create_unix_connection_open_unix_con_addr) ... ok
test_create_unix_connection_open_unix_con_sock (tests.test_unix.Test_UV_Unix.test_create_unix_connection_open_unix_con_sock) ... ok
test_create_unix_connection_pathlib (tests.test_unix.Test_UV_Unix.test_create_unix_connection_pathlib) ... ok
test_create_unix_server_1 (tests.test_unix.Test_UV_Unix.test_create_unix_server_1) ... ok
test_create_unix_server_2 (tests.test_unix.Test_UV_Unix.test_create_unix_server_2) ... ok
test_create_unix_server_3 (tests.test_unix.Test_UV_Unix.test_create_unix_server_3) ... ok
test_create_unix_server_existing_path_sock (tests.test_unix.Test_UV_Unix.test_create_unix_server_existing_path_sock) ... ok
test_create_unix_server_path_dgram (tests.test_unix.Test_UV_Unix.test_create_unix_server_path_dgram) ... ok
test_create_unix_server_path_stream_bittype (tests.test_unix.Test_UV_Unix.test_create_unix_server_path_stream_bittype) ... ok
test_create_unix_server_pathlib (tests.test_unix.Test_UV_Unix.test_create_unix_server_pathlib) ... ok
test_epollhup (tests.test_unix.Test_UV_Unix.test_epollhup) ... ok
test_transport_fromsock_get_extra_info (tests.test_unix.Test_UV_Unix.test_transport_fromsock_get_extra_info) ... ok
test_create_unix_connection_ssl_1 (tests.test_unix.Test_UV_UnixSSL.test_create_unix_connection_ssl_1) ... ok
test_create_unix_server_ssl_1 (tests.test_unix.Test_UV_UnixSSL.test_create_unix_server_ssl_1) ... ok
test_create_connection_2 (tests.test_tcp.Test_AIO_TCP.test_create_connection_2) ... ok
test_create_connection_3 (tests.test_tcp.Test_AIO_TCP.test_create_connection_3) ... ok
test_create_connection_4 (tests.test_tcp.Test_AIO_TCP.test_create_connection_4) ... ok
test_create_connection_5 (tests.test_tcp.Test_AIO_TCP.test_create_connection_5) ... ok
test_create_connection_6 (tests.test_tcp.Test_AIO_TCP.test_create_connection_6) ... ok
test_create_connection_open_con_addr (tests.test_tcp.Test_AIO_TCP.test_create_connection_open_con_addr) ... ok
test_create_connection_open_con_sock (tests.test_tcp.Test_AIO_TCP.test_create_connection_open_con_sock) ... ok
test_create_server_1 (tests.test_tcp.Test_AIO_TCP.test_create_server_1) ... ok
test_create_server_10 (tests.test_tcp.Test_AIO_TCP.test_create_server_10) ... ok
test_create_server_2 (tests.test_tcp.Test_AIO_TCP.test_create_server_2) ... ok
test_create_server_3 (tests.test_tcp.Test_AIO_TCP.test_create_server_3)
check ephemeral port can be used ... ok
test_create_server_4 (tests.test_tcp.Test_AIO_TCP.test_create_server_4) ... ok
test_create_server_5 (tests.test_tcp.Test_AIO_TCP.test_create_server_5) ... ok
test_create_server_6 (tests.test_tcp.Test_AIO_TCP.test_create_server_6) ... ok
test_create_server_7 (tests.test_tcp.Test_AIO_TCP.test_create_server_7) ... ok
test_create_server_8 (tests.test_tcp.Test_AIO_TCP.test_create_server_8) ... ok
test_create_server_9 (tests.test_tcp.Test_AIO_TCP.test_create_server_9) ... ok
test_resume_writing_write_different_transport (tests.test_tcp.Test_AIO_TCP.test_resume_writing_write_different_transport) ... ok
test_tcp_handle_exception_in_connection_made (tests.test_tcp.Test_AIO_TCP.test_tcp_handle_exception_in_connection_made) ... ok
test_transport_shutdown (tests.test_tcp.Test_AIO_TCP.test_transport_shutdown) ... ok
test_bpo_39951_discard_trailing_data (tests.test_tcp.Test_AIO_TCPSSL.test_bpo_39951_discard_trailing_data) ... skipped 'bpo-39951'
test_connect_timeout_warning (tests.test_tcp.Test_AIO_TCPSSL.test_connect_timeout_warning) ... ok
test_create_connection_memory_leak (tests.test_tcp.Test_AIO_TCPSSL.test_create_connection_memory_leak) ... skipped ''
test_create_connection_ssl_1 (tests.test_tcp.Test_AIO_TCPSSL.test_create_connection_ssl_1) ... /builddir/build/BUILD/uvloop-0.17.0/uvloop/_testbase.py:272: DeprecationWarning: ssl.PROTOCOL_TLS is deprecated
  sslcontext = ssl.SSLContext(ssl.PROTOCOL_TLS)
ok
test_create_connection_ssl_failed_certificate (tests.test_tcp.Test_AIO_TCPSSL.test_create_connection_ssl_failed_certificate) ... skipped ''
test_create_connection_ssl_slow_handshake (tests.test_tcp.Test_AIO_TCPSSL.test_create_connection_ssl_slow_handshake) ... skipped ''
test_create_server_ssl_1 (tests.test_tcp.Test_AIO_TCPSSL.test_create_server_ssl_1) ... ok
test_create_server_ssl_over_ssl (tests.test_tcp.Test_AIO_TCPSSL.test_create_server_ssl_over_ssl) ... skipped 'asyncio does not support SSL over SSL'
test_first_data_after_wakeup (tests.test_tcp.Test_AIO_TCPSSL.test_first_data_after_wakeup) ... skipped ''
test_flush_before_shutdown (tests.test_tcp.Test_AIO_TCPSSL.test_flush_before_shutdown) ... skipped ''
test_handshake_timeout_handler_leak (tests.test_tcp.Test_AIO_TCPSSL.test_handshake_timeout_handler_leak) ... skipped ''
test_remote_shutdown_receives_trailing_data (tests.test_tcp.Test_AIO_TCPSSL.test_remote_shutdown_receives_trailing_data) ... ok
test_renegotiation (tests.test_tcp.Test_AIO_TCPSSL.test_renegotiation) ... skipped 'asyncio does not support renegotiation'
test_shutdown_cleanly (tests.test_tcp.Test_AIO_TCPSSL.test_shutdown_cleanly) ... skipped ''
test_shutdown_timeout (tests.test_tcp.Test_AIO_TCPSSL.test_shutdown_timeout) ... skipped ''
test_shutdown_timeout_handler_leak (tests.test_tcp.Test_AIO_TCPSSL.test_shutdown_timeout_handler_leak) ... ok
test_shutdown_timeout_handler_not_set (tests.test_tcp.Test_AIO_TCPSSL.test_shutdown_timeout_handler_not_set) ... skipped ''
test_shutdown_while_pause_reading (tests.test_tcp.Test_AIO_TCPSSL.test_shutdown_while_pause_reading) ... skipped ''
test_ssl_connect_accepted_socket (tests.test_tcp.Test_AIO_TCPSSL.test_ssl_connect_accepted_socket) ... /builddir/build/BUILD/uvloop-0.17.0/tests/test_tcp.py:1653: DeprecationWarning: ssl.PROTOCOL_TLS is deprecated
  server_context = ssl.SSLContext(proto)
/builddir/build/BUILD/uvloop-0.17.0/tests/test_tcp.py:1659: DeprecationWarning: ssl.PROTOCOL_TLS is deprecated
  client_context = ssl.SSLContext(proto)
ok
test_ssl_handshake_connection_lost (tests.test_tcp.Test_AIO_TCPSSL.test_ssl_handshake_connection_lost) ... ok
test_ssl_handshake_timeout (tests.test_tcp.Test_AIO_TCPSSL.test_ssl_handshake_timeout) ... skipped ''
test_start_tls_client_buf_proto_1 (tests.test_tcp.Test_AIO_TCPSSL.test_start_tls_client_buf_proto_1) ... skipped ''
test_start_tls_client_corrupted_ssl (tests.test_tcp.Test_AIO_TCPSSL.test_start_tls_client_corrupted_ssl) ... skipped ''
test_start_tls_client_reg_proto_1 (tests.test_tcp.Test_AIO_TCPSSL.test_start_tls_client_reg_proto_1) ... skipped ''
test_start_tls_server_1 (tests.test_tcp.Test_AIO_TCPSSL.test_start_tls_server_1) ... skipped ''
test_start_tls_slow_client_cancel (tests.test_tcp.Test_AIO_TCPSSL.test_start_tls_slow_client_cancel) ... skipped ''
test_start_tls_wrong_args (tests.test_tcp.Test_AIO_TCPSSL.test_start_tls_wrong_args) ... skipped ''
test_write_to_closed_transport (tests.test_tcp.Test_AIO_TCPSSL.test_write_to_closed_transport) ... skipped ''
test_connect_accepted_socket (tests.test_tcp.Test_UV_TCP.test_connect_accepted_socket) ... ok
test_connect_accepted_socket_ssl_args (tests.test_tcp.Test_UV_TCP.test_connect_accepted_socket_ssl_args) ... ok
test_create_connection_2 (tests.test_tcp.Test_UV_TCP.test_create_connection_2) ... ok
test_create_connection_3 (tests.test_tcp.Test_UV_TCP.test_create_connection_3) ... ok
test_create_connection_4 (tests.test_tcp.Test_UV_TCP.test_create_connection_4) ... ok
test_create_connection_5 (tests.test_tcp.Test_UV_TCP.test_create_connection_5) ... ok
test_create_connection_6 (tests.test_tcp.Test_UV_TCP.test_create_connection_6) ... ok
test_create_connection_open_con_addr (tests.test_tcp.Test_UV_TCP.test_create_connection_open_con_addr) ... ok
test_create_connection_open_con_sock (tests.test_tcp.Test_UV_TCP.test_create_connection_open_con_sock) ... ok
test_create_connection_wrong_sock (tests.test_tcp.Test_UV_TCP.test_create_connection_wrong_sock) ... ok
test_create_server_1 (tests.test_tcp.Test_UV_TCP.test_create_server_1) ... ok
test_create_server_10 (tests.test_tcp.Test_UV_TCP.test_create_server_10) ... ok
test_create_server_2 (tests.test_tcp.Test_UV_TCP.test_create_server_2) ... ok
test_create_server_3 (tests.test_tcp.Test_UV_TCP.test_create_server_3)
check ephemeral port can be used ... ok
test_create_server_4 (tests.test_tcp.Test_UV_TCP.test_create_server_4) ... ok
test_create_server_5 (tests.test_tcp.Test_UV_TCP.test_create_server_5) ... ok
test_create_server_6 (tests.test_tcp.Test_UV_TCP.test_create_server_6) ... ok
test_create_server_7 (tests.test_tcp.Test_UV_TCP.test_create_server_7) ... ok
test_create_server_8 (tests.test_tcp.Test_UV_TCP.test_create_server_8) ... ok
test_create_server_9 (tests.test_tcp.Test_UV_TCP.test_create_server_9) ... ok
test_create_server_buffered_1 (tests.test_tcp.Test_UV_TCP.test_create_server_buffered_1) ... ok
test_create_server_buffered_2 (tests.test_tcp.Test_UV_TCP.test_create_server_buffered_2) ... ok
test_create_server_float_backlog (tests.test_tcp.Test_UV_TCP.test_create_server_float_backlog) ... ok
test_create_server_stream_bittype (tests.test_tcp.Test_UV_TCP.test_create_server_stream_bittype) ... ok
test_create_server_wrong_sock (tests.test_tcp.Test_UV_TCP.test_create_server_wrong_sock) ... ok
test_flowcontrol_mixin_set_write_limits (tests.test_tcp.Test_UV_TCP.test_flowcontrol_mixin_set_write_limits) ... ok
test_many_small_writes (tests.test_tcp.Test_UV_TCP.test_many_small_writes) ... ok
test_resume_writing_write_different_transport (tests.test_tcp.Test_UV_TCP.test_resume_writing_write_different_transport) ... ok
test_tcp_handle_abort_in_connection_made (tests.test_tcp.Test_UV_TCP.test_tcp_handle_abort_in_connection_made) ... ok
test_tcp_handle_exception_in_connection_made (tests.test_tcp.Test_UV_TCP.test_tcp_handle_exception_in_connection_made) ... ok
test_tcp_handle_unclosed_gc (tests.test_tcp.Test_UV_TCP.test_tcp_handle_unclosed_gc) ... skipped '3.8 has a different method of GCing unclosed streams'
test_transport_get_extra_info (tests.test_tcp.Test_UV_TCP.test_transport_get_extra_info) ... ok
test_transport_shutdown (tests.test_tcp.Test_UV_TCP.test_transport_shutdown) ... ok
test_bpo_39951_discard_trailing_data (tests.test_tcp.Test_UV_TCPSSL.test_bpo_39951_discard_trailing_data) ... ok
test_connect_timeout_warning (tests.test_tcp.Test_UV_TCPSSL.test_connect_timeout_warning) ... ok
test_create_connection_memory_leak (tests.test_tcp.Test_UV_TCPSSL.test_create_connection_memory_leak) ... /builddir/build/BUILD/uvloop-0.17.0/uvloop/_testbase.py:272: DeprecationWarning: ssl.PROTOCOL_TLS is deprecated
  sslcontext = ssl.SSLContext(ssl.PROTOCOL_TLS)
ok
test_create_connection_ssl_1 (tests.test_tcp.Test_UV_TCPSSL.test_create_connection_ssl_1) ... ok
test_create_connection_ssl_failed_certificate (tests.test_tcp.Test_UV_TCPSSL.test_create_connection_ssl_failed_certificate) ... ok
test_create_connection_ssl_slow_handshake (tests.test_tcp.Test_UV_TCPSSL.test_create_connection_ssl_slow_handshake) ... ok
test_create_server_ssl_1 (tests.test_tcp.Test_UV_TCPSSL.test_create_server_ssl_1) ... ok
test_create_server_ssl_over_ssl (tests.test_tcp.Test_UV_TCPSSL.test_create_server_ssl_over_ssl) ... ok
test_first_data_after_wakeup (tests.test_tcp.Test_UV_TCPSSL.test_first_data_after_wakeup) ... ok
test_flush_before_shutdown (tests.test_tcp.Test_UV_TCPSSL.test_flush_before_shutdown) ... /builddir/build/BUILD/uvloop-0.17.0/tests/test_tcp.py:2612: DeprecationWarning: ssl.OP_NO_SSL*/ssl.OP_NO_TLS* options are deprecated
  client_sslctx.options |= ssl.OP_NO_TLSv1_3
ok
test_handshake_timeout_handler_leak (tests.test_tcp.Test_UV_TCPSSL.test_handshake_timeout_handler_leak) ... ok
test_remote_shutdown_receives_trailing_data (tests.test_tcp.Test_UV_TCPSSL.test_remote_shutdown_receives_trailing_data) ... ok
test_renegotiation (tests.test_tcp.Test_UV_TCPSSL.test_renegotiation) ... /builddir/build/BUILD/uvloop-0.17.0/tests/test_tcp.py:2253: DeprecationWarning: ssl.OP_NO_SSL*/ssl.OP_NO_TLS* options are deprecated
  client_sslctx.options |= ssl.OP_NO_TLSv1_3
ok
test_shutdown_cleanly (tests.test_tcp.Test_UV_TCPSSL.test_shutdown_cleanly) ... ok
test_shutdown_timeout (tests.test_tcp.Test_UV_TCPSSL.test_shutdown_timeout) ... ok
test_shutdown_timeout_handler_leak (tests.test_tcp.Test_UV_TCPSSL.test_shutdown_timeout_handler_leak) ... ok
test_shutdown_timeout_handler_not_set (tests.test_tcp.Test_UV_TCPSSL.test_shutdown_timeout_handler_not_set) ... ok
test_shutdown_while_pause_reading (tests.test_tcp.Test_UV_TCPSSL.test_shutdown_while_pause_reading) ... ok
test_ssl_connect_accepted_socket (tests.test_tcp.Test_UV_TCPSSL.test_ssl_connect_accepted_socket) ... /builddir/build/BUILD/uvloop-0.17.0/tests/test_tcp.py:1653: DeprecationWarning: ssl.PROTOCOL_TLS is deprecated
  server_context = ssl.SSLContext(proto)
/builddir/build/BUILD/uvloop-0.17.0/tests/test_tcp.py:1659: DeprecationWarning: ssl.PROTOCOL_TLS is deprecated
  client_context = ssl.SSLContext(proto)
ok
test_ssl_handshake_connection_lost (tests.test_tcp.Test_UV_TCPSSL.test_ssl_handshake_connection_lost) ... ok
test_ssl_handshake_timeout (tests.test_tcp.Test_UV_TCPSSL.test_ssl_handshake_timeout) ... ok
test_start_tls_client_buf_proto_1 (tests.test_tcp.Test_UV_TCPSSL.test_start_tls_client_buf_proto_1) ... ok
test_start_tls_client_corrupted_ssl (tests.test_tcp.Test_UV_TCPSSL.test_start_tls_client_corrupted_ssl) ... ok
test_start_tls_client_reg_proto_1 (tests.test_tcp.Test_UV_TCPSSL.test_start_tls_client_reg_proto_1) ... ok
test_start_tls_server_1 (tests.test_tcp.Test_UV_TCPSSL.test_start_tls_server_1) ... ok
test_start_tls_slow_client_cancel (tests.test_tcp.Test_UV_TCPSSL.test_start_tls_slow_client_cancel) ... ok
test_start_tls_wrong_args (tests.test_tcp.Test_UV_TCPSSL.test_start_tls_wrong_args) ... ok
test_write_to_closed_transport (tests.test_tcp.Test_UV_TCPSSL.test_write_to_closed_transport) ... ok
test_flake8 (tests.test_sourcecode.TestSourceCode.test_flake8) ... skipped 'flake8 module is missing'
test_mypy (tests.test_sourcecode.TestSourceCode.test_mypy) ... skipped 'mypy module is missing'
test_libuv_get_loop_t_ptr (tests.test_libuv_api.Test_UV_libuv.test_libuv_get_loop_t_ptr) ... /usr/lib64/python3.10/site-packages/pyximport/pyximport.py:51: DeprecationWarning: the imp module is deprecated in favour of importlib and slated for removal in Python 3.12; see the module's documentation for alternative uses
  import imp
<frozen importlib._bootstrap>:1047: ImportWarning: PyxImporter.find_spec() not found; falling back to find_module()
<frozen importlib._bootstrap>:673: ImportWarning: PyxLoader.exec_module() not found; falling back to load_module()
<frozen importlib._bootstrap>:1047: ImportWarning: PyxImporter.find_spec() not found; falling back to find_module()
/usr/lib64/python3.10/site-packages/Cython/Compiler/Main.py:369: FutureWarning: Cython directive 'language_level' not set, using 2 for now (Py2). This will change in a later release! File: /builddir/build/BUILD/uvloop-0.17.0/tests/cython_helper.pyx
  tree = Parsing.p_module(s, pxd, full_module_name)
ok
test_libuv_get_version (tests.test_libuv_api.Test_UV_libuv.test_libuv_get_version) ... ok
test_create_datagram_1 (tests.test_udp.Test_AIO_UDP.test_create_datagram_1) ... ok
test_create_datagram_endpoint_addrs_ipv4 (tests.test_udp.Test_AIO_UDP.test_create_datagram_endpoint_addrs_ipv4) ... ok
test_create_datagram_endpoint_addrs_ipv4_nameaddr (tests.test_udp.Test_AIO_UDP.test_create_datagram_endpoint_addrs_ipv4_nameaddr) ... ok
test_create_datagram_endpoint_addrs_ipv6 (tests.test_udp.Test_AIO_UDP.test_create_datagram_endpoint_addrs_ipv6) ... ok
test_create_datagram_endpoint_ipv6_family (tests.test_udp.Test_AIO_UDP.test_create_datagram_endpoint_ipv6_family) ... ok
test_create_datagram_endpoint_reuse_address_error (tests.test_udp.Test_AIO_UDP.test_create_datagram_endpoint_reuse_address_error) ... skipped ''
test_create_datagram_endpoint_reuse_address_warning (tests.test_udp.Test_AIO_UDP.test_create_datagram_endpoint_reuse_address_warning) ... skipped ''
test_create_datagram_endpoint_sock (tests.test_udp.Test_AIO_UDP.test_create_datagram_endpoint_sock) ... ok
test_create_datagram_endpoint_sock_unix_domain (tests.test_udp.Test_AIO_UDP.test_create_datagram_endpoint_sock_unix_domain) ... ok
test_socketpair (tests.test_udp.Test_AIO_UDP.test_socketpair) ... ok
test_create_datagram_1 (tests.test_udp.Test_UV_UDP.test_create_datagram_1) ... ok
test_create_datagram_endpoint_addrs_ipv4 (tests.test_udp.Test_UV_UDP.test_create_datagram_endpoint_addrs_ipv4) ... ok
test_create_datagram_endpoint_addrs_ipv4_nameaddr (tests.test_udp.Test_UV_UDP.test_create_datagram_endpoint_addrs_ipv4_nameaddr) ... ok
test_create_datagram_endpoint_addrs_ipv6 (tests.test_udp.Test_UV_UDP.test_create_datagram_endpoint_addrs_ipv6) ... ok
test_create_datagram_endpoint_ipv6_family (tests.test_udp.Test_UV_UDP.test_create_datagram_endpoint_ipv6_family) ... ok
test_create_datagram_endpoint_reuse_address_error (tests.test_udp.Test_UV_UDP.test_create_datagram_endpoint_reuse_address_error) ... ok
test_create_datagram_endpoint_reuse_address_warning (tests.test_udp.Test_UV_UDP.test_create_datagram_endpoint_reuse_address_warning) ... ok
test_create_datagram_endpoint_sock (tests.test_udp.Test_UV_UDP.test_create_datagram_endpoint_sock) ... ok
test_create_datagram_endpoint_sock_unix_domain (tests.test_udp.Test_UV_UDP.test_create_datagram_endpoint_sock_unix_domain) ... ok
test_create_datagram_endpoint_wrong_sock (tests.test_udp.Test_UV_UDP.test_create_datagram_endpoint_wrong_sock) ... ok
test_send_after_close (tests.test_udp.Test_UV_UDP.test_send_after_close) ... ok
test_socketpair (tests.test_udp.Test_UV_UDP.test_socketpair) ... ok
test_udp_sendto_dns (tests.test_udp.Test_UV_UDP.test_udp_sendto_dns) ... ok
test_cython_coro_is_coroutine (tests.test_cython.TestCythonIntegration.test_cython_coro_is_coroutine) ... ok
test_connect_accepted_socket (tests.test_context.Test_AIO_Context.test_connect_accepted_socket) ... /builddir/build/BUILD/uvloop-0.17.0/uvloop/_testbase.py:272: DeprecationWarning: ssl.PROTOCOL_TLS is deprecated
  sslcontext = ssl.SSLContext(ssl.PROTOCOL_TLS)
ok
test_create_connection_protocol (tests.test_context.Test_AIO_Context.test_create_connection_protocol) ... ok
test_create_server_connection_protocol (tests.test_context.Test_AIO_Context.test_create_server_connection_protocol) ... ok
test_create_server_manual_connection_lost (tests.test_context.Test_AIO_Context.test_create_server_manual_connection_lost) ... skipped 'this seems to be a bug in asyncio'
test_create_server_protocol_factory_context (tests.test_context.Test_AIO_Context.test_create_server_protocol_factory_context) ... ok
test_create_ssl_server_connection_protocol (tests.test_context.Test_AIO_Context.test_create_ssl_server_connection_protocol) ... ok
test_create_ssl_server_manual_connection_lost (tests.test_context.Test_AIO_Context.test_create_ssl_server_manual_connection_lost) ... skipped 'should pass on 3.11'
test_datagram_protocol (tests.test_context.Test_AIO_Context.test_datagram_protocol) ... ok
test_start_tls (tests.test_context.Test_AIO_Context.test_start_tls) ... skipped 'this seems to be a bug in asyncio'
test_subprocess_protocol (tests.test_context.Test_AIO_Context.test_subprocess_protocol) ... ok
test_task_context_1 (tests.test_context.Test_AIO_Context.test_task_context_1) ... ok
test_task_context_2 (tests.test_context.Test_AIO_Context.test_task_context_2) ... ok
test_task_context_3 (tests.test_context.Test_AIO_Context.test_task_context_3) ... ok
test_task_context_4 (tests.test_context.Test_AIO_Context.test_task_context_4) ... ok
test_task_decimal_context (tests.test_context.Test_AIO_Context.test_task_decimal_context) ... ok
test_connect_accepted_socket (tests.test_context.Test_UV_Context.test_connect_accepted_socket) ... ok
test_create_connection_protocol (tests.test_context.Test_UV_Context.test_create_connection_protocol) ... ok
test_create_server_connection_protocol (tests.test_context.Test_UV_Context.test_create_server_connection_protocol) ... ok
test_create_server_manual_connection_lost (tests.test_context.Test_UV_Context.test_create_server_manual_connection_lost) ... ok
test_create_server_protocol_factory_context (tests.test_context.Test_UV_Context.test_create_server_protocol_factory_context) ... ok
test_create_ssl_server_connection_protocol (tests.test_context.Test_UV_Context.test_create_ssl_server_connection_protocol) ... ok
test_create_ssl_server_manual_connection_lost (tests.test_context.Test_UV_Context.test_create_ssl_server_manual_connection_lost) ... ok
test_datagram_protocol (tests.test_context.Test_UV_Context.test_datagram_protocol) ... ok
test_start_tls (tests.test_context.Test_UV_Context.test_start_tls) ... ok
test_subprocess_protocol (tests.test_context.Test_UV_Context.test_subprocess_protocol) ... ok
test_task_context_1 (tests.test_context.Test_UV_Context.test_task_context_1) ... ok
test_task_context_2 (tests.test_context.Test_UV_Context.test_task_context_2) ... ok
test_task_context_3 (tests.test_context.Test_UV_Context.test_task_context_3) ... ok
test_task_context_4 (tests.test_context.Test_UV_Context.test_task_context_4) ... ok
test_task_decimal_context (tests.test_context.Test_UV_Context.test_task_decimal_context) ... ok
test_process (unittest.loader._FailedTest.test_process) ... ERROR
test_spawning_external_process (tests.test_process_spawning.ProcessSpawningTestCollection.test_spawning_external_process)
Test spawning external process (using `popen` system call) that ... ok
test_sock_cancel_add_reader_race (tests.test_sockets.TestAIOSockets.test_sock_cancel_add_reader_race) ... ok
test_sock_send_before_cancel (tests.test_sockets.TestAIOSockets.test_sock_send_before_cancel) ... ok
test_socket_accept_recv_send (tests.test_sockets.TestAIOSockets.test_socket_accept_recv_send) ... ok
test_socket_blocking_error (tests.test_sockets.TestAIOSockets.test_socket_blocking_error) ... ok
test_socket_connect_recv_send (tests.test_sockets.TestAIOSockets.test_socket_connect_recv_send) ... skipped ''
test_socket_failed_connect (tests.test_sockets.TestAIOSockets.test_socket_failed_connect) ... ok
test_socket_fileno (tests.test_sockets.TestAIOSockets.test_socket_fileno) ... ok
test_socket_ipv4_nameaddr (tests.test_sockets.TestAIOSockets.test_socket_ipv4_nameaddr) ... ok
test_socket_ipv6_addr (tests.test_sockets.TestAIOSockets.test_socket_ipv6_addr) ... ok
test_socket_sync_remove_and_immediately_close (tests.test_sockets.TestAIOSockets.test_socket_sync_remove_and_immediately_close) ... ok
test_add_reader_or_writer_transport_fd (tests.test_sockets.TestUVSockets.test_add_reader_or_writer_transport_fd) ... ok
test_pseudosocket (tests.test_sockets.TestUVSockets.test_pseudosocket) ... ok
test_sock_cancel_add_reader_race (tests.test_sockets.TestUVSockets.test_sock_cancel_add_reader_race) ... ok
test_sock_send_before_cancel (tests.test_sockets.TestUVSockets.test_sock_send_before_cancel) ... ok
test_socket_accept_recv_send (tests.test_sockets.TestUVSockets.test_socket_accept_recv_send) ... ok
test_socket_blocking_error (tests.test_sockets.TestUVSockets.test_socket_blocking_error) ... ok
test_socket_cancel_sock_recv_1 (tests.test_sockets.TestUVSockets.test_socket_cancel_sock_recv_1) ... ok
test_socket_cancel_sock_recv_2 (tests.test_sockets.TestUVSockets.test_socket_cancel_sock_recv_2) ... ok
test_socket_cancel_sock_sendall (tests.test_sockets.TestUVSockets.test_socket_cancel_sock_sendall) ... ok
test_socket_close_loop_and_close (tests.test_sockets.TestUVSockets.test_socket_close_loop_and_close) ... Task was destroyed but it is pending!
task: <Task pending name='Task-5492' coro=<<iterable_coroutine without __name__>()> wait_for=<_SyncSocketReaderFuture pending cb=[Task.task_wakeup()]>>
ok
test_socket_close_many_add_readers (tests.test_sockets.TestUVSockets.test_socket_close_many_add_readers) ... ok
test_socket_close_many_remove_writers (tests.test_sockets.TestUVSockets.test_socket_close_many_remove_writers) ... ok
test_socket_close_remove_reader (tests.test_sockets.TestUVSockets.test_socket_close_remove_reader) ... ok
test_socket_close_remove_writer (tests.test_sockets.TestUVSockets.test_socket_close_remove_writer) ... ok
test_socket_connect_and_close (tests.test_sockets.TestUVSockets.test_socket_connect_and_close) ... ok
test_socket_connect_recv_send (tests.test_sockets.TestUVSockets.test_socket_connect_recv_send) ... skipped ''
test_socket_failed_connect (tests.test_sockets.TestUVSockets.test_socket_failed_connect) ... ok
test_socket_fileno (tests.test_sockets.TestUVSockets.test_socket_fileno) ... ok
test_socket_ipv4_nameaddr (tests.test_sockets.TestUVSockets.test_socket_ipv4_nameaddr) ... ok
test_socket_ipv6_addr (tests.test_sockets.TestUVSockets.test_socket_ipv6_addr) ... ok
test_socket_recv_and_close (tests.test_sockets.TestUVSockets.test_socket_recv_and_close) ... ok
test_socket_recv_into_and_close (tests.test_sockets.TestUVSockets.test_socket_recv_into_and_close) ... ok
test_socket_send_and_close (tests.test_sockets.TestUVSockets.test_socket_send_and_close) ... ok
test_socket_sync_remove (tests.test_sockets.TestUVSockets.test_socket_sync_remove) ... ok
test_socket_sync_remove_and_immediately_close (tests.test_sockets.TestUVSockets.test_socket_sync_remove_and_immediately_close) ... ok
test_getaddrinfo_1 (tests.test_dns.Test_AIO_DNS.test_getaddrinfo_1) ... ok
test_getaddrinfo_10 (tests.test_dns.Test_AIO_DNS.test_getaddrinfo_10) ... ok
test_getaddrinfo_11 (tests.test_dns.Test_AIO_DNS.test_getaddrinfo_11) ... ok
test_getaddrinfo_12 (tests.test_dns.Test_AIO_DNS.test_getaddrinfo_12) ... ok
test_getaddrinfo_13 (tests.test_dns.Test_AIO_DNS.test_getaddrinfo_13) ... ok
test_getaddrinfo_14 (tests.test_dns.Test_AIO_DNS.test_getaddrinfo_14) ... ok
test_getaddrinfo_15 (tests.test_dns.Test_AIO_DNS.test_getaddrinfo_15) ... ok
test_getaddrinfo_16 (tests.test_dns.Test_AIO_DNS.test_getaddrinfo_16) ... ok
test_getaddrinfo_17 (tests.test_dns.Test_AIO_DNS.test_getaddrinfo_17) ... ok
test_getaddrinfo_18 (tests.test_dns.Test_AIO_DNS.test_getaddrinfo_18) ... ok
test_getaddrinfo_19 (tests.test_dns.Test_AIO_DNS.test_getaddrinfo_19) ... ok
test_getaddrinfo_2 (tests.test_dns.Test_AIO_DNS.test_getaddrinfo_2) ... ok
test_getaddrinfo_20 (tests.test_dns.Test_AIO_DNS.test_getaddrinfo_20) ... ok
test_getaddrinfo_3 (tests.test_dns.Test_AIO_DNS.test_getaddrinfo_3) ... ok
test_getaddrinfo_4 (tests.test_dns.Test_AIO_DNS.test_getaddrinfo_4) ... ok
test_getaddrinfo_5 (tests.test_dns.Test_AIO_DNS.test_getaddrinfo_5) ... ok
test_getaddrinfo_6 (tests.test_dns.Test_AIO_DNS.test_getaddrinfo_6) ... ok
test_getaddrinfo_7 (tests.test_dns.Test_AIO_DNS.test_getaddrinfo_7) ... ok
test_getaddrinfo_8 (tests.test_dns.Test_AIO_DNS.test_getaddrinfo_8) ... ok
test_getaddrinfo_9 (tests.test_dns.Test_AIO_DNS.test_getaddrinfo_9) ... ok
test_getnameinfo_1 (tests.test_dns.Test_AIO_DNS.test_getnameinfo_1) ... ok
test_getnameinfo_2 (tests.test_dns.Test_AIO_DNS.test_getnameinfo_2) ... ok
test_getnameinfo_3 (tests.test_dns.Test_AIO_DNS.test_getnameinfo_3) ... ok
test_getnameinfo_4 (tests.test_dns.Test_AIO_DNS.test_getnameinfo_4) ... ok
test_getnameinfo_5 (tests.test_dns.Test_AIO_DNS.test_getnameinfo_5) ... ok
test_getaddrinfo_1 (tests.test_dns.Test_UV_DNS.test_getaddrinfo_1) ... ok
test_getaddrinfo_10 (tests.test_dns.Test_UV_DNS.test_getaddrinfo_10) ... ok
test_getaddrinfo_11 (tests.test_dns.Test_UV_DNS.test_getaddrinfo_11) ... ok
test_getaddrinfo_12 (tests.test_dns.Test_UV_DNS.test_getaddrinfo_12) ... ok
test_getaddrinfo_13 (tests.test_dns.Test_UV_DNS.test_getaddrinfo_13) ... ok
test_getaddrinfo_14 (tests.test_dns.Test_UV_DNS.test_getaddrinfo_14) ... ok
test_getaddrinfo_15 (tests.test_dns.Test_UV_DNS.test_getaddrinfo_15) ... ok
test_getaddrinfo_16 (tests.test_dns.Test_UV_DNS.test_getaddrinfo_16) ... ok
test_getaddrinfo_17 (tests.test_dns.Test_UV_DNS.test_getaddrinfo_17) ... ok
test_getaddrinfo_18 (tests.test_dns.Test_UV_DNS.test_getaddrinfo_18) ... ok
test_getaddrinfo_19 (tests.test_dns.Test_UV_DNS.test_getaddrinfo_19) ... ok
test_getaddrinfo_2 (tests.test_dns.Test_UV_DNS.test_getaddrinfo_2) ... ok
test_getaddrinfo_20 (tests.test_dns.Test_UV_DNS.test_getaddrinfo_20) ... ok
test_getaddrinfo_3 (tests.test_dns.Test_UV_DNS.test_getaddrinfo_3) ... ok
test_getaddrinfo_4 (tests.test_dns.Test_UV_DNS.test_getaddrinfo_4) ... ok
test_getaddrinfo_5 (tests.test_dns.Test_UV_DNS.test_getaddrinfo_5) ... ok
test_getaddrinfo_6 (tests.test_dns.Test_UV_DNS.test_getaddrinfo_6) ... ok
test_getaddrinfo_7 (tests.test_dns.Test_UV_DNS.test_getaddrinfo_7) ... ok
test_getaddrinfo_8 (tests.test_dns.Test_UV_DNS.test_getaddrinfo_8) ... ok
test_getaddrinfo_9 (tests.test_dns.Test_UV_DNS.test_getaddrinfo_9) ... ok
test_getaddrinfo_close_loop (tests.test_dns.Test_UV_DNS.test_getaddrinfo_close_loop) ... skipped ''
test_getnameinfo_1 (tests.test_dns.Test_UV_DNS.test_getnameinfo_1) ... ok
test_getnameinfo_2 (tests.test_dns.Test_UV_DNS.test_getnameinfo_2) ... ok
test_getnameinfo_3 (tests.test_dns.Test_UV_DNS.test_getnameinfo_3) ... ok
test_getnameinfo_4 (tests.test_dns.Test_UV_DNS.test_getnameinfo_4) ... ok
test_getnameinfo_5 (tests.test_dns.Test_UV_DNS.test_getnameinfo_5) ... ok
test_call_at (tests.test_base.TestBaseAIO.test_call_at) ... ok
test_call_later_1 (tests.test_base.TestBaseAIO.test_call_later_1) ... ok
test_call_later_2 (tests.test_base.TestBaseAIO.test_call_later_2) ... ok
test_call_later_3 (tests.test_base.TestBaseAIO.test_call_later_3) ... ok
test_call_later_4 (tests.test_base.TestBaseAIO.test_call_later_4) ... ok
test_call_later_negative (tests.test_base.TestBaseAIO.test_call_later_negative) ... ok
test_call_later_rounding (tests.test_base.TestBaseAIO.test_call_later_rounding) ... ok
test_call_soon_1 (tests.test_base.TestBaseAIO.test_call_soon_1) ... ok
test_call_soon_2 (tests.test_base.TestBaseAIO.test_call_soon_2) ... ok
test_call_soon_3 (tests.test_base.TestBaseAIO.test_call_soon_3) ... ok
test_call_soon_base_exc (tests.test_base.TestBaseAIO.test_call_soon_base_exc) ... ok
test_call_soon_threadsafe_safety (tests.test_base.TestBaseAIO.test_call_soon_threadsafe_safety) ... ok
test_calls_debug_reporting (tests.test_base.TestBaseAIO.test_calls_debug_reporting) ... ok
test_check_thread (tests.test_base.TestBaseAIO.test_check_thread) ... ok
test_close (tests.test_base.TestBaseAIO.test_close) ... ok
test_debug_slow_callbacks (tests.test_base.TestBaseAIO.test_debug_slow_callbacks) ... ok
test_debug_slow_task_callbacks (tests.test_base.TestBaseAIO.test_debug_slow_task_callbacks) ... ok
test_debug_slow_timer_callbacks (tests.test_base.TestBaseAIO.test_debug_slow_timer_callbacks) ... ok
test_default_exc_handler_callback (tests.test_base.TestBaseAIO.test_default_exc_handler_callback) ... ok
test_handle_weakref (tests.test_base.TestBaseAIO.test_handle_weakref) ... ok
test_inf_wait_for (tests.test_base.TestBaseAIO.test_inf_wait_for) ... ok
test_now_update (tests.test_base.TestBaseAIO.test_now_update) ... ok
test_run_once_in_executor_plain (tests.test_base.TestBaseAIO.test_run_once_in_executor_plain) ... ok
test_run_until_complete_error (tests.test_base.TestBaseAIO.test_run_until_complete_error) ... ok
test_run_until_complete_keyboard_interrupt (tests.test_base.TestBaseAIO.test_run_until_complete_keyboard_interrupt) ... ok
test_run_until_complete_loop (tests.test_base.TestBaseAIO.test_run_until_complete_loop) ... ok
test_run_until_complete_loop_orphan_future_close_loop (tests.test_base.TestBaseAIO.test_run_until_complete_loop_orphan_future_close_loop) ... ok
test_run_until_complete_type_error (tests.test_base.TestBaseAIO.test_run_until_complete_type_error) ... ok
test_set_debug (tests.test_base.TestBaseAIO.test_set_debug) ... ok
test_set_exc_handler_broken (tests.test_base.TestBaseAIO.test_set_exc_handler_broken) ... ok
test_set_exc_handler_custom (tests.test_base.TestBaseAIO.test_set_exc_handler_custom) ... ok
test_set_task_factory (tests.test_base.TestBaseAIO.test_set_task_factory) ... ok
test_set_task_factory_invalid (tests.test_base.TestBaseAIO.test_set_task_factory_invalid) ... ok
test_set_task_name (tests.test_base.TestBaseAIO.test_set_task_name) ... ok
test_shutdown_asyncgens_01 (tests.test_base.TestBaseAIO.test_shutdown_asyncgens_01) ... ok
test_shutdown_asyncgens_02 (tests.test_base.TestBaseAIO.test_shutdown_asyncgens_02) ... ok
test_shutdown_asyncgens_03 (tests.test_base.TestBaseAIO.test_shutdown_asyncgens_03) ... ok
test_shutdown_default_executor (tests.test_base.TestBaseAIO.test_shutdown_default_executor) ... ok
test_big_call_later_timeout (tests.test_base.TestBaseUV.test_big_call_later_timeout) ... ok
test_call_at (tests.test_base.TestBaseUV.test_call_at) ... ok
test_call_later_1 (tests.test_base.TestBaseUV.test_call_later_1) ... ok
test_call_later_2 (tests.test_base.TestBaseUV.test_call_later_2) ... ok
test_call_later_3 (tests.test_base.TestBaseUV.test_call_later_3) ... ok
test_call_later_4 (tests.test_base.TestBaseUV.test_call_later_4) ... ok
test_call_later_negative (tests.test_base.TestBaseUV.test_call_later_negative) ... ok
test_call_later_rounding (tests.test_base.TestBaseUV.test_call_later_rounding) ... ok
test_call_soon_1 (tests.test_base.TestBaseUV.test_call_soon_1) ... ok
test_call_soon_2 (tests.test_base.TestBaseUV.test_call_soon_2) ... ok
test_call_soon_3 (tests.test_base.TestBaseUV.test_call_soon_3) ... ok
test_call_soon_base_exc (tests.test_base.TestBaseUV.test_call_soon_base_exc) ... ok
test_call_soon_threadsafe_safety (tests.test_base.TestBaseUV.test_call_soon_threadsafe_safety) ... ok
test_calls_debug_reporting (tests.test_base.TestBaseUV.test_calls_debug_reporting) ... ok
test_check_thread (tests.test_base.TestBaseUV.test_check_thread) ... ok
test_close (tests.test_base.TestBaseUV.test_close) ... ok
test_debug_slow_callbacks (tests.test_base.TestBaseUV.test_debug_slow_callbacks) ... ok
test_debug_slow_task_callbacks (tests.test_base.TestBaseUV.test_debug_slow_task_callbacks) ... ok
test_debug_slow_timer_callbacks (tests.test_base.TestBaseUV.test_debug_slow_timer_callbacks) ... ok
test_default_exc_handler_broken (tests.test_base.TestBaseUV.test_default_exc_handler_broken) ... ok
test_default_exc_handler_callback (tests.test_base.TestBaseUV.test_default_exc_handler_callback) ... ok
test_handle_weakref (tests.test_base.TestBaseUV.test_handle_weakref) ... ok
test_inf_wait_for (tests.test_base.TestBaseUV.test_inf_wait_for) ... ok
test_loop_call_later_handle_cancelled (tests.test_base.TestBaseUV.test_loop_call_later_handle_cancelled) ... ok
test_loop_call_later_handle_when (tests.test_base.TestBaseUV.test_loop_call_later_handle_when) ... ok
test_loop_call_later_handle_when_after_fired (tests.test_base.TestBaseUV.test_loop_call_later_handle_when_after_fired) ... ok
test_loop_call_soon_handle_cancelled (tests.test_base.TestBaseUV.test_loop_call_soon_handle_cancelled) ... ok
test_loop_create_future (tests.test_base.TestBaseUV.test_loop_create_future) ... ok
test_loop_std_files_cloexec (tests.test_base.TestBaseUV.test_loop_std_files_cloexec) ... ok
test_now_update (tests.test_base.TestBaseUV.test_now_update) ... ok
test_run_once_in_executor_plain (tests.test_base.TestBaseUV.test_run_once_in_executor_plain) ... ok
test_run_until_complete_error (tests.test_base.TestBaseUV.test_run_until_complete_error) ... ok
test_run_until_complete_keyboard_interrupt (tests.test_base.TestBaseUV.test_run_until_complete_keyboard_interrupt) ... ok
test_run_until_complete_loop (tests.test_base.TestBaseUV.test_run_until_complete_loop) ... ok
test_run_until_complete_loop_orphan_future_close_loop (tests.test_base.TestBaseUV.test_run_until_complete_loop_orphan_future_close_loop) ... ok
test_run_until_complete_type_error (tests.test_base.TestBaseUV.test_run_until_complete_type_error) ... ok
test_set_debug (tests.test_base.TestBaseUV.test_set_debug) ... ok
test_set_exc_handler_broken (tests.test_base.TestBaseUV.test_set_exc_handler_broken) ... ok
test_set_exc_handler_custom (tests.test_base.TestBaseUV.test_set_exc_handler_custom) ... ok
test_set_task_factory (tests.test_base.TestBaseUV.test_set_task_factory) ... ok
test_set_task_factory_invalid (tests.test_base.TestBaseUV.test_set_task_factory_invalid) ... ok
test_set_task_name (tests.test_base.TestBaseUV.test_set_task_name) ... ok
test_shutdown_asyncgens_01 (tests.test_base.TestBaseUV.test_shutdown_asyncgens_01) ... ok
test_shutdown_asyncgens_02 (tests.test_base.TestBaseUV.test_shutdown_asyncgens_02) ... ok
test_shutdown_asyncgens_03 (tests.test_base.TestBaseUV.test_shutdown_asyncgens_03) ... ok
test_shutdown_default_executor (tests.test_base.TestBaseUV.test_shutdown_default_executor) ... ok
test_get_event_loop_returns_running_loop (tests.test_base.TestPolicy.test_get_event_loop_returns_running_loop) ... ok
test_running_loop_within_a_loop (tests.test_base.TestPolicy.test_running_loop_within_a_loop) ... ok
test_uvloop_policy (tests.test_base.TestPolicy.test_uvloop_policy) ... ok
test_issue39_regression (tests.test_regr1.TestIssue39Regr.test_issue39_regression) ... ok
tests.test_process (unittest.loader._FailedTest.tests.test_process) ... ERROR
======================================================================
ERROR: test_process (unittest.loader._FailedTest.test_process)
----------------------------------------------------------------------
ImportError: Failed to import test module: test_process
Traceback (most recent call last):
  File "/usr/lib64/python3.11/unittest/loader.py", line 154, in loadTestsFromName
    module = __import__(module_name)
             ^^^^^^^^^^^^^^^^^^^^^^^
  File "/builddir/build/BUILD/uvloop-0.17.0/tests/test_process.py", line 14, in <module>
    import psutil
  File "/usr/lib64/python3.10/site-packages/psutil/__init__.py", line 102, in <module>
    from . import _pslinux as _psplatform
  File "/usr/lib64/python3.10/site-packages/psutil/_pslinux.py", line 26, in <module>
    from . import _psutil_linux as cext
ImportError: cannot import name '_psutil_linux' from partially initialized module 'psutil' (most likely due to a circular import) (/usr/lib64/python3.10/site-packages/psutil/__init__.py)
======================================================================
ERROR: tests.test_process (unittest.loader._FailedTest.tests.test_process)
----------------------------------------------------------------------
ImportError: Failed to import test module: tests.test_process
Traceback (most recent call last):
  File "/usr/lib64/python3.11/unittest/loader.py", line 407, in _find_test_path
    module = self._get_module_from_name(name)
             ^^^^^^^^^^^^^^^^^^^^^^^^^^^^^^^^
  File "/usr/lib64/python3.11/unittest/loader.py", line 350, in _get_module_from_name
    __import__(name)
  File "/builddir/build/BUILD/uvloop-0.17.0/tests/test_process.py", line 14, in <module>
    import psutil
  File "/usr/lib64/python3.10/site-packages/psutil/__init__.py", line 102, in <module>
    from . import _pslinux as _psplatform
  File "/usr/lib64/python3.10/site-packages/psutil/_pslinux.py", line 26, in <module>
    from . import _psutil_linux as cext
ImportError: cannot import name '_psutil_linux' from partially initialized module 'psutil' (most likely due to a circular import) (/usr/lib64/python3.10/site-packages/psutil/__init__.py)
----------------------------------------------------------------------
Ran 426 tests in 113.149s
FAILED (errors=2, skipped=33)
Test failed: <unittest.runner.TextTestResult run=426 errors=2 failures=0>
error: Test failed: <unittest.runner.TextTestResult run=426 errors=2 failures=0>
+ :
+ RPM_EC=0
++ jobs -p
+ exit 0
Processing files: python3-uvloop-0.17.0-4.ocs23.aarch64
Executing(%doc): /bin/sh -e /var/tmp/rpm-tmp.2D6D8A
+ umask 022
+ cd /builddir/build/BUILD
+ cd uvloop-0.17.0
+ DOCDIR=/builddir/build/BUILDROOT/python-uvloop-0.17.0-4.ocs23.aarch64/usr/share/doc/python3-uvloop
+ export LC_ALL=C
+ LC_ALL=C
+ export DOCDIR
+ /usr/bin/mkdir -p /builddir/build/BUILDROOT/python-uvloop-0.17.0-4.ocs23.aarch64/usr/share/doc/python3-uvloop
+ cp -pr README.rst /builddir/build/BUILDROOT/python-uvloop-0.17.0-4.ocs23.aarch64/usr/share/doc/python3-uvloop
+ RPM_EC=0
++ jobs -p
+ exit 0
Executing(%license): /bin/sh -e /var/tmp/rpm-tmp.czQUF3
+ umask 022
+ cd /builddir/build/BUILD
+ cd uvloop-0.17.0
+ LICENSEDIR=/builddir/build/BUILDROOT/python-uvloop-0.17.0-4.ocs23.aarch64/usr/share/licenses/python3-uvloop
+ export LC_ALL=C
+ LC_ALL=C
+ export LICENSEDIR
+ /usr/bin/mkdir -p /builddir/build/BUILDROOT/python-uvloop-0.17.0-4.ocs23.aarch64/usr/share/licenses/python3-uvloop
+ cp -pr LICENSE-APACHE /builddir/build/BUILDROOT/python-uvloop-0.17.0-4.ocs23.aarch64/usr/share/licenses/python3-uvloop
+ cp -pr LICENSE-MIT /builddir/build/BUILDROOT/python-uvloop-0.17.0-4.ocs23.aarch64/usr/share/licenses/python3-uvloop
+ RPM_EC=0
++ jobs -p
+ exit 0
Provides: python-uvloop = 0.17.0-4.ocs23 python3-uvloop = 0.17.0-4.ocs23 python3-uvloop(aarch-64) = 0.17.0-4.ocs23 python3.10dist(uvloop) = 0.17 python3.11-uvloop = 0.17.0-4.ocs23 python3.11dist(uvloop) = 0.17 python3dist(uvloop) = 0.17
Requires(rpmlib): rpmlib(CompressedFileNames) <= 3.0.4-1 rpmlib(FileDigests) <= 4.6.0-1 rpmlib(PartialHardlinkSets) <= 4.0.4-1 rpmlib(PayloadFilesHavePrefix) <= 4.0-1
Requires: ld-linux-aarch64.so.1()(64bit) ld-linux-aarch64.so.1(GLIBC_2.17)(64bit) libc.so.6()(64bit) libc.so.6(GLIBC_2.17)(64bit) libuv.so.1()(64bit) python(abi) = 3.11 rtld(GNU_HASH)
Obsoletes: python3.11-uvloop < 0.17.0-4.ocs23
Processing files: python-uvloop-debugsource-0.17.0-4.ocs23.aarch64
Provides: python-uvloop-debugsource = 0.17.0-4.ocs23 python-uvloop-debugsource(aarch-64) = 0.17.0-4.ocs23
Requires(rpmlib): rpmlib(CompressedFileNames) <= 3.0.4-1 rpmlib(FileDigests) <= 4.6.0-1 rpmlib(PayloadFilesHavePrefix) <= 4.0-1
Processing files: python3-uvloop-debuginfo-0.17.0-4.ocs23.aarch64
Provides: debuginfo(build-id) = 92b9a2cc701c19230a4d86f22c900013e686b221 python-uvloop-debuginfo = 0.17.0-4.ocs23 python3-uvloop-debuginfo = 0.17.0-4.ocs23 python3-uvloop-debuginfo(aarch-64) = 0.17.0-4.ocs23 python3.11-uvloop-debuginfo = 0.17.0-4.ocs23
Requires(rpmlib): rpmlib(CompressedFileNames) <= 3.0.4-1 rpmlib(FileDigests) <= 4.6.0-1 rpmlib(PayloadFilesHavePrefix) <= 4.0-1
Recommends: python-uvloop-debugsource(aarch-64) = 0.17.0-4.ocs23
Checking for unpackaged file(s): /usr/lib/rpm/check-files /builddir/build/BUILDROOT/python-uvloop-0.17.0-4.ocs23.aarch64
Wrote: /builddir/build/RPMS/python-uvloop-debugsource-0.17.0-4.ocs23.aarch64.rpm
Wrote: /builddir/build/RPMS/python3-uvloop-0.17.0-4.ocs23.aarch64.rpm
Wrote: /builddir/build/RPMS/python3-uvloop-debuginfo-0.17.0-4.ocs23.aarch64.rpm
Child return code was: 0