Mock Version: 4.1
Mock Version: 4.1
Mock Version: 4.1
ENTER ['do_with_status'](['bash', '--login', '-c', '/usr/bin/rpmbuild -bs --noclean --target aarch64 --nodeps /builddir/build/SPECS/genders.spec'], chrootPath='/var/lib/mock/dist-ocs23-build-15398-1041/root'env={'TERM': 'vt100', 'SHELL': '/bin/bash', 'HOME': '/builddir', 'HOSTNAME': 'mock', 'PATH': '/usr/bin:/bin:/usr/sbin:/sbin', 'PROMPT_COMMAND': 'printf "\\033]0;<mock-chroot>\\007"', 'PS1': '<mock-chroot> \\s-\\v\\$ ', 'LANG': 'C.UTF-8'}shell=Falselogger=<mockbuild.trace_decorator.getLog object at 0xfffcdd205b70>timeout=86400uid=991gid=135user='mockbuild'nspawn_args=[]unshare_net=TrueprintOutput=False)
Executing command: ['bash', '--login', '-c', '/usr/bin/rpmbuild -bs --noclean --target aarch64 --nodeps /builddir/build/SPECS/genders.spec'] with env {'TERM': 'vt100', 'SHELL': '/bin/bash', 'HOME': '/builddir', 'HOSTNAME': 'mock', 'PATH': '/usr/bin:/bin:/usr/sbin:/sbin', 'PROMPT_COMMAND': 'printf "\\033]0;<mock-chroot>\\007"', 'PS1': '<mock-chroot> \\s-\\v\\$ ', 'LANG': 'C.UTF-8'} and shell False
Building target platforms: aarch64
Building for target aarch64
Wrote: /builddir/build/SRPMS/genders-1.28.1-4.ocs23.src.rpm
Child return code was: 0
ENTER ['do_with_status'](['bash', '--login', '-c', '/usr/bin/rpmbuild -bb --noclean --target aarch64 --nodeps /builddir/build/SPECS/genders.spec'], chrootPath='/var/lib/mock/dist-ocs23-build-15398-1041/root'env={'TERM': 'vt100', 'SHELL': '/bin/bash', 'HOME': '/builddir', 'HOSTNAME': 'mock', 'PATH': '/usr/bin:/bin:/usr/sbin:/sbin', 'PROMPT_COMMAND': 'printf "\\033]0;<mock-chroot>\\007"', 'PS1': '<mock-chroot> \\s-\\v\\$ ', 'LANG': 'C.UTF-8'}shell=Falselogger=<mockbuild.trace_decorator.getLog object at 0xfffcdd205b70>timeout=86400uid=991gid=135user='mockbuild'nspawn_args=[]unshare_net=TrueprintOutput=False)
Executing command: ['bash', '--login', '-c', '/usr/bin/rpmbuild -bb --noclean --target aarch64 --nodeps /builddir/build/SPECS/genders.spec'] with env {'TERM': 'vt100', 'SHELL': '/bin/bash', 'HOME': '/builddir', 'HOSTNAME': 'mock', 'PATH': '/usr/bin:/bin:/usr/sbin:/sbin', 'PROMPT_COMMAND': 'printf "\\033]0;<mock-chroot>\\007"', 'PS1': '<mock-chroot> \\s-\\v\\$ ', 'LANG': 'C.UTF-8'} and shell False
Building target platforms: aarch64
Building for target aarch64
Executing(%prep): /bin/sh -e /var/tmp/rpm-tmp.r4hsUU
+ umask 022
+ cd /builddir/build/BUILD
+ cd /builddir/build/BUILD
+ rm -rf genders-genders-1-28-1
+ /usr/lib/rpm/rpmuncompress -x /builddir/build/SOURCES/genders-1-28-1.tar.gz
+ STATUS=0
+ '[' 0 -ne 0 ']'
+ cd genders-genders-1-28-1
+ /usr/bin/chmod -Rf a+rX,u+w,g-w,o-w .
+ /usr/lib/rpm/rpmuncompress /builddir/build/SOURCES/genders-1.18-shebang.patch
+ /usr/bin/patch -p1 -s --fuzz=0 --no-backup-if-mismatch -f
+ RPM_EC=0
++ jobs -p
+ exit 0
Executing(%build): /bin/sh -e /var/tmp/rpm-tmp.CKDkZ8
+ umask 022
+ cd /builddir/build/BUILD
+ CFLAGS='-O2 -flto=auto -ffat-lto-objects -fexceptions -g -grecord-gcc-switches -pipe -Wall -Werror=format-security -Wp,-D_FORTIFY_SOURCE=2 -Wp,-D_GLIBCXX_ASSERTIONS -specs=/usr/lib/rpm/OpenCloudOS/OpenCloudOS-hardened-cc1 -fstack-protector-strong  -mbranch-protection=standard -fasynchronous-unwind-tables -fstack-clash-protection'
+ export CFLAGS
+ CXXFLAGS='-O2 -flto=auto -ffat-lto-objects -fexceptions -g -grecord-gcc-switches -pipe -Wall -Werror=format-security -Wp,-D_FORTIFY_SOURCE=2 -Wp,-D_GLIBCXX_ASSERTIONS -specs=/usr/lib/rpm/OpenCloudOS/OpenCloudOS-hardened-cc1 -fstack-protector-strong  -mbranch-protection=standard -fasynchronous-unwind-tables -fstack-clash-protection'
+ export CXXFLAGS
+ FFLAGS='-O2 -flto=auto -ffat-lto-objects -fexceptions -g -grecord-gcc-switches -pipe -Wall -Werror=format-security -Wp,-D_FORTIFY_SOURCE=2 -Wp,-D_GLIBCXX_ASSERTIONS -specs=/usr/lib/rpm/OpenCloudOS/OpenCloudOS-hardened-cc1 -fstack-protector-strong  -mbranch-protection=standard -fasynchronous-unwind-tables -fstack-clash-protection -I/usr/lib64/gfortran/modules'
+ export FFLAGS
+ FCFLAGS='-O2 -flto=auto -ffat-lto-objects -fexceptions -g -grecord-gcc-switches -pipe -Wall -Werror=format-security -Wp,-D_FORTIFY_SOURCE=2 -Wp,-D_GLIBCXX_ASSERTIONS -specs=/usr/lib/rpm/OpenCloudOS/OpenCloudOS-hardened-cc1 -fstack-protector-strong  -mbranch-protection=standard -fasynchronous-unwind-tables -fstack-clash-protection -I/usr/lib64/gfortran/modules'
+ export FCFLAGS
+ LDFLAGS='-Wl,-z,relro -Wl,--as-needed  -Wl,-z,now -specs=/usr/lib/rpm/OpenCloudOS/OpenCloudOS-hardened-ld  -Wl,--build-id=sha1'
+ export LDFLAGS
+ LT_SYS_LIBRARY_PATH=/usr/lib64:
+ export LT_SYS_LIBRARY_PATH
+ CC=gcc
+ export CC
+ CXX=g++
+ export CXX
+ cd genders-genders-1-28-1
+ export 'CPPFLAGS=-I/usr/lib/jvm/java/include -I/usr/lib/jvm/java/include/linux -I../../../src/libgenders'
+ CPPFLAGS='-I/usr/lib/jvm/java/include -I/usr/lib/jvm/java/include/linux -I../../../src/libgenders'
+ '[' '-flto=auto -ffat-lto-objectsx' '!=' x ']'
++ find . -type f -name configure -print
+ for file in $(find . -type f -name configure -print)
+ /usr/bin/sed -r --in-place=.backup 's/^char \(\*f\) \(\) = /__attribute__ ((used)) char (*f) () = /g' ./configure
+ diff -u ./configure.backup ./configure
+ mv ./configure.backup ./configure
+ /usr/bin/sed -r --in-place=.backup 's/^char \(\*f\) \(\);/__attribute__ ((used)) char (*f) ();/g' ./configure
+ diff -u ./configure.backup ./configure
+ mv ./configure.backup ./configure
+ /usr/bin/sed -r --in-place=.backup 's/^char \$2 \(\);/__attribute__ ((used)) char \$2 ();/g' ./configure
+ diff -u ./configure.backup ./configure
--- ./configure.backup	2020-05-16 03:52:08.000000000 +0800
+++ ./configure	2023-08-04 22:32:11.238899627 +0800
@@ -1864,7 +1864,7 @@
 #ifdef __cplusplus
 extern "C"
 #endif
-char $2 ();
+__attribute__ ((used)) char $2 ();
 /* The GNU C library defines this for functions which it implements
     to always fail with ENOSYS.  Some functions are actually named
     something starting with __ and the normal name is an alias.  */
+ /usr/bin/sed --in-place=.backup '1{$!N;$!N};$!N;s/int x = 1;\nint y = 0;\nint z;\nint nan;/volatile int x = 1; volatile int y = 0; volatile int z, nan;/;P;D' ./configure
+ diff -u ./configure.backup ./configure
+ mv ./configure.backup ./configure
+ /usr/bin/sed --in-place=.backup 's#^lt_cv_sys_global_symbol_to_cdecl=.*#lt_cv_sys_global_symbol_to_cdecl="sed -n -e '\''s/^T .* \\(.*\\)$/extern int \\1();/p'\'' -e '\''s/^$symcode* .* \\(.*\\)$/extern char \\1;/p'\''"#' ./configure
+ diff -u ./configure.backup ./configure
--- ./configure.backup	2023-08-04 22:32:11.238899627 +0800
+++ ./configure	2023-08-04 22:32:11.338900700 +0800
@@ -17629,7 +17629,7 @@
 compiler='`$ECHO "$compiler" | $SED "$delay_single_quote_subst"`'
 GCC='`$ECHO "$GCC" | $SED "$delay_single_quote_subst"`'
 lt_cv_sys_global_symbol_pipe='`$ECHO "$lt_cv_sys_global_symbol_pipe" | $SED "$delay_single_quote_subst"`'
-lt_cv_sys_global_symbol_to_cdecl='`$ECHO "$lt_cv_sys_global_symbol_to_cdecl" | $SED "$delay_single_quote_subst"`'
+lt_cv_sys_global_symbol_to_cdecl="sed -n -e 's/^T .* \(.*\)$/extern int \1();/p' -e 's/^$symcode* .* \(.*\)$/extern char \1;/p'"
 lt_cv_sys_global_symbol_to_c_name_address='`$ECHO "$lt_cv_sys_global_symbol_to_c_name_address" | $SED "$delay_single_quote_subst"`'
 lt_cv_sys_global_symbol_to_c_name_address_lib_prefix='`$ECHO "$lt_cv_sys_global_symbol_to_c_name_address_lib_prefix" | $SED "$delay_single_quote_subst"`'
 nm_file_list_spec='`$ECHO "$nm_file_list_spec" | $SED "$delay_single_quote_subst"`'
+ '[' 1 = 1 ']'
+++ dirname ./configure
++ find . -name config.guess -o -name config.sub
+ for i in $(find $(dirname ./configure) -name config.guess -o -name config.sub)
++ basename ./config/config.guess
+ '[' -f /usr/lib/rpm/OpenCloudOS/config.guess ']'
+ /usr/bin/rm -f ./config/config.guess
++ basename ./config/config.guess
+ /usr/bin/cp -fv /usr/lib/rpm/OpenCloudOS/config.guess ./config/config.guess
'/usr/lib/rpm/OpenCloudOS/config.guess' -> './config/config.guess'
+ for i in $(find $(dirname ./configure) -name config.guess -o -name config.sub)
++ basename ./config/config.sub
+ '[' -f /usr/lib/rpm/OpenCloudOS/config.sub ']'
+ /usr/bin/rm -f ./config/config.sub
++ basename ./config/config.sub
+ /usr/bin/cp -fv /usr/lib/rpm/OpenCloudOS/config.sub ./config/config.sub
'/usr/lib/rpm/OpenCloudOS/config.sub' -> './config/config.sub'
+ '[' 1 = 1 ']'
+ '[' x '!=' 'x-Wl,-z,now -specs=/usr/lib/rpm/OpenCloudOS/OpenCloudOS-hardened-ld' ']'
++ find . -name ltmain.sh
+ for i in $(find . -name ltmain.sh)
+ /usr/bin/sed -i.backup -e 's~compiler_flags=$~compiler_flags="-Wl,-z,now -specs=/usr/lib/rpm/OpenCloudOS/OpenCloudOS-hardened-ld"~' ./config/ltmain.sh
+ ./configure --build=aarch64-opencloudos-linux-gnu --host=aarch64-opencloudos-linux-gnu --program-prefix= --disable-dependency-tracking --prefix=/usr --exec-prefix=/usr --bindir=/usr/bin --sbindir=/usr/sbin --sysconfdir=/etc --datadir=/usr/share --includedir=/usr/include --libdir=/usr/lib64 --libexecdir=/usr/libexec --localstatedir=/var --sharedstatedir=/var/lib --mandir=/usr/share/man --infodir=/usr/share/info --with-perl-extensions --with-perl-vendor-arch --with-java-extensions --without-python-extensions --with-cplusplus-extensions --with-extension-destdir=/builddir/build/BUILDROOT/genders-1.28.1-4.ocs23.aarch64
checking build system type... aarch64-opencloudos-linux-gnu
checking host system type... aarch64-opencloudos-linux-gnu
checking target system type... aarch64-opencloudos-linux-gnu
checking for a BSD-compatible install... /usr/bin/install -c
checking whether build environment is sane... yes
/builddir/build/BUILD/genders-genders-1-28-1/config/missing: Unknown `--is-lightweight' option
Try `/builddir/build/BUILD/genders-genders-1-28-1/config/missing --help' for more information
configure: WARNING: 'missing' script is too old or missing
checking for a thread-safe mkdir -p... /usr/bin/mkdir -p
checking for gawk... gawk
checking whether make sets $(MAKE)... yes
checking whether make supports nested variables... yes
checking whether UID '991' is supported by ustar format... yes
checking whether GID '135' is supported by ustar format... yes
checking how to create a ustar tar archive... gnutar
checking whether to enable maintainer-specific portions of Makefiles... no
checking for aarch64-opencloudos-linux-gnu-gcc... gcc
checking whether the C compiler works... yes
checking for C compiler default output file name... a.out
checking for suffix of executables... 
checking whether we are cross compiling... no
checking for suffix of object files... o
checking whether we are using the GNU C compiler... yes
checking whether gcc accepts -g... yes
checking for gcc option to accept ISO C89... none needed
checking for style of include used by make... GNU
checking dependency style of gcc... none
checking whether we are using the GNU C++ compiler... yes
checking whether g++ accepts -g... yes
checking dependency style of g++... none
checking how to print strings... printf
checking for a sed that does not truncate output... /usr/bin/sed
checking for grep that handles long lines and -e... /usr/bin/grep
checking for egrep... /usr/bin/grep -E
checking for fgrep... /usr/bin/grep -F
checking for ld used by gcc... /usr/bin/ld
checking if the linker (/usr/bin/ld) is GNU ld... yes
checking for BSD- or MS-compatible name lister (nm)... /usr/bin/nm -B
checking the name lister (/usr/bin/nm -B) interface... BSD nm
checking whether ln -s works... yes
checking the maximum length of command line arguments... 1572864
checking whether the shell understands some XSI constructs... yes
checking whether the shell understands "+="... yes
checking how to convert aarch64-opencloudos-linux-gnu file names to aarch64-opencloudos-linux-gnu format... func_convert_file_noop
checking how to convert aarch64-opencloudos-linux-gnu file names to toolchain format... func_convert_file_noop
checking for /usr/bin/ld option to reload object files... -r
checking for aarch64-opencloudos-linux-gnu-objdump... no
checking for objdump... objdump
checking how to recognize dependent libraries... pass_all
checking for aarch64-opencloudos-linux-gnu-dlltool... no
checking for dlltool... no
checking how to associate runtime and link libraries... printf %s\n
checking for aarch64-opencloudos-linux-gnu-ar... no
checking for ar... ar
checking for archiver @FILE support... @
checking for aarch64-opencloudos-linux-gnu-strip... no
checking for strip... strip
checking for aarch64-opencloudos-linux-gnu-ranlib... no
checking for ranlib... ranlib
checking command to parse /usr/bin/nm -B output from gcc object... ok
checking for sysroot... no
checking for aarch64-opencloudos-linux-gnu-mt... no
checking for mt... no
checking if : is a manifest tool... no
checking how to run the C preprocessor... gcc -E
checking for ANSI C header files... yes
checking for sys/types.h... yes
checking for sys/stat.h... yes
checking for stdlib.h... yes
checking for string.h... yes
checking for memory.h... yes
checking for strings.h... yes
checking for inttypes.h... yes
checking for stdint.h... yes
checking for unistd.h... yes
checking for dlfcn.h... yes
checking for objdir... .libs
checking if gcc supports -fno-rtti -fno-exceptions... no
checking for gcc option to produce PIC... -fPIC -DPIC
checking if gcc PIC flag -fPIC -DPIC works... yes
checking if gcc static flag -static works... yes
checking if gcc supports -c -o file.o... yes
checking if gcc supports -c -o file.o... (cached) yes
checking whether the gcc linker (/usr/bin/ld) supports shared libraries... yes
checking whether -lc should be explicitly linked in... no
checking dynamic linker characteristics... GNU/Linux ld.so
checking how to hardcode library paths into programs... immediate
checking whether stripping libraries is possible... yes
checking if libtool supports shared libraries... yes
checking whether to build shared libraries... yes
checking whether to build static libraries... yes
checking how to run the C++ preprocessor... g++ -E
checking for ld used by g++... /usr/bin/ld
checking if the linker (/usr/bin/ld) is GNU ld... yes
checking whether the g++ linker (/usr/bin/ld) supports shared libraries... yes
checking for g++ option to produce PIC... -fPIC -DPIC
checking if g++ PIC flag -fPIC -DPIC works... yes
checking if g++ static flag -static works... no
checking if g++ supports -c -o file.o... yes
checking if g++ supports -c -o file.o... (cached) yes
checking whether the g++ linker (/usr/bin/ld) supports shared libraries... yes
checking dynamic linker characteristics... (cached) GNU/Linux ld.so
checking how to hardcode library paths into programs... immediate
checking whether make sets $(MAKE)... (cached) yes
checking for flex... flex
checking lex output file root... lex.yy
checking lex library... none needed
checking whether yytext is a pointer... no
checking for bison... bison -y
checking for perl... /usr/bin/perl
checking for python... no
checking for pod2man... /usr/bin/pod2man
checking for javac... /usr/bin/javac
checking for javah... no
checking for java... /usr/bin/java
checking for jar... /usr/bin/jar
checking for javadoc... /usr/bin/javadoc
checking whether debugging is enabled... no
checking for --with-force-yacc ... no
checking for --with-non-shortened-hostnames... no
checking for ANSI C header files... (cached) yes
checking fcntl.h usability... yes
checking fcntl.h presence... yes
checking for fcntl.h... yes
checking for unistd.h... (cached) yes
checking getopt.h usability... yes
checking getopt.h presence... yes
checking for getopt.h... yes
checking paths.h usability... yes
checking paths.h presence... yes
checking for paths.h... yes
checking for genders default file path... "/etc/genders"
checking for --with-extension-destdir ... yes
checking for --with-perl-extensions... yes
checking for --with-perl-site-arch... no
checking for --with-perl-vendor-arch... yes
checking for --with-python-extensions... no
checking for --with-cplusplus-extensions... yes
checking for --with-java-extensions... yes
checking whether byte ordering is bigendian... no
checking for an ANSI C-conforming const... yes
checking for uid_t in sys/types.h... yes
checking for strcmp... yes
checking for strlen... yes
checking for strcpy... yes
checking for strchr... yes
checking for strsep... yes
checking for strspn... yes
checking for strtok_r... yes
checking for getopt_long... yes
checking that generated files are newer than configure... done
configure: creating ./config.status
config.status: creating genders.spec
config.status: creating Makefile
config.status: creating src/Makefile
config.status: creating src/libcommon/Makefile
config.status: creating src/libgenders/Makefile
config.status: creating src/nodeattr/Makefile
config.status: creating src/libgenders/genders.h
config.status: creating src/extensions/Makefile
config.status: creating src/extensions/cplusplus/Makefile
config.status: creating src/extensions/perl/Makefile
config.status: creating src/extensions/perl/Libgenders/Makefile
config.status: creating src/extensions/perl/Libgenders/Libgenders.pm
config.status: creating src/extensions/perl/Genders/Makefile
config.status: creating src/extensions/perl/Genders/Genders.pm
config.status: creating src/extensions/python/Makefile
config.status: creating src/extensions/python/genderssetup.py
config.status: creating src/extensions/java/Makefile
config.status: creating src/testsuite/Makefile
config.status: creating src/testsuite/libgenders/Makefile
config.status: creating src/testsuite/libgenders/testdatabases/Makefile
config.status: creating compat/Makefile
config.status: creating contrib/Makefile
config.status: creating contrib/cfengine/Makefile
config.status: creating contrib/cfengine/cfengine-2.2.10/Makefile
config.status: creating contrib/cfengine/cfengine-3.3.0/Makefile
config.status: creating contrib/php/Makefile
config.status: creating man/Makefile
config.status: creating man/compat/Makefile
config.status: creating config/config.h
config.status: executing depfiles commands
config.status: executing libtool commands
+ /usr/bin/make -O -j32 V=1 VERBOSE=1
Making all in src
Making all in libcommon
make[2]: Entering directory '/builddir/build/BUILD/genders-genders-1-28-1/src/libcommon'
/bin/sh ../../libtool  --tag=CC   --mode=compile gcc -DHAVE_CONFIG_H -I. -I../../config   -I/usr/lib/jvm/java/include -I/usr/lib/jvm/java/include/linux -I../../../src/libgenders -I../../config -O2 -flto=auto -ffat-lto-objects -fexceptions -g -grecord-gcc-switches -pipe -Wall -Werror=format-security -Wp,-D_FORTIFY_SOURCE=2 -Wp,-D_GLIBCXX_ASSERTIONS -specs=/usr/lib/rpm/OpenCloudOS/OpenCloudOS-hardened-cc1 -fstack-protector-strong  -mbranch-protection=standard -fasynchronous-unwind-tables -fstack-clash-protection -c -o libcommon_la-thread.lo `test -f 'thread.c' || echo './'`thread.c
libtool: compile:  gcc -DHAVE_CONFIG_H -I. -I../../config -I/usr/lib/jvm/java/include -I/usr/lib/jvm/java/include/linux -I../../../src/libgenders -I../../config -O2 -flto=auto -ffat-lto-objects -fexceptions -g -grecord-gcc-switches -pipe -Wall -Werror=format-security -Wp,-D_FORTIFY_SOURCE=2 -Wp,-D_GLIBCXX_ASSERTIONS -specs=/usr/lib/rpm/OpenCloudOS/OpenCloudOS-hardened-cc1 -fstack-protector-strong -mbranch-protection=standard -fasynchronous-unwind-tables -fstack-clash-protection -c thread.c  -fPIC -DPIC -o .libs/libcommon_la-thread.o
libtool: compile:  gcc -DHAVE_CONFIG_H -I. -I../../config -I/usr/lib/jvm/java/include -I/usr/lib/jvm/java/include/linux -I../../../src/libgenders -I../../config -O2 -flto=auto -ffat-lto-objects -fexceptions -g -grecord-gcc-switches -pipe -Wall -Werror=format-security -Wp,-D_FORTIFY_SOURCE=2 -Wp,-D_GLIBCXX_ASSERTIONS -specs=/usr/lib/rpm/OpenCloudOS/OpenCloudOS-hardened-cc1 -fstack-protector-strong -mbranch-protection=standard -fasynchronous-unwind-tables -fstack-clash-protection -c thread.c -o libcommon_la-thread.o >/dev/null 2>&1
make[2]: Leaving directory '/builddir/build/BUILD/genders-genders-1-28-1/src/libcommon'
make[2]: Entering directory '/builddir/build/BUILD/genders-genders-1-28-1/src/libcommon'
/bin/sh ../../libtool  --tag=CC   --mode=compile gcc -DHAVE_CONFIG_H -I. -I../../config   -I/usr/lib/jvm/java/include -I/usr/lib/jvm/java/include/linux -I../../../src/libgenders -I../../config -O2 -flto=auto -ffat-lto-objects -fexceptions -g -grecord-gcc-switches -pipe -Wall -Werror=format-security -Wp,-D_FORTIFY_SOURCE=2 -Wp,-D_GLIBCXX_ASSERTIONS -specs=/usr/lib/rpm/OpenCloudOS/OpenCloudOS-hardened-cc1 -fstack-protector-strong  -mbranch-protection=standard -fasynchronous-unwind-tables -fstack-clash-protection -c -o libcommon_la-hash.lo `test -f 'hash.c' || echo './'`hash.c
libtool: compile:  gcc -DHAVE_CONFIG_H -I. -I../../config -I/usr/lib/jvm/java/include -I/usr/lib/jvm/java/include/linux -I../../../src/libgenders -I../../config -O2 -flto=auto -ffat-lto-objects -fexceptions -g -grecord-gcc-switches -pipe -Wall -Werror=format-security -Wp,-D_FORTIFY_SOURCE=2 -Wp,-D_GLIBCXX_ASSERTIONS -specs=/usr/lib/rpm/OpenCloudOS/OpenCloudOS-hardened-cc1 -fstack-protector-strong -mbranch-protection=standard -fasynchronous-unwind-tables -fstack-clash-protection -c hash.c  -fPIC -DPIC -o .libs/libcommon_la-hash.o
libtool: compile:  gcc -DHAVE_CONFIG_H -I. -I../../config -I/usr/lib/jvm/java/include -I/usr/lib/jvm/java/include/linux -I../../../src/libgenders -I../../config -O2 -flto=auto -ffat-lto-objects -fexceptions -g -grecord-gcc-switches -pipe -Wall -Werror=format-security -Wp,-D_FORTIFY_SOURCE=2 -Wp,-D_GLIBCXX_ASSERTIONS -specs=/usr/lib/rpm/OpenCloudOS/OpenCloudOS-hardened-cc1 -fstack-protector-strong -mbranch-protection=standard -fasynchronous-unwind-tables -fstack-clash-protection -c hash.c -o libcommon_la-hash.o >/dev/null 2>&1
make[2]: Leaving directory '/builddir/build/BUILD/genders-genders-1-28-1/src/libcommon'
make[2]: Entering directory '/builddir/build/BUILD/genders-genders-1-28-1/src/libcommon'
/bin/sh ../../libtool  --tag=CC   --mode=compile gcc -DHAVE_CONFIG_H -I. -I../../config   -I/usr/lib/jvm/java/include -I/usr/lib/jvm/java/include/linux -I../../../src/libgenders -I../../config -O2 -flto=auto -ffat-lto-objects -fexceptions -g -grecord-gcc-switches -pipe -Wall -Werror=format-security -Wp,-D_FORTIFY_SOURCE=2 -Wp,-D_GLIBCXX_ASSERTIONS -specs=/usr/lib/rpm/OpenCloudOS/OpenCloudOS-hardened-cc1 -fstack-protector-strong  -mbranch-protection=standard -fasynchronous-unwind-tables -fstack-clash-protection -c -o libcommon_la-list.lo `test -f 'list.c' || echo './'`list.c
libtool: compile:  gcc -DHAVE_CONFIG_H -I. -I../../config -I/usr/lib/jvm/java/include -I/usr/lib/jvm/java/include/linux -I../../../src/libgenders -I../../config -O2 -flto=auto -ffat-lto-objects -fexceptions -g -grecord-gcc-switches -pipe -Wall -Werror=format-security -Wp,-D_FORTIFY_SOURCE=2 -Wp,-D_GLIBCXX_ASSERTIONS -specs=/usr/lib/rpm/OpenCloudOS/OpenCloudOS-hardened-cc1 -fstack-protector-strong -mbranch-protection=standard -fasynchronous-unwind-tables -fstack-clash-protection -c list.c  -fPIC -DPIC -o .libs/libcommon_la-list.o
libtool: compile:  gcc -DHAVE_CONFIG_H -I. -I../../config -I/usr/lib/jvm/java/include -I/usr/lib/jvm/java/include/linux -I../../../src/libgenders -I../../config -O2 -flto=auto -ffat-lto-objects -fexceptions -g -grecord-gcc-switches -pipe -Wall -Werror=format-security -Wp,-D_FORTIFY_SOURCE=2 -Wp,-D_GLIBCXX_ASSERTIONS -specs=/usr/lib/rpm/OpenCloudOS/OpenCloudOS-hardened-cc1 -fstack-protector-strong -mbranch-protection=standard -fasynchronous-unwind-tables -fstack-clash-protection -c list.c -o libcommon_la-list.o >/dev/null 2>&1
make[2]: Leaving directory '/builddir/build/BUILD/genders-genders-1-28-1/src/libcommon'
make[2]: Entering directory '/builddir/build/BUILD/genders-genders-1-28-1/src/libcommon'
/bin/sh ../../libtool  --tag=CC   --mode=compile gcc -DHAVE_CONFIG_H -I. -I../../config   -I/usr/lib/jvm/java/include -I/usr/lib/jvm/java/include/linux -I../../../src/libgenders -I../../config -O2 -flto=auto -ffat-lto-objects -fexceptions -g -grecord-gcc-switches -pipe -Wall -Werror=format-security -Wp,-D_FORTIFY_SOURCE=2 -Wp,-D_GLIBCXX_ASSERTIONS -specs=/usr/lib/rpm/OpenCloudOS/OpenCloudOS-hardened-cc1 -fstack-protector-strong  -mbranch-protection=standard -fasynchronous-unwind-tables -fstack-clash-protection -c -o libcommon_la-hostlist.lo `test -f 'hostlist.c' || echo './'`hostlist.c
libtool: compile:  gcc -DHAVE_CONFIG_H -I. -I../../config -I/usr/lib/jvm/java/include -I/usr/lib/jvm/java/include/linux -I../../../src/libgenders -I../../config -O2 -flto=auto -ffat-lto-objects -fexceptions -g -grecord-gcc-switches -pipe -Wall -Werror=format-security -Wp,-D_FORTIFY_SOURCE=2 -Wp,-D_GLIBCXX_ASSERTIONS -specs=/usr/lib/rpm/OpenCloudOS/OpenCloudOS-hardened-cc1 -fstack-protector-strong -mbranch-protection=standard -fasynchronous-unwind-tables -fstack-clash-protection -c hostlist.c  -fPIC -DPIC -o .libs/libcommon_la-hostlist.o
libtool: compile:  gcc -DHAVE_CONFIG_H -I. -I../../config -I/usr/lib/jvm/java/include -I/usr/lib/jvm/java/include/linux -I../../../src/libgenders -I../../config -O2 -flto=auto -ffat-lto-objects -fexceptions -g -grecord-gcc-switches -pipe -Wall -Werror=format-security -Wp,-D_FORTIFY_SOURCE=2 -Wp,-D_GLIBCXX_ASSERTIONS -specs=/usr/lib/rpm/OpenCloudOS/OpenCloudOS-hardened-cc1 -fstack-protector-strong -mbranch-protection=standard -fasynchronous-unwind-tables -fstack-clash-protection -c hostlist.c -o libcommon_la-hostlist.o >/dev/null 2>&1
make[2]: Leaving directory '/builddir/build/BUILD/genders-genders-1-28-1/src/libcommon'
hostlist.c: In function '_next_tok':
hostlist.c:384:48: warning: comparison between pointer and zero character constant [-Wpointer-compare]
  384 |     while (**str != '\0' && strchr(sep, **str) != '\0')
      |                                                ^~
hostlist.c:384:29: note: did you mean to dereference the pointer?
  384 |     while (**str != '\0' && strchr(sep, **str) != '\0')
      |                             ^
hostlist.c:400:52: warning: comparison between pointer and zero character constant [-Wpointer-compare]
  400 |         while (**str != '\0' && strchr(sep, **str) == '\0')
      |                                                    ^~
hostlist.c:400:33: note: did you mean to dereference the pointer?
  400 |         while (**str != '\0' && strchr(sep, **str) == '\0')
      |                                 ^
hostlist.c:405:48: warning: comparison between pointer and zero character constant [-Wpointer-compare]
  405 |     while (**str != '\0' && strchr(sep, **str) != '\0')
      |                                                ^~
hostlist.c:405:29: note: did you mean to dereference the pointer?
  405 |     while (**str != '\0' && strchr(sep, **str) != '\0')
      |                             ^
hostlist.c: At top level:
hostlist.c:336:13: warning: '_error' defined but not used [-Wunused-function]
  336 | static void _error(char *file, int line, char *msg, ...)
      |             ^~~~~~
hostlist.c: In function '_hostlist_create_bracketed.constprop.0':
hostlist.c:1481:9: warning: 'strncpy' specified bound 1024 equals destination size [-Wstringop-truncation]
 1481 |         strncpy(cur_tok, tok, 1024);
      |         ^
make[2]: Entering directory '/builddir/build/BUILD/genders-genders-1-28-1/src/libcommon'
/bin/sh ../../libtool  --tag=CC   --mode=link gcc -I../../config -O2 -flto=auto -ffat-lto-objects -fexceptions -g -grecord-gcc-switches -pipe -Wall -Werror=format-security -Wp,-D_FORTIFY_SOURCE=2 -Wp,-D_GLIBCXX_ASSERTIONS -specs=/usr/lib/rpm/OpenCloudOS/OpenCloudOS-hardened-cc1 -fstack-protector-strong  -mbranch-protection=standard -fasynchronous-unwind-tables -fstack-clash-protection  -Wl,-z,relro -Wl,--as-needed  -Wl,-z,now -specs=/usr/lib/rpm/OpenCloudOS/OpenCloudOS-hardened-ld  -Wl,--build-id=sha1 -o libcommon.la  libcommon_la-hash.lo libcommon_la-hostlist.lo libcommon_la-list.lo libcommon_la-thread.lo  
libtool: link: ar cru .libs/libcommon.a .libs/libcommon_la-hash.o .libs/libcommon_la-hostlist.o .libs/libcommon_la-list.o .libs/libcommon_la-thread.o 
libtool: link: ranlib .libs/libcommon.a
libtool: link: ( cd ".libs" && rm -f "libcommon.la" && ln -s "../libcommon.la" "libcommon.la" )
make[2]: Leaving directory '/builddir/build/BUILD/genders-genders-1-28-1/src/libcommon'
Making all in libgenders
make[2]: Entering directory '/builddir/build/BUILD/genders-genders-1-28-1/src/libgenders'
bison -y -d -b genders_query ./genders_query.y
make[2]: Leaving directory '/builddir/build/BUILD/genders-genders-1-28-1/src/libgenders'
make[2]: Entering directory '/builddir/build/BUILD/genders-genders-1-28-1/src/libgenders'
bison -y -d -b genders_query ./genders_query.y
make[2]: Leaving directory '/builddir/build/BUILD/genders-genders-1-28-1/src/libgenders'
make[2]: Entering directory '/builddir/build/BUILD/genders-genders-1-28-1/src/libgenders'
flex -t ./genders_query_parse.l > ./genders_query_parse.c
make[2]: Leaving directory '/builddir/build/BUILD/genders-genders-1-28-1/src/libgenders'
/usr/bin/make  all-am
make[3]: Entering directory '/builddir/build/BUILD/genders-genders-1-28-1/src/libgenders'
make[4]: 'libcommon.la' is up to date.
make[3]: Leaving directory '/builddir/build/BUILD/genders-genders-1-28-1/src/libgenders'
make[3]: Entering directory '/builddir/build/BUILD/genders-genders-1-28-1/src/libgenders'
bison -y -d -b genders_query ./genders_query.y
make[3]: Leaving directory '/builddir/build/BUILD/genders-genders-1-28-1/src/libgenders'
make[3]: Entering directory '/builddir/build/BUILD/genders-genders-1-28-1/src/libgenders'
flex -t ./genders_query_parse.l > ./genders_query_parse.c
make[3]: Leaving directory '/builddir/build/BUILD/genders-genders-1-28-1/src/libgenders'
make[3]: Entering directory '/builddir/build/BUILD/genders-genders-1-28-1/src/libgenders'
/bin/sh ../../libtool  --tag=CC   --mode=compile gcc -DHAVE_CONFIG_H -I. -I../../config   -I/usr/lib/jvm/java/include -I/usr/lib/jvm/java/include/linux -I../../../src/libgenders -D_REENTRANT -I ./../libcommon -O2 -flto=auto -ffat-lto-objects -fexceptions -g -grecord-gcc-switches -pipe -Wall -Werror=format-security -Wp,-D_FORTIFY_SOURCE=2 -Wp,-D_GLIBCXX_ASSERTIONS -specs=/usr/lib/rpm/OpenCloudOS/OpenCloudOS-hardened-cc1 -fstack-protector-strong  -mbranch-protection=standard -fasynchronous-unwind-tables -fstack-clash-protection -c -o libgenders_la-genders_query.tab.lo `test -f 'genders_query.tab.c' || echo './'`genders_query.tab.c
libtool: compile:  gcc -DHAVE_CONFIG_H -I. -I../../config -I/usr/lib/jvm/java/include -I/usr/lib/jvm/java/include/linux -I../../../src/libgenders -D_REENTRANT -I ./../libcommon -O2 -flto=auto -ffat-lto-objects -fexceptions -g -grecord-gcc-switches -pipe -Wall -Werror=format-security -Wp,-D_FORTIFY_SOURCE=2 -Wp,-D_GLIBCXX_ASSERTIONS -specs=/usr/lib/rpm/OpenCloudOS/OpenCloudOS-hardened-cc1 -fstack-protector-strong -mbranch-protection=standard -fasynchronous-unwind-tables -fstack-clash-protection -c genders_query.tab.c  -fPIC -DPIC -o .libs/libgenders_la-genders_query.tab.o
make[3]: Leaving directory '/builddir/build/BUILD/genders-genders-1-28-1/src/libgenders'
genders_query.tab.c: In function 'yyparse':
genders_query.tab.c:1610:27: warning: missing terminating " character
 1610 |       YYDPRINTF ((stderr, "Stack size increased to %ld\n",
      |                           ^
genders_query.tab.c:1610:29: error: unterminated argument list invoking macro "YYDPRINTF"
 1610 |       YYDPRINTF ((stderr, "Stack size increased to %ld\n",
      |                             ^
genders_query.tab.c:1557: error: unterminated #else
 1557 | #if !defined yyoverflow && !defined YYSTACK_RELOCATE
      | 
genders_query.tab.c:1610:7: error: 'YYDPRINTF' undeclared (first use in this function)
 1610 |       YYDPRINTF ((stderr, "Stack size increased to %ld\n",
      |       ^~~~~~~~~
genders_query.tab.c:1610:7: note: each undeclared identifier is reported only once for each function it appears in
genders_query.tab.c:1610:16: error: expected ';' at end of input
 1610 |       YYDPRINTF ((stderr, "Stack size increased to %ld\n",
      |                ^
      |                ;
 1611 |                   YY_CAST (long, yystacksize)));
      |                 
genders_query.tab.c:1610:7: error: expected declaration or statement at end of input
 1610 |       YYDPRINTF ((stderr, "Stack size increased to %ld\n",
      |       ^~~~~~~~~
genders_query.tab.c:1610:7: error: expected declaration or statement at end of input
genders_query.tab.c:1597:11: error: label 'yyexhaustedlab' used but not defined
 1597 |           YYNOMEM;
      |           ^~~~~~~
genders_query.tab.c:1539:1: warning: label 'yynewstate' defined but not used [-Wunused-label]
 1539 | yynewstate:
      | ^~~~~~~~~~
genders_query.tab.c:1527:7: warning: unused variable 'yylen' [-Wunused-variable]
 1527 |   int yylen = 0;
      |       ^~~~~
genders_query.tab.c:1519:11: warning: unused variable 'yyval' [-Wunused-variable]
 1519 |   YYSTYPE yyval;
      |           ^~~~~
genders_query.tab.c:1516:19: warning: unused variable 'yytoken' [-Wunused-variable]
 1516 |   yysymbol_kind_t yytoken = YYSYMBOL_YYEMPTY;
      |                   ^~~~~~~
genders_query.tab.c:1514:7: warning: unused variable 'yyresult' [-Wunused-variable]
 1514 |   int yyresult;
      |       ^~~~~~~~
genders_query.tab.c:1512:7: warning: unused variable 'yyn' [-Wunused-variable]
 1512 |   int yyn;
      |       ^~~
genders_query.tab.c:1510:14: warning: variable 'yyvsp' set but not used [-Wunused-but-set-variable]
 1510 |     YYSTYPE *yyvsp = yyvs;
      |              ^~~~~
genders_query.tab.c:1494:9: warning: unused variable 'yyerrstatus' [-Wunused-variable]
 1494 |     int yyerrstatus = 0;
      |         ^~~~~~~~~~~
genders_query.tab.c:1611: warning: control reaches end of non-void function [-Wreturn-type]
 1611 |                   YY_CAST (long, yystacksize)));
      | 
genders_query.tab.c: At top level:
genders_query.tab.c:1460:1: warning: 'yydestruct' defined but not used [-Wunused-function]
 1460 | yydestruct (const char *yymsg,
      | ^~~~~~~~~~
genders_query.tab.c:1266:26: warning: 'yyr2' defined but not used [-Wunused-const-variable=]
 1266 | static const yytype_int8 yyr2[] =
      |                          ^~~~
genders_query.tab.c:1260:26: warning: 'yyr1' defined but not used [-Wunused-const-variable=]
 1260 | static const yytype_int8 yyr1[] =
      |                          ^~~~
genders_query.tab.c:1253:26: warning: 'yystos' defined but not used [-Wunused-const-variable=]
 1253 | static const yytype_int8 yystos[] =
      |                          ^~~~~~
genders_query.tab.c:1245:26: warning: 'yycheck' defined but not used [-Wunused-const-variable=]
 1245 | static const yytype_int8 yycheck[] =
      |                          ^~~~~~~
genders_query.tab.c:1239:26: warning: 'yytable' defined but not used [-Wunused-const-variable=]
 1239 | static const yytype_int8 yytable[] =
      |                          ^~~~~~~
genders_query.tab.c:1231:26: warning: 'yydefgoto' defined but not used [-Wunused-const-variable=]
 1231 | static const yytype_int8 yydefgoto[] =
      |                          ^~~~~~~~~
genders_query.tab.c:1225:26: warning: 'yypgoto' defined but not used [-Wunused-const-variable=]
 1225 | static const yytype_int8 yypgoto[] =
      |                          ^~~~~~~
genders_query.tab.c:1218:26: warning: 'yydefact' defined but not used [-Wunused-const-variable=]
 1218 | static const yytype_int8 yydefact[] =
      |                          ^~~~~~~~
genders_query.tab.c:1209:26: warning: 'yypact' defined but not used [-Wunused-const-variable=]
 1209 | static const yytype_int8 yypact[] =
      |                          ^~~~~~
genders_query.tab.c:1134:26: warning: 'yytranslate' defined but not used [-Wunused-const-variable=]
 1134 | static const yytype_int8 yytranslate[] =
      |                          ^~~~~~~~~~~
./genders_query.y:129:1: warning: '_genders_set_complement_flag' defined but not used [-Wunused-function]
  129 | _genders_set_complement_flag(void *node)
      | ^~~~~~~~~~~~~~~~~~~~~~~~~~~~
./genders_query.y:90:1: warning: '_genders_makenode' defined but not used [-Wunused-function]
   90 | _genders_makenode(char *str, void *left, void *right)
      | ^~~~~~~~~~~~~~~~~
make[3]: *** [Makefile:518: libgenders_la-genders_query.tab.lo] Error 1
make[3]: *** Waiting for unfinished jobs....
make[3]: Entering directory '/builddir/build/BUILD/genders-genders-1-28-1/src/libgenders'
/bin/sh ../../libtool  --tag=CC   --mode=compile gcc -DHAVE_CONFIG_H -I. -I../../config   -I/usr/lib/jvm/java/include -I/usr/lib/jvm/java/include/linux -I../../../src/libgenders -D_REENTRANT -I ./../libcommon -O2 -flto=auto -ffat-lto-objects -fexceptions -g -grecord-gcc-switches -pipe -Wall -Werror=format-security -Wp,-D_FORTIFY_SOURCE=2 -Wp,-D_GLIBCXX_ASSERTIONS -specs=/usr/lib/rpm/OpenCloudOS/OpenCloudOS-hardened-cc1 -fstack-protector-strong  -mbranch-protection=standard -fasynchronous-unwind-tables -fstack-clash-protection -c -o libgenders_la-genders_util.lo `test -f 'genders_util.c' || echo './'`genders_util.c
libtool: compile:  gcc -DHAVE_CONFIG_H -I. -I../../config -I/usr/lib/jvm/java/include -I/usr/lib/jvm/java/include/linux -I../../../src/libgenders -D_REENTRANT -I ./../libcommon -O2 -flto=auto -ffat-lto-objects -fexceptions -g -grecord-gcc-switches -pipe -Wall -Werror=format-security -Wp,-D_FORTIFY_SOURCE=2 -Wp,-D_GLIBCXX_ASSERTIONS -specs=/usr/lib/rpm/OpenCloudOS/OpenCloudOS-hardened-cc1 -fstack-protector-strong -mbranch-protection=standard -fasynchronous-unwind-tables -fstack-clash-protection -c genders_util.c  -fPIC -DPIC -o .libs/libgenders_la-genders_util.o
libtool: compile:  gcc -DHAVE_CONFIG_H -I. -I../../config -I/usr/lib/jvm/java/include -I/usr/lib/jvm/java/include/linux -I../../../src/libgenders -D_REENTRANT -I ./../libcommon -O2 -flto=auto -ffat-lto-objects -fexceptions -g -grecord-gcc-switches -pipe -Wall -Werror=format-security -Wp,-D_FORTIFY_SOURCE=2 -Wp,-D_GLIBCXX_ASSERTIONS -specs=/usr/lib/rpm/OpenCloudOS/OpenCloudOS-hardened-cc1 -fstack-protector-strong -mbranch-protection=standard -fasynchronous-unwind-tables -fstack-clash-protection -c genders_util.c -o libgenders_la-genders_util.o >/dev/null 2>&1
make[3]: Leaving directory '/builddir/build/BUILD/genders-genders-1-28-1/src/libgenders'
genders_util.c: In function '_genders_list_free_attrvallist':
genders_util.c:97:7: warning: assignment to 'genders_attrvals_container_t' {aka 'struct genders_attrvals_container *'} from incompatible pointer type 'struct list *' [-Wincompatible-pointer-types]
   97 |   avc = (List)x;
      |       ^
make[3]: Entering directory '/builddir/build/BUILD/genders-genders-1-28-1/src/libgenders'
/bin/sh ../../libtool  --tag=CC   --mode=compile gcc -DHAVE_CONFIG_H -I. -I../../config   -I/usr/lib/jvm/java/include -I/usr/lib/jvm/java/include/linux -I../../../src/libgenders -D_REENTRANT -I ./../libcommon -O2 -flto=auto -ffat-lto-objects -fexceptions -g -grecord-gcc-switches -pipe -Wall -Werror=format-security -Wp,-D_FORTIFY_SOURCE=2 -Wp,-D_GLIBCXX_ASSERTIONS -specs=/usr/lib/rpm/OpenCloudOS/OpenCloudOS-hardened-cc1 -fstack-protector-strong  -mbranch-protection=standard -fasynchronous-unwind-tables -fstack-clash-protection -c -o libgenders_la-genders_parsing.lo `test -f 'genders_parsing.c' || echo './'`genders_parsing.c
libtool: compile:  gcc -DHAVE_CONFIG_H -I. -I../../config -I/usr/lib/jvm/java/include -I/usr/lib/jvm/java/include/linux -I../../../src/libgenders -D_REENTRANT -I ./../libcommon -O2 -flto=auto -ffat-lto-objects -fexceptions -g -grecord-gcc-switches -pipe -Wall -Werror=format-security -Wp,-D_FORTIFY_SOURCE=2 -Wp,-D_GLIBCXX_ASSERTIONS -specs=/usr/lib/rpm/OpenCloudOS/OpenCloudOS-hardened-cc1 -fstack-protector-strong -mbranch-protection=standard -fasynchronous-unwind-tables -fstack-clash-protection -c genders_parsing.c  -fPIC -DPIC -o .libs/libgenders_la-genders_parsing.o
libtool: compile:  gcc -DHAVE_CONFIG_H -I. -I../../config -I/usr/lib/jvm/java/include -I/usr/lib/jvm/java/include/linux -I../../../src/libgenders -D_REENTRANT -I ./../libcommon -O2 -flto=auto -ffat-lto-objects -fexceptions -g -grecord-gcc-switches -pipe -Wall -Werror=format-security -Wp,-D_FORTIFY_SOURCE=2 -Wp,-D_GLIBCXX_ASSERTIONS -specs=/usr/lib/rpm/OpenCloudOS/OpenCloudOS-hardened-cc1 -fstack-protector-strong -mbranch-protection=standard -fasynchronous-unwind-tables -fstack-clash-protection -c genders_parsing.c -o libgenders_la-genders_parsing.o >/dev/null 2>&1
make[3]: Leaving directory '/builddir/build/BUILD/genders-genders-1-28-1/src/libgenders'
make[3]: Entering directory '/builddir/build/BUILD/genders-genders-1-28-1/src/libgenders'
/bin/sh ../../libtool  --tag=CC   --mode=compile gcc -DHAVE_CONFIG_H -I. -I../../config   -I/usr/lib/jvm/java/include -I/usr/lib/jvm/java/include/linux -I../../../src/libgenders -D_REENTRANT -I ./../libcommon -O2 -flto=auto -ffat-lto-objects -fexceptions -g -grecord-gcc-switches -pipe -Wall -Werror=format-security -Wp,-D_FORTIFY_SOURCE=2 -Wp,-D_GLIBCXX_ASSERTIONS -specs=/usr/lib/rpm/OpenCloudOS/OpenCloudOS-hardened-cc1 -fstack-protector-strong  -mbranch-protection=standard -fasynchronous-unwind-tables -fstack-clash-protection -c -o libgenders_la-genders_query_parse.lo `test -f 'genders_query_parse.c' || echo './'`genders_query_parse.c
libtool: compile:  gcc -DHAVE_CONFIG_H -I. -I../../config -I/usr/lib/jvm/java/include -I/usr/lib/jvm/java/include/linux -I../../../src/libgenders -D_REENTRANT -I ./../libcommon -O2 -flto=auto -ffat-lto-objects -fexceptions -g -grecord-gcc-switches -pipe -Wall -Werror=format-security -Wp,-D_FORTIFY_SOURCE=2 -Wp,-D_GLIBCXX_ASSERTIONS -specs=/usr/lib/rpm/OpenCloudOS/OpenCloudOS-hardened-cc1 -fstack-protector-strong -mbranch-protection=standard -fasynchronous-unwind-tables -fstack-clash-protection -c genders_query_parse.c  -fPIC -DPIC -o .libs/libgenders_la-genders_query_parse.o
libtool: compile:  gcc -DHAVE_CONFIG_H -I. -I../../config -I/usr/lib/jvm/java/include -I/usr/lib/jvm/java/include/linux -I../../../src/libgenders -D_REENTRANT -I ./../libcommon -O2 -flto=auto -ffat-lto-objects -fexceptions -g -grecord-gcc-switches -pipe -Wall -Werror=format-security -Wp,-D_FORTIFY_SOURCE=2 -Wp,-D_GLIBCXX_ASSERTIONS -specs=/usr/lib/rpm/OpenCloudOS/OpenCloudOS-hardened-cc1 -fstack-protector-strong -mbranch-protection=standard -fasynchronous-unwind-tables -fstack-clash-protection -c genders_query_parse.c -o libgenders_la-genders_query_parse.o >/dev/null 2>&1
make[3]: Leaving directory '/builddir/build/BUILD/genders-genders-1-28-1/src/libgenders'
<stdout>:1195:16: warning: 'input' defined but not used [-Wunused-function]
<stdout>:1152:17: warning: 'yyunput' defined but not used [-Wunused-function]
make[3]: Entering directory '/builddir/build/BUILD/genders-genders-1-28-1/src/libgenders'
/bin/sh ../../libtool  --tag=CC   --mode=compile gcc -DHAVE_CONFIG_H -I. -I../../config   -I/usr/lib/jvm/java/include -I/usr/lib/jvm/java/include/linux -I../../../src/libgenders -D_REENTRANT -I ./../libcommon -O2 -flto=auto -ffat-lto-objects -fexceptions -g -grecord-gcc-switches -pipe -Wall -Werror=format-security -Wp,-D_FORTIFY_SOURCE=2 -Wp,-D_GLIBCXX_ASSERTIONS -specs=/usr/lib/rpm/OpenCloudOS/OpenCloudOS-hardened-cc1 -fstack-protector-strong  -mbranch-protection=standard -fasynchronous-unwind-tables -fstack-clash-protection -c -o libgenders_la-genders.lo `test -f 'genders.c' || echo './'`genders.c
libtool: compile:  gcc -DHAVE_CONFIG_H -I. -I../../config -I/usr/lib/jvm/java/include -I/usr/lib/jvm/java/include/linux -I../../../src/libgenders -D_REENTRANT -I ./../libcommon -O2 -flto=auto -ffat-lto-objects -fexceptions -g -grecord-gcc-switches -pipe -Wall -Werror=format-security -Wp,-D_FORTIFY_SOURCE=2 -Wp,-D_GLIBCXX_ASSERTIONS -specs=/usr/lib/rpm/OpenCloudOS/OpenCloudOS-hardened-cc1 -fstack-protector-strong -mbranch-protection=standard -fasynchronous-unwind-tables -fstack-clash-protection -c genders.c  -fPIC -DPIC -o .libs/libgenders_la-genders.o
libtool: compile:  gcc -DHAVE_CONFIG_H -I. -I../../config -I/usr/lib/jvm/java/include -I/usr/lib/jvm/java/include/linux -I../../../src/libgenders -D_REENTRANT -I ./../libcommon -O2 -flto=auto -ffat-lto-objects -fexceptions -g -grecord-gcc-switches -pipe -Wall -Werror=format-security -Wp,-D_FORTIFY_SOURCE=2 -Wp,-D_GLIBCXX_ASSERTIONS -specs=/usr/lib/rpm/OpenCloudOS/OpenCloudOS-hardened-cc1 -fstack-protector-strong -mbranch-protection=standard -fasynchronous-unwind-tables -fstack-clash-protection -c genders.c -o libgenders_la-genders.o >/dev/null 2>&1
make[3]: Leaving directory '/builddir/build/BUILD/genders-genders-1-28-1/src/libgenders'
make[2]: *** [Makefile:384: all] Error 2
make[1]: *** [Makefile:380: all-recursive] Error 1
make: *** [Makefile:439: all-recursive] Error 1
RPM build errors:
error: Bad exit status from /var/tmp/rpm-tmp.CKDkZ8 (%build)
    Bad exit status from /var/tmp/rpm-tmp.CKDkZ8 (%build)
Child return code was: 1
EXCEPTION: [Error('Command failed: \n # bash --login -c /usr/bin/rpmbuild -bb --noclean --target aarch64 --nodeps /builddir/build/SPECS/genders.spec\n', 1)]
Traceback (most recent call last):
  File "/usr/lib/python3.6/site-packages/mockbuild/trace_decorator.py", line 93, in trace
    result = func(*args, **kw)
  File "/usr/lib/python3.6/site-packages/mockbuild/util.py", line 597, in do_with_status
    raise exception.Error("Command failed: \n # %s\n%s" % (command, output), child.returncode)
mockbuild.exception.Error: Command failed: 
 # bash --login -c /usr/bin/rpmbuild -bb --noclean --target aarch64 --nodeps /builddir/build/SPECS/genders.spec