Mock Version: 4.1
Mock Version: 4.1
Mock Version: 4.1
ENTER ['do_with_status'](['bash', '--login', '-c', '/usr/bin/rpmbuild -bs --noclean --target x86_64 --nodeps /builddir/build/SPECS/capstone.spec'], chrootPath='/var/lib/mock/dist-ocs23-base-build-287463-27942/root'env={'TERM': 'vt100', 'SHELL': '/bin/bash', 'HOME': '/builddir', 'HOSTNAME': 'mock', 'PATH': '/usr/bin:/bin:/usr/sbin:/sbin', 'PROMPT_COMMAND': 'printf "\\033]0;<mock-chroot>\\007"', 'PS1': '<mock-chroot> \\s-\\v\\$ ', 'LANG': 'C.UTF-8'}shell=Falselogger=<mockbuild.trace_decorator.getLog object at 0x7fa4421dd5d0>timeout=86400uid=982gid=135user='mockbuild'nspawn_args=['--capability=cap_ipc_lock', '--bind=/tmp/mock-resolv.07zn85mq:/etc/resolv.conf', '--bind=/dev/btrfs-control', '--bind=/dev/mapper/control', '--bind=/dev/loop-control', '--bind=/dev/loop0', '--bind=/dev/loop1', '--bind=/dev/loop2', '--bind=/dev/loop3', '--bind=/dev/loop4', '--bind=/dev/loop5', '--bind=/dev/loop6', '--bind=/dev/loop7', '--bind=/dev/loop8', '--bind=/dev/loop9', '--bind=/dev/loop10', '--bind=/dev/loop11']unshare_net=TrueprintOutput=False)
Using nspawn with args ['--capability=cap_ipc_lock', '--bind=/tmp/mock-resolv.07zn85mq:/etc/resolv.conf', '--bind=/dev/btrfs-control', '--bind=/dev/mapper/control', '--bind=/dev/loop-control', '--bind=/dev/loop0', '--bind=/dev/loop1', '--bind=/dev/loop2', '--bind=/dev/loop3', '--bind=/dev/loop4', '--bind=/dev/loop5', '--bind=/dev/loop6', '--bind=/dev/loop7', '--bind=/dev/loop8', '--bind=/dev/loop9', '--bind=/dev/loop10', '--bind=/dev/loop11']
Executing command: ['/usr/bin/systemd-nspawn', '-q', '-M', 'c2493470b2c945729ce12363d434fefb', '-D', '/var/lib/mock/dist-ocs23-base-build-287463-27942/root', '-a', '-u', 'mockbuild', '--capability=cap_ipc_lock', '--bind=/tmp/mock-resolv.07zn85mq:/etc/resolv.conf', '--bind=/dev/btrfs-control', '--bind=/dev/mapper/control', '--bind=/dev/loop-control', '--bind=/dev/loop0', '--bind=/dev/loop1', '--bind=/dev/loop2', '--bind=/dev/loop3', '--bind=/dev/loop4', '--bind=/dev/loop5', '--bind=/dev/loop6', '--bind=/dev/loop7', '--bind=/dev/loop8', '--bind=/dev/loop9', '--bind=/dev/loop10', '--bind=/dev/loop11', '--console=pipe', '--setenv=TERM=vt100', '--setenv=SHELL=/bin/bash', '--setenv=HOME=/builddir', '--setenv=HOSTNAME=mock', '--setenv=PATH=/usr/bin:/bin:/usr/sbin:/sbin', '--setenv=PROMPT_COMMAND=printf "\\033]0;<mock-chroot>\\007"', '--setenv=PS1=<mock-chroot> \\s-\\v\\$ ', '--setenv=LANG=C.UTF-8', '--resolv-conf=off', 'bash', '--login', '-c', '/usr/bin/rpmbuild -bs --noclean --target x86_64 --nodeps /builddir/build/SPECS/capstone.spec'] with env {'TERM': 'vt100', 'SHELL': '/bin/bash', 'HOME': '/builddir', 'HOSTNAME': 'mock', 'PATH': '/usr/bin:/bin:/usr/sbin:/sbin', 'PROMPT_COMMAND': 'printf "\\033]0;<mock-chroot>\\007"', 'PS1': '<mock-chroot> \\s-\\v\\$ ', 'LANG': 'C.UTF-8', 'SYSTEMD_NSPAWN_TMPFS_TMP': '0', 'SYSTEMD_SECCOMP': '0'} and shell False
Building target platforms: x86_64
Building for target x86_64
Wrote: /builddir/build/SRPMS/capstone-5.0.1-3.ocs23.src.rpm
Child return code was: 0
ENTER ['do_with_status'](['bash', '--login', '-c', '/usr/bin/rpmbuild -bb --noclean --target x86_64 --nodeps /builddir/build/SPECS/capstone.spec'], chrootPath='/var/lib/mock/dist-ocs23-base-build-287463-27942/root'env={'TERM': 'vt100', 'SHELL': '/bin/bash', 'HOME': '/builddir', 'HOSTNAME': 'mock', 'PATH': '/usr/bin:/bin:/usr/sbin:/sbin', 'PROMPT_COMMAND': 'printf "\\033]0;<mock-chroot>\\007"', 'PS1': '<mock-chroot> \\s-\\v\\$ ', 'LANG': 'C.UTF-8'}shell=Falselogger=<mockbuild.trace_decorator.getLog object at 0x7fa4421dd5d0>timeout=86400uid=982gid=135user='mockbuild'nspawn_args=['--capability=cap_ipc_lock', '--bind=/tmp/mock-resolv.07zn85mq:/etc/resolv.conf', '--bind=/dev/btrfs-control', '--bind=/dev/mapper/control', '--bind=/dev/loop-control', '--bind=/dev/loop0', '--bind=/dev/loop1', '--bind=/dev/loop2', '--bind=/dev/loop3', '--bind=/dev/loop4', '--bind=/dev/loop5', '--bind=/dev/loop6', '--bind=/dev/loop7', '--bind=/dev/loop8', '--bind=/dev/loop9', '--bind=/dev/loop10', '--bind=/dev/loop11']unshare_net=TrueprintOutput=False)
Using nspawn with args ['--capability=cap_ipc_lock', '--bind=/tmp/mock-resolv.07zn85mq:/etc/resolv.conf', '--bind=/dev/btrfs-control', '--bind=/dev/mapper/control', '--bind=/dev/loop-control', '--bind=/dev/loop0', '--bind=/dev/loop1', '--bind=/dev/loop2', '--bind=/dev/loop3', '--bind=/dev/loop4', '--bind=/dev/loop5', '--bind=/dev/loop6', '--bind=/dev/loop7', '--bind=/dev/loop8', '--bind=/dev/loop9', '--bind=/dev/loop10', '--bind=/dev/loop11']
Executing command: ['/usr/bin/systemd-nspawn', '-q', '-M', '52a8d349ceda4833959015c41fde426c', '-D', '/var/lib/mock/dist-ocs23-base-build-287463-27942/root', '-a', '-u', 'mockbuild', '--capability=cap_ipc_lock', '--bind=/tmp/mock-resolv.07zn85mq:/etc/resolv.conf', '--bind=/dev/btrfs-control', '--bind=/dev/mapper/control', '--bind=/dev/loop-control', '--bind=/dev/loop0', '--bind=/dev/loop1', '--bind=/dev/loop2', '--bind=/dev/loop3', '--bind=/dev/loop4', '--bind=/dev/loop5', '--bind=/dev/loop6', '--bind=/dev/loop7', '--bind=/dev/loop8', '--bind=/dev/loop9', '--bind=/dev/loop10', '--bind=/dev/loop11', '--console=pipe', '--setenv=TERM=vt100', '--setenv=SHELL=/bin/bash', '--setenv=HOME=/builddir', '--setenv=HOSTNAME=mock', '--setenv=PATH=/usr/bin:/bin:/usr/sbin:/sbin', '--setenv=PROMPT_COMMAND=printf "\\033]0;<mock-chroot>\\007"', '--setenv=PS1=<mock-chroot> \\s-\\v\\$ ', '--setenv=LANG=C.UTF-8', '--resolv-conf=off', 'bash', '--login', '-c', '/usr/bin/rpmbuild -bb --noclean --target x86_64 --nodeps /builddir/build/SPECS/capstone.spec'] with env {'TERM': 'vt100', 'SHELL': '/bin/bash', 'HOME': '/builddir', 'HOSTNAME': 'mock', 'PATH': '/usr/bin:/bin:/usr/sbin:/sbin', 'PROMPT_COMMAND': 'printf "\\033]0;<mock-chroot>\\007"', 'PS1': '<mock-chroot> \\s-\\v\\$ ', 'LANG': 'C.UTF-8', 'SYSTEMD_NSPAWN_TMPFS_TMP': '0', 'SYSTEMD_SECCOMP': '0'} and shell False
Building target platforms: x86_64
Building for target x86_64
Executing(%prep): /bin/sh -e /var/tmp/rpm-tmp.qgYGUH
+ umask 022
+ cd /builddir/build/BUILD
+ cd /builddir/build/BUILD
+ rm -rf capstone-5.0.1
+ /usr/lib/rpm/rpmuncompress -x /builddir/build/SOURCES/5.0.1.tar.gz
+ STATUS=0
+ '[' 0 -ne 0 ']'
+ cd capstone-5.0.1
+ /usr/bin/chmod -Rf a+rX,u+w,g-w,o-w .
+ RPM_EC=0
++ jobs -p
+ exit 0
Executing(%build): /bin/sh -e /var/tmp/rpm-tmp.TC422L
+ umask 022
+ cd /builddir/build/BUILD
+ CFLAGS='-O2 -flto=auto -ffat-lto-objects -fexceptions -g -grecord-gcc-switches -pipe -Wall -Werror=format-security -Wp,-D_FORTIFY_SOURCE=2 -Wp,-D_GLIBCXX_ASSERTIONS -specs=/usr/lib/rpm/OpenCloudOS/OpenCloudOS-hardened-cc1 -fstack-protector-strong  -m64 -march=x86-64-v2 -mtune=generic -fasynchronous-unwind-tables -fstack-clash-protection -fcf-protection'
+ export CFLAGS
+ CXXFLAGS='-O2 -flto=auto -ffat-lto-objects -fexceptions -g -grecord-gcc-switches -pipe -Wall -Werror=format-security -Wp,-D_FORTIFY_SOURCE=2 -Wp,-D_GLIBCXX_ASSERTIONS -specs=/usr/lib/rpm/OpenCloudOS/OpenCloudOS-hardened-cc1 -fstack-protector-strong  -m64 -march=x86-64-v2 -mtune=generic -fasynchronous-unwind-tables -fstack-clash-protection -fcf-protection'
+ export CXXFLAGS
+ FFLAGS='-O2 -flto=auto -ffat-lto-objects -fexceptions -g -grecord-gcc-switches -pipe -Wall -Werror=format-security -Wp,-D_FORTIFY_SOURCE=2 -Wp,-D_GLIBCXX_ASSERTIONS -specs=/usr/lib/rpm/OpenCloudOS/OpenCloudOS-hardened-cc1 -fstack-protector-strong  -m64 -march=x86-64-v2 -mtune=generic -fasynchronous-unwind-tables -fstack-clash-protection -fcf-protection -I/usr/lib64/gfortran/modules'
+ export FFLAGS
+ FCFLAGS='-O2 -flto=auto -ffat-lto-objects -fexceptions -g -grecord-gcc-switches -pipe -Wall -Werror=format-security -Wp,-D_FORTIFY_SOURCE=2 -Wp,-D_GLIBCXX_ASSERTIONS -specs=/usr/lib/rpm/OpenCloudOS/OpenCloudOS-hardened-cc1 -fstack-protector-strong  -m64 -march=x86-64-v2 -mtune=generic -fasynchronous-unwind-tables -fstack-clash-protection -fcf-protection -I/usr/lib64/gfortran/modules'
+ export FCFLAGS
+ LDFLAGS='-Wl,-z,relro -Wl,--as-needed  -Wl,-z,now -specs=/usr/lib/rpm/OpenCloudOS/OpenCloudOS-hardened-ld  -Wl,--build-id=sha1'
+ export LDFLAGS
+ LT_SYS_LIBRARY_PATH=/usr/lib64:
+ export LT_SYS_LIBRARY_PATH
+ CC=gcc
+ export CC
+ CXX=g++
+ export CXX
+ cd capstone-5.0.1
+ /usr/bin/make -O -j32 V=1 VERBOSE=1 PYTHON3=/usr/bin/python3
gcc -O2 -flto=auto -ffat-lto-objects -fexceptions -g -grecord-gcc-switches -pipe -Wall -Werror=format-security -Wp,-D_FORTIFY_SOURCE=2 -Wp,-D_GLIBCXX_ASSERTIONS -specs=/usr/lib/rpm/OpenCloudOS/OpenCloudOS-hardened-cc1 -fstack-protector-strong  -m64 -march=x86-64-v2 -mtune=generic -fasynchronous-unwind-tables -fstack-clash-protection -fcf-protection -std=gnu99 -fPIC -Wall -Wwrite-strings -Wmissing-prototypes -Iinclude -DCAPSTONE_USE_SYS_DYN_MEM -DCAPSTONE_HAS_ARM -DCAPSTONE_HAS_ARM64 -DCAPSTONE_HAS_M68K -DCAPSTONE_HAS_MIPS -DCAPSTONE_HAS_SH -DCAPSTONE_HAS_POWERPC -DCAPSTONE_HAS_SPARC -DCAPSTONE_HAS_SYSZ -DCAPSTONE_HAS_X86 -DCAPSTONE_HAS_XCORE -DCAPSTONE_HAS_TMS320C64X -DCAPSTONE_HAS_M680X -DCAPSTONE_HAS_EVM -DCAPSTONE_HAS_RISCV -DCAPSTONE_HAS_WASM -DCAPSTONE_HAS_MOS65XX -DCAPSTONE_HAS_BPF -DCAPSTONE_HAS_TRICORE  -fvisibility=hidden -c MCInstrDesc.c -o MCInstrDesc.o
gcc -O2 -flto=auto -ffat-lto-objects -fexceptions -g -grecord-gcc-switches -pipe -Wall -Werror=format-security -Wp,-D_FORTIFY_SOURCE=2 -Wp,-D_GLIBCXX_ASSERTIONS -specs=/usr/lib/rpm/OpenCloudOS/OpenCloudOS-hardened-cc1 -fstack-protector-strong  -m64 -march=x86-64-v2 -mtune=generic -fasynchronous-unwind-tables -fstack-clash-protection -fcf-protection -std=gnu99 -fPIC -Wall -Wwrite-strings -Wmissing-prototypes -Iinclude -DCAPSTONE_USE_SYS_DYN_MEM -DCAPSTONE_HAS_ARM -DCAPSTONE_HAS_ARM64 -DCAPSTONE_HAS_M68K -DCAPSTONE_HAS_MIPS -DCAPSTONE_HAS_SH -DCAPSTONE_HAS_POWERPC -DCAPSTONE_HAS_SPARC -DCAPSTONE_HAS_SYSZ -DCAPSTONE_HAS_X86 -DCAPSTONE_HAS_XCORE -DCAPSTONE_HAS_TMS320C64X -DCAPSTONE_HAS_M680X -DCAPSTONE_HAS_EVM -DCAPSTONE_HAS_RISCV -DCAPSTONE_HAS_WASM -DCAPSTONE_HAS_MOS65XX -DCAPSTONE_HAS_BPF -DCAPSTONE_HAS_TRICORE  -fvisibility=hidden -c MCRegisterInfo.c -o MCRegisterInfo.o
gcc -O2 -flto=auto -ffat-lto-objects -fexceptions -g -grecord-gcc-switches -pipe -Wall -Werror=format-security -Wp,-D_FORTIFY_SOURCE=2 -Wp,-D_GLIBCXX_ASSERTIONS -specs=/usr/lib/rpm/OpenCloudOS/OpenCloudOS-hardened-cc1 -fstack-protector-strong  -m64 -march=x86-64-v2 -mtune=generic -fasynchronous-unwind-tables -fstack-clash-protection -fcf-protection -std=gnu99 -fPIC -Wall -Wwrite-strings -Wmissing-prototypes -Iinclude -DCAPSTONE_USE_SYS_DYN_MEM -DCAPSTONE_HAS_ARM -DCAPSTONE_HAS_ARM64 -DCAPSTONE_HAS_M68K -DCAPSTONE_HAS_MIPS -DCAPSTONE_HAS_SH -DCAPSTONE_HAS_POWERPC -DCAPSTONE_HAS_SPARC -DCAPSTONE_HAS_SYSZ -DCAPSTONE_HAS_X86 -DCAPSTONE_HAS_XCORE -DCAPSTONE_HAS_TMS320C64X -DCAPSTONE_HAS_M680X -DCAPSTONE_HAS_EVM -DCAPSTONE_HAS_RISCV -DCAPSTONE_HAS_WASM -DCAPSTONE_HAS_MOS65XX -DCAPSTONE_HAS_BPF -DCAPSTONE_HAS_TRICORE  -fvisibility=hidden -c utils.c -o utils.o
gcc -O2 -flto=auto -ffat-lto-objects -fexceptions -g -grecord-gcc-switches -pipe -Wall -Werror=format-security -Wp,-D_FORTIFY_SOURCE=2 -Wp,-D_GLIBCXX_ASSERTIONS -specs=/usr/lib/rpm/OpenCloudOS/OpenCloudOS-hardened-cc1 -fstack-protector-strong  -m64 -march=x86-64-v2 -mtune=generic -fasynchronous-unwind-tables -fstack-clash-protection -fcf-protection -std=gnu99 -fPIC -Wall -Wwrite-strings -Wmissing-prototypes -Iinclude -DCAPSTONE_USE_SYS_DYN_MEM -DCAPSTONE_HAS_ARM -DCAPSTONE_HAS_ARM64 -DCAPSTONE_HAS_M68K -DCAPSTONE_HAS_MIPS -DCAPSTONE_HAS_SH -DCAPSTONE_HAS_POWERPC -DCAPSTONE_HAS_SPARC -DCAPSTONE_HAS_SYSZ -DCAPSTONE_HAS_X86 -DCAPSTONE_HAS_XCORE -DCAPSTONE_HAS_TMS320C64X -DCAPSTONE_HAS_M680X -DCAPSTONE_HAS_EVM -DCAPSTONE_HAS_RISCV -DCAPSTONE_HAS_WASM -DCAPSTONE_HAS_MOS65XX -DCAPSTONE_HAS_BPF -DCAPSTONE_HAS_TRICORE  -fvisibility=hidden -c SStream.c -o SStream.o
gcc -O2 -flto=auto -ffat-lto-objects -fexceptions -g -grecord-gcc-switches -pipe -Wall -Werror=format-security -Wp,-D_FORTIFY_SOURCE=2 -Wp,-D_GLIBCXX_ASSERTIONS -specs=/usr/lib/rpm/OpenCloudOS/OpenCloudOS-hardened-cc1 -fstack-protector-strong  -m64 -march=x86-64-v2 -mtune=generic -fasynchronous-unwind-tables -fstack-clash-protection -fcf-protection -std=gnu99 -fPIC -Wall -Wwrite-strings -Wmissing-prototypes -Iinclude -DCAPSTONE_USE_SYS_DYN_MEM -DCAPSTONE_HAS_ARM -DCAPSTONE_HAS_ARM64 -DCAPSTONE_HAS_M68K -DCAPSTONE_HAS_MIPS -DCAPSTONE_HAS_SH -DCAPSTONE_HAS_POWERPC -DCAPSTONE_HAS_SPARC -DCAPSTONE_HAS_SYSZ -DCAPSTONE_HAS_X86 -DCAPSTONE_HAS_XCORE -DCAPSTONE_HAS_TMS320C64X -DCAPSTONE_HAS_M680X -DCAPSTONE_HAS_EVM -DCAPSTONE_HAS_RISCV -DCAPSTONE_HAS_WASM -DCAPSTONE_HAS_MOS65XX -DCAPSTONE_HAS_BPF -DCAPSTONE_HAS_TRICORE  -fvisibility=hidden -c MCInst.c -o MCInst.o
gcc -O2 -flto=auto -ffat-lto-objects -fexceptions -g -grecord-gcc-switches -pipe -Wall -Werror=format-security -Wp,-D_FORTIFY_SOURCE=2 -Wp,-D_GLIBCXX_ASSERTIONS -specs=/usr/lib/rpm/OpenCloudOS/OpenCloudOS-hardened-cc1 -fstack-protector-strong  -m64 -march=x86-64-v2 -mtune=generic -fasynchronous-unwind-tables -fstack-clash-protection -fcf-protection -std=gnu99 -fPIC -Wall -Wwrite-strings -Wmissing-prototypes -Iinclude -DCAPSTONE_USE_SYS_DYN_MEM -DCAPSTONE_HAS_ARM -DCAPSTONE_HAS_ARM64 -DCAPSTONE_HAS_M68K -DCAPSTONE_HAS_MIPS -DCAPSTONE_HAS_SH -DCAPSTONE_HAS_POWERPC -DCAPSTONE_HAS_SPARC -DCAPSTONE_HAS_SYSZ -DCAPSTONE_HAS_X86 -DCAPSTONE_HAS_XCORE -DCAPSTONE_HAS_TMS320C64X -DCAPSTONE_HAS_M680X -DCAPSTONE_HAS_EVM -DCAPSTONE_HAS_RISCV -DCAPSTONE_HAS_WASM -DCAPSTONE_HAS_MOS65XX -DCAPSTONE_HAS_BPF -DCAPSTONE_HAS_TRICORE  -fvisibility=hidden -c arch/AArch64/AArch64BaseInfo.c -o arch/AArch64/AArch64BaseInfo.o
gcc -O2 -flto=auto -ffat-lto-objects -fexceptions -g -grecord-gcc-switches -pipe -Wall -Werror=format-security -Wp,-D_FORTIFY_SOURCE=2 -Wp,-D_GLIBCXX_ASSERTIONS -specs=/usr/lib/rpm/OpenCloudOS/OpenCloudOS-hardened-cc1 -fstack-protector-strong  -m64 -march=x86-64-v2 -mtune=generic -fasynchronous-unwind-tables -fstack-clash-protection -fcf-protection -std=gnu99 -fPIC -Wall -Wwrite-strings -Wmissing-prototypes -Iinclude -DCAPSTONE_USE_SYS_DYN_MEM -DCAPSTONE_HAS_ARM -DCAPSTONE_HAS_ARM64 -DCAPSTONE_HAS_M68K -DCAPSTONE_HAS_MIPS -DCAPSTONE_HAS_SH -DCAPSTONE_HAS_POWERPC -DCAPSTONE_HAS_SPARC -DCAPSTONE_HAS_SYSZ -DCAPSTONE_HAS_X86 -DCAPSTONE_HAS_XCORE -DCAPSTONE_HAS_TMS320C64X -DCAPSTONE_HAS_M680X -DCAPSTONE_HAS_EVM -DCAPSTONE_HAS_RISCV -DCAPSTONE_HAS_WASM -DCAPSTONE_HAS_MOS65XX -DCAPSTONE_HAS_BPF -DCAPSTONE_HAS_TRICORE  -fvisibility=hidden -c Mapping.c -o Mapping.o
gcc -O2 -flto=auto -ffat-lto-objects -fexceptions -g -grecord-gcc-switches -pipe -Wall -Werror=format-security -Wp,-D_FORTIFY_SOURCE=2 -Wp,-D_GLIBCXX_ASSERTIONS -specs=/usr/lib/rpm/OpenCloudOS/OpenCloudOS-hardened-cc1 -fstack-protector-strong  -m64 -march=x86-64-v2 -mtune=generic -fasynchronous-unwind-tables -fstack-clash-protection -fcf-protection -std=gnu99 -fPIC -Wall -Wwrite-strings -Wmissing-prototypes -Iinclude -DCAPSTONE_USE_SYS_DYN_MEM -DCAPSTONE_HAS_ARM -DCAPSTONE_HAS_ARM64 -DCAPSTONE_HAS_M68K -DCAPSTONE_HAS_MIPS -DCAPSTONE_HAS_SH -DCAPSTONE_HAS_POWERPC -DCAPSTONE_HAS_SPARC -DCAPSTONE_HAS_SYSZ -DCAPSTONE_HAS_X86 -DCAPSTONE_HAS_XCORE -DCAPSTONE_HAS_TMS320C64X -DCAPSTONE_HAS_M680X -DCAPSTONE_HAS_EVM -DCAPSTONE_HAS_RISCV -DCAPSTONE_HAS_WASM -DCAPSTONE_HAS_MOS65XX -DCAPSTONE_HAS_BPF -DCAPSTONE_HAS_TRICORE  -fvisibility=hidden -c arch/M68K/M68KModule.c -o arch/M68K/M68KModule.o
gcc -O2 -flto=auto -ffat-lto-objects -fexceptions -g -grecord-gcc-switches -pipe -Wall -Werror=format-security -Wp,-D_FORTIFY_SOURCE=2 -Wp,-D_GLIBCXX_ASSERTIONS -specs=/usr/lib/rpm/OpenCloudOS/OpenCloudOS-hardened-cc1 -fstack-protector-strong  -m64 -march=x86-64-v2 -mtune=generic -fasynchronous-unwind-tables -fstack-clash-protection -fcf-protection -std=gnu99 -fPIC -Wall -Wwrite-strings -Wmissing-prototypes -Iinclude -DCAPSTONE_USE_SYS_DYN_MEM -DCAPSTONE_HAS_ARM -DCAPSTONE_HAS_ARM64 -DCAPSTONE_HAS_M68K -DCAPSTONE_HAS_MIPS -DCAPSTONE_HAS_SH -DCAPSTONE_HAS_POWERPC -DCAPSTONE_HAS_SPARC -DCAPSTONE_HAS_SYSZ -DCAPSTONE_HAS_X86 -DCAPSTONE_HAS_XCORE -DCAPSTONE_HAS_TMS320C64X -DCAPSTONE_HAS_M680X -DCAPSTONE_HAS_EVM -DCAPSTONE_HAS_RISCV -DCAPSTONE_HAS_WASM -DCAPSTONE_HAS_MOS65XX -DCAPSTONE_HAS_BPF -DCAPSTONE_HAS_TRICORE  -fvisibility=hidden -c arch/Mips/MipsModule.c -o arch/Mips/MipsModule.o
gcc -O2 -flto=auto -ffat-lto-objects -fexceptions -g -grecord-gcc-switches -pipe -Wall -Werror=format-security -Wp,-D_FORTIFY_SOURCE=2 -Wp,-D_GLIBCXX_ASSERTIONS -specs=/usr/lib/rpm/OpenCloudOS/OpenCloudOS-hardened-cc1 -fstack-protector-strong  -m64 -march=x86-64-v2 -mtune=generic -fasynchronous-unwind-tables -fstack-clash-protection -fcf-protection -std=gnu99 -fPIC -Wall -Wwrite-strings -Wmissing-prototypes -Iinclude -DCAPSTONE_USE_SYS_DYN_MEM -DCAPSTONE_HAS_ARM -DCAPSTONE_HAS_ARM64 -DCAPSTONE_HAS_M68K -DCAPSTONE_HAS_MIPS -DCAPSTONE_HAS_SH -DCAPSTONE_HAS_POWERPC -DCAPSTONE_HAS_SPARC -DCAPSTONE_HAS_SYSZ -DCAPSTONE_HAS_X86 -DCAPSTONE_HAS_XCORE -DCAPSTONE_HAS_TMS320C64X -DCAPSTONE_HAS_M680X -DCAPSTONE_HAS_EVM -DCAPSTONE_HAS_RISCV -DCAPSTONE_HAS_WASM -DCAPSTONE_HAS_MOS65XX -DCAPSTONE_HAS_BPF -DCAPSTONE_HAS_TRICORE  -fvisibility=hidden -c arch/AArch64/AArch64Module.c -o arch/AArch64/AArch64Module.o
gcc -O2 -flto=auto -ffat-lto-objects -fexceptions -g -grecord-gcc-switches -pipe -Wall -Werror=format-security -Wp,-D_FORTIFY_SOURCE=2 -Wp,-D_GLIBCXX_ASSERTIONS -specs=/usr/lib/rpm/OpenCloudOS/OpenCloudOS-hardened-cc1 -fstack-protector-strong  -m64 -march=x86-64-v2 -mtune=generic -fasynchronous-unwind-tables -fstack-clash-protection -fcf-protection -std=gnu99 -fPIC -Wall -Wwrite-strings -Wmissing-prototypes -Iinclude -DCAPSTONE_USE_SYS_DYN_MEM -DCAPSTONE_HAS_ARM -DCAPSTONE_HAS_ARM64 -DCAPSTONE_HAS_M68K -DCAPSTONE_HAS_MIPS -DCAPSTONE_HAS_SH -DCAPSTONE_HAS_POWERPC -DCAPSTONE_HAS_SPARC -DCAPSTONE_HAS_SYSZ -DCAPSTONE_HAS_X86 -DCAPSTONE_HAS_XCORE -DCAPSTONE_HAS_TMS320C64X -DCAPSTONE_HAS_M680X -DCAPSTONE_HAS_EVM -DCAPSTONE_HAS_RISCV -DCAPSTONE_HAS_WASM -DCAPSTONE_HAS_MOS65XX -DCAPSTONE_HAS_BPF -DCAPSTONE_HAS_TRICORE  -fvisibility=hidden -c arch/SystemZ/SystemZMCTargetDesc.c -o arch/SystemZ/SystemZMCTargetDesc.o
gcc -O2 -flto=auto -ffat-lto-objects -fexceptions -g -grecord-gcc-switches -pipe -Wall -Werror=format-security -Wp,-D_FORTIFY_SOURCE=2 -Wp,-D_GLIBCXX_ASSERTIONS -specs=/usr/lib/rpm/OpenCloudOS/OpenCloudOS-hardened-cc1 -fstack-protector-strong  -m64 -march=x86-64-v2 -mtune=generic -fasynchronous-unwind-tables -fstack-clash-protection -fcf-protection -std=gnu99 -fPIC -Wall -Wwrite-strings -Wmissing-prototypes -Iinclude -DCAPSTONE_USE_SYS_DYN_MEM -DCAPSTONE_HAS_ARM -DCAPSTONE_HAS_ARM64 -DCAPSTONE_HAS_M68K -DCAPSTONE_HAS_MIPS -DCAPSTONE_HAS_SH -DCAPSTONE_HAS_POWERPC -DCAPSTONE_HAS_SPARC -DCAPSTONE_HAS_SYSZ -DCAPSTONE_HAS_X86 -DCAPSTONE_HAS_XCORE -DCAPSTONE_HAS_TMS320C64X -DCAPSTONE_HAS_M680X -DCAPSTONE_HAS_EVM -DCAPSTONE_HAS_RISCV -DCAPSTONE_HAS_WASM -DCAPSTONE_HAS_MOS65XX -DCAPSTONE_HAS_BPF -DCAPSTONE_HAS_TRICORE  -fvisibility=hidden -c arch/ARM/ARMModule.c -o arch/ARM/ARMModule.o
gcc -O2 -flto=auto -ffat-lto-objects -fexceptions -g -grecord-gcc-switches -pipe -Wall -Werror=format-security -Wp,-D_FORTIFY_SOURCE=2 -Wp,-D_GLIBCXX_ASSERTIONS -specs=/usr/lib/rpm/OpenCloudOS/OpenCloudOS-hardened-cc1 -fstack-protector-strong  -m64 -march=x86-64-v2 -mtune=generic -fasynchronous-unwind-tables -fstack-clash-protection -fcf-protection -std=gnu99 -fPIC -Wall -Wwrite-strings -Wmissing-prototypes -Iinclude -DCAPSTONE_USE_SYS_DYN_MEM -DCAPSTONE_HAS_ARM -DCAPSTONE_HAS_ARM64 -DCAPSTONE_HAS_M68K -DCAPSTONE_HAS_MIPS -DCAPSTONE_HAS_SH -DCAPSTONE_HAS_POWERPC -DCAPSTONE_HAS_SPARC -DCAPSTONE_HAS_SYSZ -DCAPSTONE_HAS_X86 -DCAPSTONE_HAS_XCORE -DCAPSTONE_HAS_TMS320C64X -DCAPSTONE_HAS_M680X -DCAPSTONE_HAS_EVM -DCAPSTONE_HAS_RISCV -DCAPSTONE_HAS_WASM -DCAPSTONE_HAS_MOS65XX -DCAPSTONE_HAS_BPF -DCAPSTONE_HAS_TRICORE  -fvisibility=hidden -c arch/PowerPC/PPCModule.c -o arch/PowerPC/PPCModule.o
gcc -O2 -flto=auto -ffat-lto-objects -fexceptions -g -grecord-gcc-switches -pipe -Wall -Werror=format-security -Wp,-D_FORTIFY_SOURCE=2 -Wp,-D_GLIBCXX_ASSERTIONS -specs=/usr/lib/rpm/OpenCloudOS/OpenCloudOS-hardened-cc1 -fstack-protector-strong  -m64 -march=x86-64-v2 -mtune=generic -fasynchronous-unwind-tables -fstack-clash-protection -fcf-protection -std=gnu99 -fPIC -Wall -Wwrite-strings -Wmissing-prototypes -Iinclude -DCAPSTONE_USE_SYS_DYN_MEM -DCAPSTONE_HAS_ARM -DCAPSTONE_HAS_ARM64 -DCAPSTONE_HAS_M68K -DCAPSTONE_HAS_MIPS -DCAPSTONE_HAS_SH -DCAPSTONE_HAS_POWERPC -DCAPSTONE_HAS_SPARC -DCAPSTONE_HAS_SYSZ -DCAPSTONE_HAS_X86 -DCAPSTONE_HAS_XCORE -DCAPSTONE_HAS_TMS320C64X -DCAPSTONE_HAS_M680X -DCAPSTONE_HAS_EVM -DCAPSTONE_HAS_RISCV -DCAPSTONE_HAS_WASM -DCAPSTONE_HAS_MOS65XX -DCAPSTONE_HAS_BPF -DCAPSTONE_HAS_TRICORE  -fvisibility=hidden -c arch/RISCV/RISCVModule.c -o arch/RISCV/RISCVModule.o
gcc -O2 -flto=auto -ffat-lto-objects -fexceptions -g -grecord-gcc-switches -pipe -Wall -Werror=format-security -Wp,-D_FORTIFY_SOURCE=2 -Wp,-D_GLIBCXX_ASSERTIONS -specs=/usr/lib/rpm/OpenCloudOS/OpenCloudOS-hardened-cc1 -fstack-protector-strong  -m64 -march=x86-64-v2 -mtune=generic -fasynchronous-unwind-tables -fstack-clash-protection -fcf-protection -std=gnu99 -fPIC -Wall -Wwrite-strings -Wmissing-prototypes -Iinclude -DCAPSTONE_USE_SYS_DYN_MEM -DCAPSTONE_HAS_ARM -DCAPSTONE_HAS_ARM64 -DCAPSTONE_HAS_M68K -DCAPSTONE_HAS_MIPS -DCAPSTONE_HAS_SH -DCAPSTONE_HAS_POWERPC -DCAPSTONE_HAS_SPARC -DCAPSTONE_HAS_SYSZ -DCAPSTONE_HAS_X86 -DCAPSTONE_HAS_XCORE -DCAPSTONE_HAS_TMS320C64X -DCAPSTONE_HAS_M680X -DCAPSTONE_HAS_EVM -DCAPSTONE_HAS_RISCV -DCAPSTONE_HAS_WASM -DCAPSTONE_HAS_MOS65XX -DCAPSTONE_HAS_BPF -DCAPSTONE_HAS_TRICORE  -fvisibility=hidden -c arch/Sparc/SparcModule.c -o arch/Sparc/SparcModule.o
gcc -O2 -flto=auto -ffat-lto-objects -fexceptions -g -grecord-gcc-switches -pipe -Wall -Werror=format-security -Wp,-D_FORTIFY_SOURCE=2 -Wp,-D_GLIBCXX_ASSERTIONS -specs=/usr/lib/rpm/OpenCloudOS/OpenCloudOS-hardened-cc1 -fstack-protector-strong  -m64 -march=x86-64-v2 -mtune=generic -fasynchronous-unwind-tables -fstack-clash-protection -fcf-protection -std=gnu99 -fPIC -Wall -Wwrite-strings -Wmissing-prototypes -Iinclude -DCAPSTONE_USE_SYS_DYN_MEM -DCAPSTONE_HAS_ARM -DCAPSTONE_HAS_ARM64 -DCAPSTONE_HAS_M68K -DCAPSTONE_HAS_MIPS -DCAPSTONE_HAS_SH -DCAPSTONE_HAS_POWERPC -DCAPSTONE_HAS_SPARC -DCAPSTONE_HAS_SYSZ -DCAPSTONE_HAS_X86 -DCAPSTONE_HAS_XCORE -DCAPSTONE_HAS_TMS320C64X -DCAPSTONE_HAS_M680X -DCAPSTONE_HAS_EVM -DCAPSTONE_HAS_RISCV -DCAPSTONE_HAS_WASM -DCAPSTONE_HAS_MOS65XX -DCAPSTONE_HAS_BPF -DCAPSTONE_HAS_TRICORE  -fvisibility=hidden -c arch/SystemZ/SystemZModule.c -o arch/SystemZ/SystemZModule.o
gcc -O2 -flto=auto -ffat-lto-objects -fexceptions -g -grecord-gcc-switches -pipe -Wall -Werror=format-security -Wp,-D_FORTIFY_SOURCE=2 -Wp,-D_GLIBCXX_ASSERTIONS -specs=/usr/lib/rpm/OpenCloudOS/OpenCloudOS-hardened-cc1 -fstack-protector-strong  -m64 -march=x86-64-v2 -mtune=generic -fasynchronous-unwind-tables -fstack-clash-protection -fcf-protection -std=gnu99 -fPIC -Wall -Wwrite-strings -Wmissing-prototypes -Iinclude -DCAPSTONE_USE_SYS_DYN_MEM -DCAPSTONE_HAS_ARM -DCAPSTONE_HAS_ARM64 -DCAPSTONE_HAS_M68K -DCAPSTONE_HAS_MIPS -DCAPSTONE_HAS_SH -DCAPSTONE_HAS_POWERPC -DCAPSTONE_HAS_SPARC -DCAPSTONE_HAS_SYSZ -DCAPSTONE_HAS_X86 -DCAPSTONE_HAS_XCORE -DCAPSTONE_HAS_TMS320C64X -DCAPSTONE_HAS_M680X -DCAPSTONE_HAS_EVM -DCAPSTONE_HAS_RISCV -DCAPSTONE_HAS_WASM -DCAPSTONE_HAS_MOS65XX -DCAPSTONE_HAS_BPF -DCAPSTONE_HAS_TRICORE  -fvisibility=hidden -c arch/SH/SHModule.c -o arch/SH/SHModule.o
gcc -O2 -flto=auto -ffat-lto-objects -fexceptions -g -grecord-gcc-switches -pipe -Wall -Werror=format-security -Wp,-D_FORTIFY_SOURCE=2 -Wp,-D_GLIBCXX_ASSERTIONS -specs=/usr/lib/rpm/OpenCloudOS/OpenCloudOS-hardened-cc1 -fstack-protector-strong  -m64 -march=x86-64-v2 -mtune=generic -fasynchronous-unwind-tables -fstack-clash-protection -fcf-protection -std=gnu99 -fPIC -Wall -Wwrite-strings -Wmissing-prototypes -Iinclude -DCAPSTONE_USE_SYS_DYN_MEM -DCAPSTONE_HAS_ARM -DCAPSTONE_HAS_ARM64 -DCAPSTONE_HAS_M68K -DCAPSTONE_HAS_MIPS -DCAPSTONE_HAS_SH -DCAPSTONE_HAS_POWERPC -DCAPSTONE_HAS_SPARC -DCAPSTONE_HAS_SYSZ -DCAPSTONE_HAS_X86 -DCAPSTONE_HAS_XCORE -DCAPSTONE_HAS_TMS320C64X -DCAPSTONE_HAS_M680X -DCAPSTONE_HAS_EVM -DCAPSTONE_HAS_RISCV -DCAPSTONE_HAS_WASM -DCAPSTONE_HAS_MOS65XX -DCAPSTONE_HAS_BPF -DCAPSTONE_HAS_TRICORE  -fvisibility=hidden -c arch/RISCV/RISCVMapping.c -o arch/RISCV/RISCVMapping.o
gcc -O2 -flto=auto -ffat-lto-objects -fexceptions -g -grecord-gcc-switches -pipe -Wall -Werror=format-security -Wp,-D_FORTIFY_SOURCE=2 -Wp,-D_GLIBCXX_ASSERTIONS -specs=/usr/lib/rpm/OpenCloudOS/OpenCloudOS-hardened-cc1 -fstack-protector-strong  -m64 -march=x86-64-v2 -mtune=generic -fasynchronous-unwind-tables -fstack-clash-protection -fcf-protection -std=gnu99 -fPIC -Wall -Wwrite-strings -Wmissing-prototypes -Iinclude -DCAPSTONE_USE_SYS_DYN_MEM -DCAPSTONE_HAS_ARM -DCAPSTONE_HAS_ARM64 -DCAPSTONE_HAS_M68K -DCAPSTONE_HAS_MIPS -DCAPSTONE_HAS_SH -DCAPSTONE_HAS_POWERPC -DCAPSTONE_HAS_SPARC -DCAPSTONE_HAS_SYSZ -DCAPSTONE_HAS_X86 -DCAPSTONE_HAS_XCORE -DCAPSTONE_HAS_TMS320C64X -DCAPSTONE_HAS_M680X -DCAPSTONE_HAS_EVM -DCAPSTONE_HAS_RISCV -DCAPSTONE_HAS_WASM -DCAPSTONE_HAS_MOS65XX -DCAPSTONE_HAS_BPF -DCAPSTONE_HAS_TRICORE  -fvisibility=hidden -c arch/M68K/M68KInstPrinter.c -o arch/M68K/M68KInstPrinter.o
gcc -O2 -flto=auto -ffat-lto-objects -fexceptions -g -grecord-gcc-switches -pipe -Wall -Werror=format-security -Wp,-D_FORTIFY_SOURCE=2 -Wp,-D_GLIBCXX_ASSERTIONS -specs=/usr/lib/rpm/OpenCloudOS/OpenCloudOS-hardened-cc1 -fstack-protector-strong  -m64 -march=x86-64-v2 -mtune=generic -fasynchronous-unwind-tables -fstack-clash-protection -fcf-protection -std=gnu99 -fPIC -Wall -Wwrite-strings -Wmissing-prototypes -Iinclude -DCAPSTONE_USE_SYS_DYN_MEM -DCAPSTONE_HAS_ARM -DCAPSTONE_HAS_ARM64 -DCAPSTONE_HAS_M68K -DCAPSTONE_HAS_MIPS -DCAPSTONE_HAS_SH -DCAPSTONE_HAS_POWERPC -DCAPSTONE_HAS_SPARC -DCAPSTONE_HAS_SYSZ -DCAPSTONE_HAS_X86 -DCAPSTONE_HAS_XCORE -DCAPSTONE_HAS_TMS320C64X -DCAPSTONE_HAS_M680X -DCAPSTONE_HAS_EVM -DCAPSTONE_HAS_RISCV -DCAPSTONE_HAS_WASM -DCAPSTONE_HAS_MOS65XX -DCAPSTONE_HAS_BPF -DCAPSTONE_HAS_TRICORE  -fvisibility=hidden -c arch/Sparc/SparcMapping.c -o arch/Sparc/SparcMapping.o
gcc -O2 -flto=auto -ffat-lto-objects -fexceptions -g -grecord-gcc-switches -pipe -Wall -Werror=format-security -Wp,-D_FORTIFY_SOURCE=2 -Wp,-D_GLIBCXX_ASSERTIONS -specs=/usr/lib/rpm/OpenCloudOS/OpenCloudOS-hardened-cc1 -fstack-protector-strong  -m64 -march=x86-64-v2 -mtune=generic -fasynchronous-unwind-tables -fstack-clash-protection -fcf-protection -std=gnu99 -fPIC -Wall -Wwrite-strings -Wmissing-prototypes -Iinclude -DCAPSTONE_USE_SYS_DYN_MEM -DCAPSTONE_HAS_ARM -DCAPSTONE_HAS_ARM64 -DCAPSTONE_HAS_M68K -DCAPSTONE_HAS_MIPS -DCAPSTONE_HAS_SH -DCAPSTONE_HAS_POWERPC -DCAPSTONE_HAS_SPARC -DCAPSTONE_HAS_SYSZ -DCAPSTONE_HAS_X86 -DCAPSTONE_HAS_XCORE -DCAPSTONE_HAS_TMS320C64X -DCAPSTONE_HAS_M680X -DCAPSTONE_HAS_EVM -DCAPSTONE_HAS_RISCV -DCAPSTONE_HAS_WASM -DCAPSTONE_HAS_MOS65XX -DCAPSTONE_HAS_BPF -DCAPSTONE_HAS_TRICORE  -fvisibility=hidden -c arch/SystemZ/SystemZMapping.c -o arch/SystemZ/SystemZMapping.o
gcc -O2 -flto=auto -ffat-lto-objects -fexceptions -g -grecord-gcc-switches -pipe -Wall -Werror=format-security -Wp,-D_FORTIFY_SOURCE=2 -Wp,-D_GLIBCXX_ASSERTIONS -specs=/usr/lib/rpm/OpenCloudOS/OpenCloudOS-hardened-cc1 -fstack-protector-strong  -m64 -march=x86-64-v2 -mtune=generic -fasynchronous-unwind-tables -fstack-clash-protection -fcf-protection -std=gnu99 -fPIC -Wall -Wwrite-strings -Wmissing-prototypes -Iinclude -DCAPSTONE_USE_SYS_DYN_MEM -DCAPSTONE_HAS_ARM -DCAPSTONE_HAS_ARM64 -DCAPSTONE_HAS_M68K -DCAPSTONE_HAS_MIPS -DCAPSTONE_HAS_SH -DCAPSTONE_HAS_POWERPC -DCAPSTONE_HAS_SPARC -DCAPSTONE_HAS_SYSZ -DCAPSTONE_HAS_X86 -DCAPSTONE_HAS_XCORE -DCAPSTONE_HAS_TMS320C64X -DCAPSTONE_HAS_M680X -DCAPSTONE_HAS_EVM -DCAPSTONE_HAS_RISCV -DCAPSTONE_HAS_WASM -DCAPSTONE_HAS_MOS65XX -DCAPSTONE_HAS_BPF -DCAPSTONE_HAS_TRICORE  -fvisibility=hidden -c arch/Sparc/SparcDisassembler.c -o arch/Sparc/SparcDisassembler.o
gcc -O2 -flto=auto -ffat-lto-objects -fexceptions -g -grecord-gcc-switches -pipe -Wall -Werror=format-security -Wp,-D_FORTIFY_SOURCE=2 -Wp,-D_GLIBCXX_ASSERTIONS -specs=/usr/lib/rpm/OpenCloudOS/OpenCloudOS-hardened-cc1 -fstack-protector-strong  -m64 -march=x86-64-v2 -mtune=generic -fasynchronous-unwind-tables -fstack-clash-protection -fcf-protection -std=gnu99 -fPIC -Wall -Wwrite-strings -Wmissing-prototypes -Iinclude -DCAPSTONE_USE_SYS_DYN_MEM -DCAPSTONE_HAS_ARM -DCAPSTONE_HAS_ARM64 -DCAPSTONE_HAS_M68K -DCAPSTONE_HAS_MIPS -DCAPSTONE_HAS_SH -DCAPSTONE_HAS_POWERPC -DCAPSTONE_HAS_SPARC -DCAPSTONE_HAS_SYSZ -DCAPSTONE_HAS_X86 -DCAPSTONE_HAS_XCORE -DCAPSTONE_HAS_TMS320C64X -DCAPSTONE_HAS_M680X -DCAPSTONE_HAS_EVM -DCAPSTONE_HAS_RISCV -DCAPSTONE_HAS_WASM -DCAPSTONE_HAS_MOS65XX -DCAPSTONE_HAS_BPF -DCAPSTONE_HAS_TRICORE  -fvisibility=hidden -c arch/X86/X86InstPrinterCommon.c -o arch/X86/X86InstPrinterCommon.o
gcc -O2 -flto=auto -ffat-lto-objects -fexceptions -g -grecord-gcc-switches -pipe -Wall -Werror=format-security -Wp,-D_FORTIFY_SOURCE=2 -Wp,-D_GLIBCXX_ASSERTIONS -specs=/usr/lib/rpm/OpenCloudOS/OpenCloudOS-hardened-cc1 -fstack-protector-strong  -m64 -march=x86-64-v2 -mtune=generic -fasynchronous-unwind-tables -fstack-clash-protection -fcf-protection -std=gnu99 -fPIC -Wall -Wwrite-strings -Wmissing-prototypes -Iinclude -DCAPSTONE_USE_SYS_DYN_MEM -DCAPSTONE_HAS_ARM -DCAPSTONE_HAS_ARM64 -DCAPSTONE_HAS_M68K -DCAPSTONE_HAS_MIPS -DCAPSTONE_HAS_SH -DCAPSTONE_HAS_POWERPC -DCAPSTONE_HAS_SPARC -DCAPSTONE_HAS_SYSZ -DCAPSTONE_HAS_X86 -DCAPSTONE_HAS_XCORE -DCAPSTONE_HAS_TMS320C64X -DCAPSTONE_HAS_M680X -DCAPSTONE_HAS_EVM -DCAPSTONE_HAS_RISCV -DCAPSTONE_HAS_WASM -DCAPSTONE_HAS_MOS65XX -DCAPSTONE_HAS_BPF -DCAPSTONE_HAS_TRICORE  -fvisibility=hidden -c arch/XCore/XCoreMapping.c -o arch/XCore/XCoreMapping.o
gcc -O2 -flto=auto -ffat-lto-objects -fexceptions -g -grecord-gcc-switches -pipe -Wall -Werror=format-security -Wp,-D_FORTIFY_SOURCE=2 -Wp,-D_GLIBCXX_ASSERTIONS -specs=/usr/lib/rpm/OpenCloudOS/OpenCloudOS-hardened-cc1 -fstack-protector-strong  -m64 -march=x86-64-v2 -mtune=generic -fasynchronous-unwind-tables -fstack-clash-protection -fcf-protection -std=gnu99 -fPIC -Wall -Wwrite-strings -Wmissing-prototypes -Iinclude -DCAPSTONE_USE_SYS_DYN_MEM -DCAPSTONE_HAS_ARM -DCAPSTONE_HAS_ARM64 -DCAPSTONE_HAS_M68K -DCAPSTONE_HAS_MIPS -DCAPSTONE_HAS_SH -DCAPSTONE_HAS_POWERPC -DCAPSTONE_HAS_SPARC -DCAPSTONE_HAS_SYSZ -DCAPSTONE_HAS_X86 -DCAPSTONE_HAS_XCORE -DCAPSTONE_HAS_TMS320C64X -DCAPSTONE_HAS_M680X -DCAPSTONE_HAS_EVM -DCAPSTONE_HAS_RISCV -DCAPSTONE_HAS_WASM -DCAPSTONE_HAS_MOS65XX -DCAPSTONE_HAS_BPF -DCAPSTONE_HAS_TRICORE  -fvisibility=hidden -c arch/PowerPC/PPCMapping.c -o arch/PowerPC/PPCMapping.o
gcc -O2 -flto=auto -ffat-lto-objects -fexceptions -g -grecord-gcc-switches -pipe -Wall -Werror=format-security -Wp,-D_FORTIFY_SOURCE=2 -Wp,-D_GLIBCXX_ASSERTIONS -specs=/usr/lib/rpm/OpenCloudOS/OpenCloudOS-hardened-cc1 -fstack-protector-strong  -m64 -march=x86-64-v2 -mtune=generic -fasynchronous-unwind-tables -fstack-clash-protection -fcf-protection -std=gnu99 -fPIC -Wall -Wwrite-strings -Wmissing-prototypes -Iinclude -DCAPSTONE_USE_SYS_DYN_MEM -DCAPSTONE_HAS_ARM -DCAPSTONE_HAS_ARM64 -DCAPSTONE_HAS_M68K -DCAPSTONE_HAS_MIPS -DCAPSTONE_HAS_SH -DCAPSTONE_HAS_POWERPC -DCAPSTONE_HAS_SPARC -DCAPSTONE_HAS_SYSZ -DCAPSTONE_HAS_X86 -DCAPSTONE_HAS_XCORE -DCAPSTONE_HAS_TMS320C64X -DCAPSTONE_HAS_M680X -DCAPSTONE_HAS_EVM -DCAPSTONE_HAS_RISCV -DCAPSTONE_HAS_WASM -DCAPSTONE_HAS_MOS65XX -DCAPSTONE_HAS_BPF -DCAPSTONE_HAS_TRICORE  -fvisibility=hidden -c arch/Mips/MipsMapping.c -o arch/Mips/MipsMapping.o
gcc -O2 -flto=auto -ffat-lto-objects -fexceptions -g -grecord-gcc-switches -pipe -Wall -Werror=format-security -Wp,-D_FORTIFY_SOURCE=2 -Wp,-D_GLIBCXX_ASSERTIONS -specs=/usr/lib/rpm/OpenCloudOS/OpenCloudOS-hardened-cc1 -fstack-protector-strong  -m64 -march=x86-64-v2 -mtune=generic -fasynchronous-unwind-tables -fstack-clash-protection -fcf-protection -std=gnu99 -fPIC -Wall -Wwrite-strings -Wmissing-prototypes -Iinclude -DCAPSTONE_USE_SYS_DYN_MEM -DCAPSTONE_HAS_ARM -DCAPSTONE_HAS_ARM64 -DCAPSTONE_HAS_M68K -DCAPSTONE_HAS_MIPS -DCAPSTONE_HAS_SH -DCAPSTONE_HAS_POWERPC -DCAPSTONE_HAS_SPARC -DCAPSTONE_HAS_SYSZ -DCAPSTONE_HAS_X86 -DCAPSTONE_HAS_XCORE -DCAPSTONE_HAS_TMS320C64X -DCAPSTONE_HAS_M680X -DCAPSTONE_HAS_EVM -DCAPSTONE_HAS_RISCV -DCAPSTONE_HAS_WASM -DCAPSTONE_HAS_MOS65XX -DCAPSTONE_HAS_BPF -DCAPSTONE_HAS_TRICORE  -fvisibility=hidden -c arch/X86/X86Module.c -o arch/X86/X86Module.o
gcc -O2 -flto=auto -ffat-lto-objects -fexceptions -g -grecord-gcc-switches -pipe -Wall -Werror=format-security -Wp,-D_FORTIFY_SOURCE=2 -Wp,-D_GLIBCXX_ASSERTIONS -specs=/usr/lib/rpm/OpenCloudOS/OpenCloudOS-hardened-cc1 -fstack-protector-strong  -m64 -march=x86-64-v2 -mtune=generic -fasynchronous-unwind-tables -fstack-clash-protection -fcf-protection -std=gnu99 -fPIC -Wall -Wwrite-strings -Wmissing-prototypes -Iinclude -DCAPSTONE_USE_SYS_DYN_MEM -DCAPSTONE_HAS_ARM -DCAPSTONE_HAS_ARM64 -DCAPSTONE_HAS_M68K -DCAPSTONE_HAS_MIPS -DCAPSTONE_HAS_SH -DCAPSTONE_HAS_POWERPC -DCAPSTONE_HAS_SPARC -DCAPSTONE_HAS_SYSZ -DCAPSTONE_HAS_X86 -DCAPSTONE_HAS_XCORE -DCAPSTONE_HAS_TMS320C64X -DCAPSTONE_HAS_M680X -DCAPSTONE_HAS_EVM -DCAPSTONE_HAS_RISCV -DCAPSTONE_HAS_WASM -DCAPSTONE_HAS_MOS65XX -DCAPSTONE_HAS_BPF -DCAPSTONE_HAS_TRICORE  -fvisibility=hidden -c arch/SystemZ/SystemZInstPrinter.c -o arch/SystemZ/SystemZInstPrinter.o
gcc -O2 -flto=auto -ffat-lto-objects -fexceptions -g -grecord-gcc-switches -pipe -Wall -Werror=format-security -Wp,-D_FORTIFY_SOURCE=2 -Wp,-D_GLIBCXX_ASSERTIONS -specs=/usr/lib/rpm/OpenCloudOS/OpenCloudOS-hardened-cc1 -fstack-protector-strong  -m64 -march=x86-64-v2 -mtune=generic -fasynchronous-unwind-tables -fstack-clash-protection -fcf-protection -std=gnu99 -fPIC -Wall -Wwrite-strings -Wmissing-prototypes -Iinclude -DCAPSTONE_USE_SYS_DYN_MEM -DCAPSTONE_HAS_ARM -DCAPSTONE_HAS_ARM64 -DCAPSTONE_HAS_M68K -DCAPSTONE_HAS_MIPS -DCAPSTONE_HAS_SH -DCAPSTONE_HAS_POWERPC -DCAPSTONE_HAS_SPARC -DCAPSTONE_HAS_SYSZ -DCAPSTONE_HAS_X86 -DCAPSTONE_HAS_XCORE -DCAPSTONE_HAS_TMS320C64X -DCAPSTONE_HAS_M680X -DCAPSTONE_HAS_EVM -DCAPSTONE_HAS_RISCV -DCAPSTONE_HAS_WASM -DCAPSTONE_HAS_MOS65XX -DCAPSTONE_HAS_BPF -DCAPSTONE_HAS_TRICORE  -fvisibility=hidden -c arch/SH/SHInstPrinter.c -o arch/SH/SHInstPrinter.o
gcc -O2 -flto=auto -ffat-lto-objects -fexceptions -g -grecord-gcc-switches -pipe -Wall -Werror=format-security -Wp,-D_FORTIFY_SOURCE=2 -Wp,-D_GLIBCXX_ASSERTIONS -specs=/usr/lib/rpm/OpenCloudOS/OpenCloudOS-hardened-cc1 -fstack-protector-strong  -m64 -march=x86-64-v2 -mtune=generic -fasynchronous-unwind-tables -fstack-clash-protection -fcf-protection -std=gnu99 -fPIC -Wall -Wwrite-strings -Wmissing-prototypes -Iinclude -DCAPSTONE_USE_SYS_DYN_MEM -DCAPSTONE_HAS_ARM -DCAPSTONE_HAS_ARM64 -DCAPSTONE_HAS_M68K -DCAPSTONE_HAS_MIPS -DCAPSTONE_HAS_SH -DCAPSTONE_HAS_POWERPC -DCAPSTONE_HAS_SPARC -DCAPSTONE_HAS_SYSZ -DCAPSTONE_HAS_X86 -DCAPSTONE_HAS_XCORE -DCAPSTONE_HAS_TMS320C64X -DCAPSTONE_HAS_M680X -DCAPSTONE_HAS_EVM -DCAPSTONE_HAS_RISCV -DCAPSTONE_HAS_WASM -DCAPSTONE_HAS_MOS65XX -DCAPSTONE_HAS_BPF -DCAPSTONE_HAS_TRICORE  -fvisibility=hidden -c arch/RISCV/RISCVInstPrinter.c -o arch/RISCV/RISCVInstPrinter.o
gcc -O2 -flto=auto -ffat-lto-objects -fexceptions -g -grecord-gcc-switches -pipe -Wall -Werror=format-security -Wp,-D_FORTIFY_SOURCE=2 -Wp,-D_GLIBCXX_ASSERTIONS -specs=/usr/lib/rpm/OpenCloudOS/OpenCloudOS-hardened-cc1 -fstack-protector-strong  -m64 -march=x86-64-v2 -mtune=generic -fasynchronous-unwind-tables -fstack-clash-protection -fcf-protection -std=gnu99 -fPIC -Wall -Wwrite-strings -Wmissing-prototypes -Iinclude -DCAPSTONE_USE_SYS_DYN_MEM -DCAPSTONE_HAS_ARM -DCAPSTONE_HAS_ARM64 -DCAPSTONE_HAS_M68K -DCAPSTONE_HAS_MIPS -DCAPSTONE_HAS_SH -DCAPSTONE_HAS_POWERPC -DCAPSTONE_HAS_SPARC -DCAPSTONE_HAS_SYSZ -DCAPSTONE_HAS_X86 -DCAPSTONE_HAS_XCORE -DCAPSTONE_HAS_TMS320C64X -DCAPSTONE_HAS_M680X -DCAPSTONE_HAS_EVM -DCAPSTONE_HAS_RISCV -DCAPSTONE_HAS_WASM -DCAPSTONE_HAS_MOS65XX -DCAPSTONE_HAS_BPF -DCAPSTONE_HAS_TRICORE  -fvisibility=hidden -c arch/XCore/XCoreModule.c -o arch/XCore/XCoreModule.o
gcc -O2 -flto=auto -ffat-lto-objects -fexceptions -g -grecord-gcc-switches -pipe -Wall -Werror=format-security -Wp,-D_FORTIFY_SOURCE=2 -Wp,-D_GLIBCXX_ASSERTIONS -specs=/usr/lib/rpm/OpenCloudOS/OpenCloudOS-hardened-cc1 -fstack-protector-strong  -m64 -march=x86-64-v2 -mtune=generic -fasynchronous-unwind-tables -fstack-clash-protection -fcf-protection -std=gnu99 -fPIC -Wall -Wwrite-strings -Wmissing-prototypes -Iinclude -DCAPSTONE_USE_SYS_DYN_MEM -DCAPSTONE_HAS_ARM -DCAPSTONE_HAS_ARM64 -DCAPSTONE_HAS_M68K -DCAPSTONE_HAS_MIPS -DCAPSTONE_HAS_SH -DCAPSTONE_HAS_POWERPC -DCAPSTONE_HAS_SPARC -DCAPSTONE_HAS_SYSZ -DCAPSTONE_HAS_X86 -DCAPSTONE_HAS_XCORE -DCAPSTONE_HAS_TMS320C64X -DCAPSTONE_HAS_M680X -DCAPSTONE_HAS_EVM -DCAPSTONE_HAS_RISCV -DCAPSTONE_HAS_WASM -DCAPSTONE_HAS_MOS65XX -DCAPSTONE_HAS_BPF -DCAPSTONE_HAS_TRICORE  -fvisibility=hidden -c arch/ARM/ARMMapping.c -o arch/ARM/ARMMapping.o
gcc -O2 -flto=auto -ffat-lto-objects -fexceptions -g -grecord-gcc-switches -pipe -Wall -Werror=format-security -Wp,-D_FORTIFY_SOURCE=2 -Wp,-D_GLIBCXX_ASSERTIONS -specs=/usr/lib/rpm/OpenCloudOS/OpenCloudOS-hardened-cc1 -fstack-protector-strong  -m64 -march=x86-64-v2 -mtune=generic -fasynchronous-unwind-tables -fstack-clash-protection -fcf-protection -std=gnu99 -fPIC -Wall -Wwrite-strings -Wmissing-prototypes -Iinclude -DCAPSTONE_USE_SYS_DYN_MEM -DCAPSTONE_HAS_ARM -DCAPSTONE_HAS_ARM64 -DCAPSTONE_HAS_M68K -DCAPSTONE_HAS_MIPS -DCAPSTONE_HAS_SH -DCAPSTONE_HAS_POWERPC -DCAPSTONE_HAS_SPARC -DCAPSTONE_HAS_SYSZ -DCAPSTONE_HAS_X86 -DCAPSTONE_HAS_XCORE -DCAPSTONE_HAS_TMS320C64X -DCAPSTONE_HAS_M680X -DCAPSTONE_HAS_EVM -DCAPSTONE_HAS_RISCV -DCAPSTONE_HAS_WASM -DCAPSTONE_HAS_MOS65XX -DCAPSTONE_HAS_BPF -DCAPSTONE_HAS_TRICORE  -fvisibility=hidden -c arch/EVM/EVMInstPrinter.c -o arch/EVM/EVMInstPrinter.o
gcc -O2 -flto=auto -ffat-lto-objects -fexceptions -g -grecord-gcc-switches -pipe -Wall -Werror=format-security -Wp,-D_FORTIFY_SOURCE=2 -Wp,-D_GLIBCXX_ASSERTIONS -specs=/usr/lib/rpm/OpenCloudOS/OpenCloudOS-hardened-cc1 -fstack-protector-strong  -m64 -march=x86-64-v2 -mtune=generic -fasynchronous-unwind-tables -fstack-clash-protection -fcf-protection -std=gnu99 -fPIC -Wall -Wwrite-strings -Wmissing-prototypes -Iinclude -DCAPSTONE_USE_SYS_DYN_MEM -DCAPSTONE_HAS_ARM -DCAPSTONE_HAS_ARM64 -DCAPSTONE_HAS_M68K -DCAPSTONE_HAS_MIPS -DCAPSTONE_HAS_SH -DCAPSTONE_HAS_POWERPC -DCAPSTONE_HAS_SPARC -DCAPSTONE_HAS_SYSZ -DCAPSTONE_HAS_X86 -DCAPSTONE_HAS_XCORE -DCAPSTONE_HAS_TMS320C64X -DCAPSTONE_HAS_M680X -DCAPSTONE_HAS_EVM -DCAPSTONE_HAS_RISCV -DCAPSTONE_HAS_WASM -DCAPSTONE_HAS_MOS65XX -DCAPSTONE_HAS_BPF -DCAPSTONE_HAS_TRICORE  -fvisibility=hidden -c arch/EVM/EVMDisassembler.c -o arch/EVM/EVMDisassembler.o
gcc -O2 -flto=auto -ffat-lto-objects -fexceptions -g -grecord-gcc-switches -pipe -Wall -Werror=format-security -Wp,-D_FORTIFY_SOURCE=2 -Wp,-D_GLIBCXX_ASSERTIONS -specs=/usr/lib/rpm/OpenCloudOS/OpenCloudOS-hardened-cc1 -fstack-protector-strong  -m64 -march=x86-64-v2 -mtune=generic -fasynchronous-unwind-tables -fstack-clash-protection -fcf-protection -std=gnu99 -fPIC -Wall -Wwrite-strings -Wmissing-prototypes -Iinclude -DCAPSTONE_USE_SYS_DYN_MEM -DCAPSTONE_HAS_ARM -DCAPSTONE_HAS_ARM64 -DCAPSTONE_HAS_M68K -DCAPSTONE_HAS_MIPS -DCAPSTONE_HAS_SH -DCAPSTONE_HAS_POWERPC -DCAPSTONE_HAS_SPARC -DCAPSTONE_HAS_SYSZ -DCAPSTONE_HAS_X86 -DCAPSTONE_HAS_XCORE -DCAPSTONE_HAS_TMS320C64X -DCAPSTONE_HAS_M680X -DCAPSTONE_HAS_EVM -DCAPSTONE_HAS_RISCV -DCAPSTONE_HAS_WASM -DCAPSTONE_HAS_MOS65XX -DCAPSTONE_HAS_BPF -DCAPSTONE_HAS_TRICORE  -fvisibility=hidden -c cs.c -o cs.o
gcc -O2 -flto=auto -ffat-lto-objects -fexceptions -g -grecord-gcc-switches -pipe -Wall -Werror=format-security -Wp,-D_FORTIFY_SOURCE=2 -Wp,-D_GLIBCXX_ASSERTIONS -specs=/usr/lib/rpm/OpenCloudOS/OpenCloudOS-hardened-cc1 -fstack-protector-strong  -m64 -march=x86-64-v2 -mtune=generic -fasynchronous-unwind-tables -fstack-clash-protection -fcf-protection -std=gnu99 -fPIC -Wall -Wwrite-strings -Wmissing-prototypes -Iinclude -DCAPSTONE_USE_SYS_DYN_MEM -DCAPSTONE_HAS_ARM -DCAPSTONE_HAS_ARM64 -DCAPSTONE_HAS_M68K -DCAPSTONE_HAS_MIPS -DCAPSTONE_HAS_SH -DCAPSTONE_HAS_POWERPC -DCAPSTONE_HAS_SPARC -DCAPSTONE_HAS_SYSZ -DCAPSTONE_HAS_X86 -DCAPSTONE_HAS_XCORE -DCAPSTONE_HAS_TMS320C64X -DCAPSTONE_HAS_M680X -DCAPSTONE_HAS_EVM -DCAPSTONE_HAS_RISCV -DCAPSTONE_HAS_WASM -DCAPSTONE_HAS_MOS65XX -DCAPSTONE_HAS_BPF -DCAPSTONE_HAS_TRICORE  -fvisibility=hidden -c arch/TMS320C64x/TMS320C64xMapping.c -o arch/TMS320C64x/TMS320C64xMapping.o
gcc -O2 -flto=auto -ffat-lto-objects -fexceptions -g -grecord-gcc-switches -pipe -Wall -Werror=format-security -Wp,-D_FORTIFY_SOURCE=2 -Wp,-D_GLIBCXX_ASSERTIONS -specs=/usr/lib/rpm/OpenCloudOS/OpenCloudOS-hardened-cc1 -fstack-protector-strong  -m64 -march=x86-64-v2 -mtune=generic -fasynchronous-unwind-tables -fstack-clash-protection -fcf-protection -std=gnu99 -fPIC -Wall -Wwrite-strings -Wmissing-prototypes -Iinclude -DCAPSTONE_USE_SYS_DYN_MEM -DCAPSTONE_HAS_ARM -DCAPSTONE_HAS_ARM64 -DCAPSTONE_HAS_M68K -DCAPSTONE_HAS_MIPS -DCAPSTONE_HAS_SH -DCAPSTONE_HAS_POWERPC -DCAPSTONE_HAS_SPARC -DCAPSTONE_HAS_SYSZ -DCAPSTONE_HAS_X86 -DCAPSTONE_HAS_XCORE -DCAPSTONE_HAS_TMS320C64X -DCAPSTONE_HAS_M680X -DCAPSTONE_HAS_EVM -DCAPSTONE_HAS_RISCV -DCAPSTONE_HAS_WASM -DCAPSTONE_HAS_MOS65XX -DCAPSTONE_HAS_BPF -DCAPSTONE_HAS_TRICORE  -fvisibility=hidden -c arch/TMS320C64x/TMS320C64xModule.c -o arch/TMS320C64x/TMS320C64xModule.o
gcc -O2 -flto=auto -ffat-lto-objects -fexceptions -g -grecord-gcc-switches -pipe -Wall -Werror=format-security -Wp,-D_FORTIFY_SOURCE=2 -Wp,-D_GLIBCXX_ASSERTIONS -specs=/usr/lib/rpm/OpenCloudOS/OpenCloudOS-hardened-cc1 -fstack-protector-strong  -m64 -march=x86-64-v2 -mtune=generic -fasynchronous-unwind-tables -fstack-clash-protection -fcf-protection -std=gnu99 -fPIC -Wall -Wwrite-strings -Wmissing-prototypes -Iinclude -DCAPSTONE_USE_SYS_DYN_MEM -DCAPSTONE_HAS_ARM -DCAPSTONE_HAS_ARM64 -DCAPSTONE_HAS_M68K -DCAPSTONE_HAS_MIPS -DCAPSTONE_HAS_SH -DCAPSTONE_HAS_POWERPC -DCAPSTONE_HAS_SPARC -DCAPSTONE_HAS_SYSZ -DCAPSTONE_HAS_X86 -DCAPSTONE_HAS_XCORE -DCAPSTONE_HAS_TMS320C64X -DCAPSTONE_HAS_M680X -DCAPSTONE_HAS_EVM -DCAPSTONE_HAS_RISCV -DCAPSTONE_HAS_WASM -DCAPSTONE_HAS_MOS65XX -DCAPSTONE_HAS_BPF -DCAPSTONE_HAS_TRICORE  -fvisibility=hidden -c arch/M680X/M680XInstPrinter.c -o arch/M680X/M680XInstPrinter.o
gcc -O2 -flto=auto -ffat-lto-objects -fexceptions -g -grecord-gcc-switches -pipe -Wall -Werror=format-security -Wp,-D_FORTIFY_SOURCE=2 -Wp,-D_GLIBCXX_ASSERTIONS -specs=/usr/lib/rpm/OpenCloudOS/OpenCloudOS-hardened-cc1 -fstack-protector-strong  -m64 -march=x86-64-v2 -mtune=generic -fasynchronous-unwind-tables -fstack-clash-protection -fcf-protection -std=gnu99 -fPIC -Wall -Wwrite-strings -Wmissing-prototypes -Iinclude -DCAPSTONE_USE_SYS_DYN_MEM -DCAPSTONE_HAS_ARM -DCAPSTONE_HAS_ARM64 -DCAPSTONE_HAS_M68K -DCAPSTONE_HAS_MIPS -DCAPSTONE_HAS_SH -DCAPSTONE_HAS_POWERPC -DCAPSTONE_HAS_SPARC -DCAPSTONE_HAS_SYSZ -DCAPSTONE_HAS_X86 -DCAPSTONE_HAS_XCORE -DCAPSTONE_HAS_TMS320C64X -DCAPSTONE_HAS_M680X -DCAPSTONE_HAS_EVM -DCAPSTONE_HAS_RISCV -DCAPSTONE_HAS_WASM -DCAPSTONE_HAS_MOS65XX -DCAPSTONE_HAS_BPF -DCAPSTONE_HAS_TRICORE  -fvisibility=hidden -c arch/EVM/EVMModule.c -o arch/EVM/EVMModule.o
gcc -O2 -flto=auto -ffat-lto-objects -fexceptions -g -grecord-gcc-switches -pipe -Wall -Werror=format-security -Wp,-D_FORTIFY_SOURCE=2 -Wp,-D_GLIBCXX_ASSERTIONS -specs=/usr/lib/rpm/OpenCloudOS/OpenCloudOS-hardened-cc1 -fstack-protector-strong  -m64 -march=x86-64-v2 -mtune=generic -fasynchronous-unwind-tables -fstack-clash-protection -fcf-protection -std=gnu99 -fPIC -Wall -Wwrite-strings -Wmissing-prototypes -Iinclude -DCAPSTONE_USE_SYS_DYN_MEM -DCAPSTONE_HAS_ARM -DCAPSTONE_HAS_ARM64 -DCAPSTONE_HAS_M68K -DCAPSTONE_HAS_MIPS -DCAPSTONE_HAS_SH -DCAPSTONE_HAS_POWERPC -DCAPSTONE_HAS_SPARC -DCAPSTONE_HAS_SYSZ -DCAPSTONE_HAS_X86 -DCAPSTONE_HAS_XCORE -DCAPSTONE_HAS_TMS320C64X -DCAPSTONE_HAS_M680X -DCAPSTONE_HAS_EVM -DCAPSTONE_HAS_RISCV -DCAPSTONE_HAS_WASM -DCAPSTONE_HAS_MOS65XX -DCAPSTONE_HAS_BPF -DCAPSTONE_HAS_TRICORE  -fvisibility=hidden -c arch/WASM/WASMInstPrinter.c -o arch/WASM/WASMInstPrinter.o
gcc -O2 -flto=auto -ffat-lto-objects -fexceptions -g -grecord-gcc-switches -pipe -Wall -Werror=format-security -Wp,-D_FORTIFY_SOURCE=2 -Wp,-D_GLIBCXX_ASSERTIONS -specs=/usr/lib/rpm/OpenCloudOS/OpenCloudOS-hardened-cc1 -fstack-protector-strong  -m64 -march=x86-64-v2 -mtune=generic -fasynchronous-unwind-tables -fstack-clash-protection -fcf-protection -std=gnu99 -fPIC -Wall -Wwrite-strings -Wmissing-prototypes -Iinclude -DCAPSTONE_USE_SYS_DYN_MEM -DCAPSTONE_HAS_ARM -DCAPSTONE_HAS_ARM64 -DCAPSTONE_HAS_M68K -DCAPSTONE_HAS_MIPS -DCAPSTONE_HAS_SH -DCAPSTONE_HAS_POWERPC -DCAPSTONE_HAS_SPARC -DCAPSTONE_HAS_SYSZ -DCAPSTONE_HAS_X86 -DCAPSTONE_HAS_XCORE -DCAPSTONE_HAS_TMS320C64X -DCAPSTONE_HAS_M680X -DCAPSTONE_HAS_EVM -DCAPSTONE_HAS_RISCV -DCAPSTONE_HAS_WASM -DCAPSTONE_HAS_MOS65XX -DCAPSTONE_HAS_BPF -DCAPSTONE_HAS_TRICORE  -fvisibility=hidden -c arch/XCore/XCoreInstPrinter.c -o arch/XCore/XCoreInstPrinter.o
gcc -O2 -flto=auto -ffat-lto-objects -fexceptions -g -grecord-gcc-switches -pipe -Wall -Werror=format-security -Wp,-D_FORTIFY_SOURCE=2 -Wp,-D_GLIBCXX_ASSERTIONS -specs=/usr/lib/rpm/OpenCloudOS/OpenCloudOS-hardened-cc1 -fstack-protector-strong  -m64 -march=x86-64-v2 -mtune=generic -fasynchronous-unwind-tables -fstack-clash-protection -fcf-protection -std=gnu99 -fPIC -Wall -Wwrite-strings -Wmissing-prototypes -Iinclude -DCAPSTONE_USE_SYS_DYN_MEM -DCAPSTONE_HAS_ARM -DCAPSTONE_HAS_ARM64 -DCAPSTONE_HAS_M68K -DCAPSTONE_HAS_MIPS -DCAPSTONE_HAS_SH -DCAPSTONE_HAS_POWERPC -DCAPSTONE_HAS_SPARC -DCAPSTONE_HAS_SYSZ -DCAPSTONE_HAS_X86 -DCAPSTONE_HAS_XCORE -DCAPSTONE_HAS_TMS320C64X -DCAPSTONE_HAS_M680X -DCAPSTONE_HAS_EVM -DCAPSTONE_HAS_RISCV -DCAPSTONE_HAS_WASM -DCAPSTONE_HAS_MOS65XX -DCAPSTONE_HAS_BPF -DCAPSTONE_HAS_TRICORE  -fvisibility=hidden -c arch/EVM/EVMMapping.c -o arch/EVM/EVMMapping.o
gcc -O2 -flto=auto -ffat-lto-objects -fexceptions -g -grecord-gcc-switches -pipe -Wall -Werror=format-security -Wp,-D_FORTIFY_SOURCE=2 -Wp,-D_GLIBCXX_ASSERTIONS -specs=/usr/lib/rpm/OpenCloudOS/OpenCloudOS-hardened-cc1 -fstack-protector-strong  -m64 -march=x86-64-v2 -mtune=generic -fasynchronous-unwind-tables -fstack-clash-protection -fcf-protection -std=gnu99 -fPIC -Wall -Wwrite-strings -Wmissing-prototypes -Iinclude -DCAPSTONE_USE_SYS_DYN_MEM -DCAPSTONE_HAS_ARM -DCAPSTONE_HAS_ARM64 -DCAPSTONE_HAS_M68K -DCAPSTONE_HAS_MIPS -DCAPSTONE_HAS_SH -DCAPSTONE_HAS_POWERPC -DCAPSTONE_HAS_SPARC -DCAPSTONE_HAS_SYSZ -DCAPSTONE_HAS_X86 -DCAPSTONE_HAS_XCORE -DCAPSTONE_HAS_TMS320C64X -DCAPSTONE_HAS_M680X -DCAPSTONE_HAS_EVM -DCAPSTONE_HAS_RISCV -DCAPSTONE_HAS_WASM -DCAPSTONE_HAS_MOS65XX -DCAPSTONE_HAS_BPF -DCAPSTONE_HAS_TRICORE  -fvisibility=hidden -c arch/M680X/M680XModule.c -o arch/M680X/M680XModule.o
gcc -O2 -flto=auto -ffat-lto-objects -fexceptions -g -grecord-gcc-switches -pipe -Wall -Werror=format-security -Wp,-D_FORTIFY_SOURCE=2 -Wp,-D_GLIBCXX_ASSERTIONS -specs=/usr/lib/rpm/OpenCloudOS/OpenCloudOS-hardened-cc1 -fstack-protector-strong  -m64 -march=x86-64-v2 -mtune=generic -fasynchronous-unwind-tables -fstack-clash-protection -fcf-protection -std=gnu99 -fPIC -Wall -Wwrite-strings -Wmissing-prototypes -Iinclude -DCAPSTONE_USE_SYS_DYN_MEM -DCAPSTONE_HAS_ARM -DCAPSTONE_HAS_ARM64 -DCAPSTONE_HAS_M68K -DCAPSTONE_HAS_MIPS -DCAPSTONE_HAS_SH -DCAPSTONE_HAS_POWERPC -DCAPSTONE_HAS_SPARC -DCAPSTONE_HAS_SYSZ -DCAPSTONE_HAS_X86 -DCAPSTONE_HAS_XCORE -DCAPSTONE_HAS_TMS320C64X -DCAPSTONE_HAS_M680X -DCAPSTONE_HAS_EVM -DCAPSTONE_HAS_RISCV -DCAPSTONE_HAS_WASM -DCAPSTONE_HAS_MOS65XX -DCAPSTONE_HAS_BPF -DCAPSTONE_HAS_TRICORE  -fvisibility=hidden -c arch/X86/X86Disassembler.c -o arch/X86/X86Disassembler.o
gcc -O2 -flto=auto -ffat-lto-objects -fexceptions -g -grecord-gcc-switches -pipe -Wall -Werror=format-security -Wp,-D_FORTIFY_SOURCE=2 -Wp,-D_GLIBCXX_ASSERTIONS -specs=/usr/lib/rpm/OpenCloudOS/OpenCloudOS-hardened-cc1 -fstack-protector-strong  -m64 -march=x86-64-v2 -mtune=generic -fasynchronous-unwind-tables -fstack-clash-protection -fcf-protection -std=gnu99 -fPIC -Wall -Wwrite-strings -Wmissing-prototypes -Iinclude -DCAPSTONE_USE_SYS_DYN_MEM -DCAPSTONE_HAS_ARM -DCAPSTONE_HAS_ARM64 -DCAPSTONE_HAS_M68K -DCAPSTONE_HAS_MIPS -DCAPSTONE_HAS_SH -DCAPSTONE_HAS_POWERPC -DCAPSTONE_HAS_SPARC -DCAPSTONE_HAS_SYSZ -DCAPSTONE_HAS_X86 -DCAPSTONE_HAS_XCORE -DCAPSTONE_HAS_TMS320C64X -DCAPSTONE_HAS_M680X -DCAPSTONE_HAS_EVM -DCAPSTONE_HAS_RISCV -DCAPSTONE_HAS_WASM -DCAPSTONE_HAS_MOS65XX -DCAPSTONE_HAS_BPF -DCAPSTONE_HAS_TRICORE  -fvisibility=hidden -c arch/TMS320C64x/TMS320C64xInstPrinter.c -o arch/TMS320C64x/TMS320C64xInstPrinter.o
gcc -O2 -flto=auto -ffat-lto-objects -fexceptions -g -grecord-gcc-switches -pipe -Wall -Werror=format-security -Wp,-D_FORTIFY_SOURCE=2 -Wp,-D_GLIBCXX_ASSERTIONS -specs=/usr/lib/rpm/OpenCloudOS/OpenCloudOS-hardened-cc1 -fstack-protector-strong  -m64 -march=x86-64-v2 -mtune=generic -fasynchronous-unwind-tables -fstack-clash-protection -fcf-protection -std=gnu99 -fPIC -Wall -Wwrite-strings -Wmissing-prototypes -Iinclude -DCAPSTONE_USE_SYS_DYN_MEM -DCAPSTONE_HAS_ARM -DCAPSTONE_HAS_ARM64 -DCAPSTONE_HAS_M68K -DCAPSTONE_HAS_MIPS -DCAPSTONE_HAS_SH -DCAPSTONE_HAS_POWERPC -DCAPSTONE_HAS_SPARC -DCAPSTONE_HAS_SYSZ -DCAPSTONE_HAS_X86 -DCAPSTONE_HAS_XCORE -DCAPSTONE_HAS_TMS320C64X -DCAPSTONE_HAS_M680X -DCAPSTONE_HAS_EVM -DCAPSTONE_HAS_RISCV -DCAPSTONE_HAS_WASM -DCAPSTONE_HAS_MOS65XX -DCAPSTONE_HAS_BPF -DCAPSTONE_HAS_TRICORE  -fvisibility=hidden -c arch/MOS65XX/MOS65XXModule.c -o arch/MOS65XX/MOS65XXModule.o
gcc -O2 -flto=auto -ffat-lto-objects -fexceptions -g -grecord-gcc-switches -pipe -Wall -Werror=format-security -Wp,-D_FORTIFY_SOURCE=2 -Wp,-D_GLIBCXX_ASSERTIONS -specs=/usr/lib/rpm/OpenCloudOS/OpenCloudOS-hardened-cc1 -fstack-protector-strong  -m64 -march=x86-64-v2 -mtune=generic -fasynchronous-unwind-tables -fstack-clash-protection -fcf-protection -std=gnu99 -fPIC -Wall -Wwrite-strings -Wmissing-prototypes -Iinclude -DCAPSTONE_USE_SYS_DYN_MEM -DCAPSTONE_HAS_ARM -DCAPSTONE_HAS_ARM64 -DCAPSTONE_HAS_M68K -DCAPSTONE_HAS_MIPS -DCAPSTONE_HAS_SH -DCAPSTONE_HAS_POWERPC -DCAPSTONE_HAS_SPARC -DCAPSTONE_HAS_SYSZ -DCAPSTONE_HAS_X86 -DCAPSTONE_HAS_XCORE -DCAPSTONE_HAS_TMS320C64X -DCAPSTONE_HAS_M680X -DCAPSTONE_HAS_EVM -DCAPSTONE_HAS_RISCV -DCAPSTONE_HAS_WASM -DCAPSTONE_HAS_MOS65XX -DCAPSTONE_HAS_BPF -DCAPSTONE_HAS_TRICORE  -fvisibility=hidden -c arch/WASM/WASMDisassembler.c -o arch/WASM/WASMDisassembler.o
gcc -O2 -flto=auto -ffat-lto-objects -fexceptions -g -grecord-gcc-switches -pipe -Wall -Werror=format-security -Wp,-D_FORTIFY_SOURCE=2 -Wp,-D_GLIBCXX_ASSERTIONS -specs=/usr/lib/rpm/OpenCloudOS/OpenCloudOS-hardened-cc1 -fstack-protector-strong  -m64 -march=x86-64-v2 -mtune=generic -fasynchronous-unwind-tables -fstack-clash-protection -fcf-protection -std=gnu99 -fPIC -Wall -Wwrite-strings -Wmissing-prototypes -Iinclude -DCAPSTONE_USE_SYS_DYN_MEM -DCAPSTONE_HAS_ARM -DCAPSTONE_HAS_ARM64 -DCAPSTONE_HAS_M68K -DCAPSTONE_HAS_MIPS -DCAPSTONE_HAS_SH -DCAPSTONE_HAS_POWERPC -DCAPSTONE_HAS_SPARC -DCAPSTONE_HAS_SYSZ -DCAPSTONE_HAS_X86 -DCAPSTONE_HAS_XCORE -DCAPSTONE_HAS_TMS320C64X -DCAPSTONE_HAS_M680X -DCAPSTONE_HAS_EVM -DCAPSTONE_HAS_RISCV -DCAPSTONE_HAS_WASM -DCAPSTONE_HAS_MOS65XX -DCAPSTONE_HAS_BPF -DCAPSTONE_HAS_TRICORE  -fvisibility=hidden -c arch/WASM/WASMMapping.c -o arch/WASM/WASMMapping.o
gcc -O2 -flto=auto -ffat-lto-objects -fexceptions -g -grecord-gcc-switches -pipe -Wall -Werror=format-security -Wp,-D_FORTIFY_SOURCE=2 -Wp,-D_GLIBCXX_ASSERTIONS -specs=/usr/lib/rpm/OpenCloudOS/OpenCloudOS-hardened-cc1 -fstack-protector-strong  -m64 -march=x86-64-v2 -mtune=generic -fasynchronous-unwind-tables -fstack-clash-protection -fcf-protection -std=gnu99 -fPIC -Wall -Wwrite-strings -Wmissing-prototypes -Iinclude -DCAPSTONE_USE_SYS_DYN_MEM -DCAPSTONE_HAS_ARM -DCAPSTONE_HAS_ARM64 -DCAPSTONE_HAS_M68K -DCAPSTONE_HAS_MIPS -DCAPSTONE_HAS_SH -DCAPSTONE_HAS_POWERPC -DCAPSTONE_HAS_SPARC -DCAPSTONE_HAS_SYSZ -DCAPSTONE_HAS_X86 -DCAPSTONE_HAS_XCORE -DCAPSTONE_HAS_TMS320C64X -DCAPSTONE_HAS_M680X -DCAPSTONE_HAS_EVM -DCAPSTONE_HAS_RISCV -DCAPSTONE_HAS_WASM -DCAPSTONE_HAS_MOS65XX -DCAPSTONE_HAS_BPF -DCAPSTONE_HAS_TRICORE  -fvisibility=hidden -c arch/WASM/WASMModule.c -o arch/WASM/WASMModule.o
gcc -O2 -flto=auto -ffat-lto-objects -fexceptions -g -grecord-gcc-switches -pipe -Wall -Werror=format-security -Wp,-D_FORTIFY_SOURCE=2 -Wp,-D_GLIBCXX_ASSERTIONS -specs=/usr/lib/rpm/OpenCloudOS/OpenCloudOS-hardened-cc1 -fstack-protector-strong  -m64 -march=x86-64-v2 -mtune=generic -fasynchronous-unwind-tables -fstack-clash-protection -fcf-protection -std=gnu99 -fPIC -Wall -Wwrite-strings -Wmissing-prototypes -Iinclude -DCAPSTONE_USE_SYS_DYN_MEM -DCAPSTONE_HAS_ARM -DCAPSTONE_HAS_ARM64 -DCAPSTONE_HAS_M68K -DCAPSTONE_HAS_MIPS -DCAPSTONE_HAS_SH -DCAPSTONE_HAS_POWERPC -DCAPSTONE_HAS_SPARC -DCAPSTONE_HAS_SYSZ -DCAPSTONE_HAS_X86 -DCAPSTONE_HAS_XCORE -DCAPSTONE_HAS_TMS320C64X -DCAPSTONE_HAS_M680X -DCAPSTONE_HAS_EVM -DCAPSTONE_HAS_RISCV -DCAPSTONE_HAS_WASM -DCAPSTONE_HAS_MOS65XX -DCAPSTONE_HAS_BPF -DCAPSTONE_HAS_TRICORE  -fvisibility=hidden -c arch/Mips/MipsInstPrinter.c -o arch/Mips/MipsInstPrinter.o
gcc -O2 -flto=auto -ffat-lto-objects -fexceptions -g -grecord-gcc-switches -pipe -Wall -Werror=format-security -Wp,-D_FORTIFY_SOURCE=2 -Wp,-D_GLIBCXX_ASSERTIONS -specs=/usr/lib/rpm/OpenCloudOS/OpenCloudOS-hardened-cc1 -fstack-protector-strong  -m64 -march=x86-64-v2 -mtune=generic -fasynchronous-unwind-tables -fstack-clash-protection -fcf-protection -std=gnu99 -fPIC -Wall -Wwrite-strings -Wmissing-prototypes -Iinclude -DCAPSTONE_USE_SYS_DYN_MEM -DCAPSTONE_HAS_ARM -DCAPSTONE_HAS_ARM64 -DCAPSTONE_HAS_M68K -DCAPSTONE_HAS_MIPS -DCAPSTONE_HAS_SH -DCAPSTONE_HAS_POWERPC -DCAPSTONE_HAS_SPARC -DCAPSTONE_HAS_SYSZ -DCAPSTONE_HAS_X86 -DCAPSTONE_HAS_XCORE -DCAPSTONE_HAS_TMS320C64X -DCAPSTONE_HAS_M680X -DCAPSTONE_HAS_EVM -DCAPSTONE_HAS_RISCV -DCAPSTONE_HAS_WASM -DCAPSTONE_HAS_MOS65XX -DCAPSTONE_HAS_BPF -DCAPSTONE_HAS_TRICORE  -fvisibility=hidden -c arch/BPF/BPFDisassembler.c -o arch/BPF/BPFDisassembler.o
gcc -O2 -flto=auto -ffat-lto-objects -fexceptions -g -grecord-gcc-switches -pipe -Wall -Werror=format-security -Wp,-D_FORTIFY_SOURCE=2 -Wp,-D_GLIBCXX_ASSERTIONS -specs=/usr/lib/rpm/OpenCloudOS/OpenCloudOS-hardened-cc1 -fstack-protector-strong  -m64 -march=x86-64-v2 -mtune=generic -fasynchronous-unwind-tables -fstack-clash-protection -fcf-protection -std=gnu99 -fPIC -Wall -Wwrite-strings -Wmissing-prototypes -Iinclude -DCAPSTONE_USE_SYS_DYN_MEM -DCAPSTONE_HAS_ARM -DCAPSTONE_HAS_ARM64 -DCAPSTONE_HAS_M68K -DCAPSTONE_HAS_MIPS -DCAPSTONE_HAS_SH -DCAPSTONE_HAS_POWERPC -DCAPSTONE_HAS_SPARC -DCAPSTONE_HAS_SYSZ -DCAPSTONE_HAS_X86 -DCAPSTONE_HAS_XCORE -DCAPSTONE_HAS_TMS320C64X -DCAPSTONE_HAS_M680X -DCAPSTONE_HAS_EVM -DCAPSTONE_HAS_RISCV -DCAPSTONE_HAS_WASM -DCAPSTONE_HAS_MOS65XX -DCAPSTONE_HAS_BPF -DCAPSTONE_HAS_TRICORE  -fvisibility=hidden -c arch/BPF/BPFModule.c -o arch/BPF/BPFModule.o
mkdir -p .
echo 'Name: capstone' > ./capstone.pc
echo 'Description: Capstone disassembly engine' >> ./capstone.pc
echo 'Version: 5.0.1' >> ./capstone.pc
echo 'libdir=/usr/lib' >> ./capstone.pc
echo 'includedir=/usr/include/capstone' >> ./capstone.pc
echo 'archive=${libdir}/libcapstone.a' >> ./capstone.pc
echo 'Libs: -L${libdir} -lcapstone' >> ./capstone.pc
echo 'Cflags: -I${includedir}' >> ./capstone.pc
echo 'archs=arm aarch64 m68k mips powerpc sparc systemz x86 xcore tms320c64x m680x evm riscv mos65xx wasm bpf sh tricore' >> ./capstone.pc
gcc -O2 -flto=auto -ffat-lto-objects -fexceptions -g -grecord-gcc-switches -pipe -Wall -Werror=format-security -Wp,-D_FORTIFY_SOURCE=2 -Wp,-D_GLIBCXX_ASSERTIONS -specs=/usr/lib/rpm/OpenCloudOS/OpenCloudOS-hardened-cc1 -fstack-protector-strong  -m64 -march=x86-64-v2 -mtune=generic -fasynchronous-unwind-tables -fstack-clash-protection -fcf-protection -std=gnu99 -fPIC -Wall -Wwrite-strings -Wmissing-prototypes -Iinclude -DCAPSTONE_USE_SYS_DYN_MEM -DCAPSTONE_HAS_ARM -DCAPSTONE_HAS_ARM64 -DCAPSTONE_HAS_M68K -DCAPSTONE_HAS_MIPS -DCAPSTONE_HAS_SH -DCAPSTONE_HAS_POWERPC -DCAPSTONE_HAS_SPARC -DCAPSTONE_HAS_SYSZ -DCAPSTONE_HAS_X86 -DCAPSTONE_HAS_XCORE -DCAPSTONE_HAS_TMS320C64X -DCAPSTONE_HAS_M680X -DCAPSTONE_HAS_EVM -DCAPSTONE_HAS_RISCV -DCAPSTONE_HAS_WASM -DCAPSTONE_HAS_MOS65XX -DCAPSTONE_HAS_BPF -DCAPSTONE_HAS_TRICORE  -fvisibility=hidden -c arch/BPF/BPFMapping.c -o arch/BPF/BPFMapping.o
gcc -O2 -flto=auto -ffat-lto-objects -fexceptions -g -grecord-gcc-switches -pipe -Wall -Werror=format-security -Wp,-D_FORTIFY_SOURCE=2 -Wp,-D_GLIBCXX_ASSERTIONS -specs=/usr/lib/rpm/OpenCloudOS/OpenCloudOS-hardened-cc1 -fstack-protector-strong  -m64 -march=x86-64-v2 -mtune=generic -fasynchronous-unwind-tables -fstack-clash-protection -fcf-protection -std=gnu99 -fPIC -Wall -Wwrite-strings -Wmissing-prototypes -Iinclude -DCAPSTONE_USE_SYS_DYN_MEM -DCAPSTONE_HAS_ARM -DCAPSTONE_HAS_ARM64 -DCAPSTONE_HAS_M68K -DCAPSTONE_HAS_MIPS -DCAPSTONE_HAS_SH -DCAPSTONE_HAS_POWERPC -DCAPSTONE_HAS_SPARC -DCAPSTONE_HAS_SYSZ -DCAPSTONE_HAS_X86 -DCAPSTONE_HAS_XCORE -DCAPSTONE_HAS_TMS320C64X -DCAPSTONE_HAS_M680X -DCAPSTONE_HAS_EVM -DCAPSTONE_HAS_RISCV -DCAPSTONE_HAS_WASM -DCAPSTONE_HAS_MOS65XX -DCAPSTONE_HAS_BPF -DCAPSTONE_HAS_TRICORE  -fvisibility=hidden -c arch/BPF/BPFInstPrinter.c -o arch/BPF/BPFInstPrinter.o
gcc -O2 -flto=auto -ffat-lto-objects -fexceptions -g -grecord-gcc-switches -pipe -Wall -Werror=format-security -Wp,-D_FORTIFY_SOURCE=2 -Wp,-D_GLIBCXX_ASSERTIONS -specs=/usr/lib/rpm/OpenCloudOS/OpenCloudOS-hardened-cc1 -fstack-protector-strong  -m64 -march=x86-64-v2 -mtune=generic -fasynchronous-unwind-tables -fstack-clash-protection -fcf-protection -std=gnu99 -fPIC -Wall -Wwrite-strings -Wmissing-prototypes -Iinclude -DCAPSTONE_USE_SYS_DYN_MEM -DCAPSTONE_HAS_ARM -DCAPSTONE_HAS_ARM64 -DCAPSTONE_HAS_M68K -DCAPSTONE_HAS_MIPS -DCAPSTONE_HAS_SH -DCAPSTONE_HAS_POWERPC -DCAPSTONE_HAS_SPARC -DCAPSTONE_HAS_SYSZ -DCAPSTONE_HAS_X86 -DCAPSTONE_HAS_XCORE -DCAPSTONE_HAS_TMS320C64X -DCAPSTONE_HAS_M680X -DCAPSTONE_HAS_EVM -DCAPSTONE_HAS_RISCV -DCAPSTONE_HAS_WASM -DCAPSTONE_HAS_MOS65XX -DCAPSTONE_HAS_BPF -DCAPSTONE_HAS_TRICORE  -fvisibility=hidden -c arch/TriCore/TriCoreModule.c -o arch/TriCore/TriCoreModule.o
gcc -O2 -flto=auto -ffat-lto-objects -fexceptions -g -grecord-gcc-switches -pipe -Wall -Werror=format-security -Wp,-D_FORTIFY_SOURCE=2 -Wp,-D_GLIBCXX_ASSERTIONS -specs=/usr/lib/rpm/OpenCloudOS/OpenCloudOS-hardened-cc1 -fstack-protector-strong  -m64 -march=x86-64-v2 -mtune=generic -fasynchronous-unwind-tables -fstack-clash-protection -fcf-protection -std=gnu99 -fPIC -Wall -Wwrite-strings -Wmissing-prototypes -Iinclude -DCAPSTONE_USE_SYS_DYN_MEM -DCAPSTONE_HAS_ARM -DCAPSTONE_HAS_ARM64 -DCAPSTONE_HAS_M68K -DCAPSTONE_HAS_MIPS -DCAPSTONE_HAS_SH -DCAPSTONE_HAS_POWERPC -DCAPSTONE_HAS_SPARC -DCAPSTONE_HAS_SYSZ -DCAPSTONE_HAS_X86 -DCAPSTONE_HAS_XCORE -DCAPSTONE_HAS_TMS320C64X -DCAPSTONE_HAS_M680X -DCAPSTONE_HAS_EVM -DCAPSTONE_HAS_RISCV -DCAPSTONE_HAS_WASM -DCAPSTONE_HAS_MOS65XX -DCAPSTONE_HAS_BPF -DCAPSTONE_HAS_TRICORE  -fvisibility=hidden -c arch/RISCV/RISCVDisassembler.c -o arch/RISCV/RISCVDisassembler.o
gcc -O2 -flto=auto -ffat-lto-objects -fexceptions -g -grecord-gcc-switches -pipe -Wall -Werror=format-security -Wp,-D_FORTIFY_SOURCE=2 -Wp,-D_GLIBCXX_ASSERTIONS -specs=/usr/lib/rpm/OpenCloudOS/OpenCloudOS-hardened-cc1 -fstack-protector-strong  -m64 -march=x86-64-v2 -mtune=generic -fasynchronous-unwind-tables -fstack-clash-protection -fcf-protection -std=gnu99 -fPIC -Wall -Wwrite-strings -Wmissing-prototypes -Iinclude -DCAPSTONE_USE_SYS_DYN_MEM -DCAPSTONE_HAS_ARM -DCAPSTONE_HAS_ARM64 -DCAPSTONE_HAS_M68K -DCAPSTONE_HAS_MIPS -DCAPSTONE_HAS_SH -DCAPSTONE_HAS_POWERPC -DCAPSTONE_HAS_SPARC -DCAPSTONE_HAS_SYSZ -DCAPSTONE_HAS_X86 -DCAPSTONE_HAS_XCORE -DCAPSTONE_HAS_TMS320C64X -DCAPSTONE_HAS_M680X -DCAPSTONE_HAS_EVM -DCAPSTONE_HAS_RISCV -DCAPSTONE_HAS_WASM -DCAPSTONE_HAS_MOS65XX -DCAPSTONE_HAS_BPF -DCAPSTONE_HAS_TRICORE  -fvisibility=hidden -c arch/MOS65XX/MOS65XXDisassembler.c -o arch/MOS65XX/MOS65XXDisassembler.o
gcc -O2 -flto=auto -ffat-lto-objects -fexceptions -g -grecord-gcc-switches -pipe -Wall -Werror=format-security -Wp,-D_FORTIFY_SOURCE=2 -Wp,-D_GLIBCXX_ASSERTIONS -specs=/usr/lib/rpm/OpenCloudOS/OpenCloudOS-hardened-cc1 -fstack-protector-strong  -m64 -march=x86-64-v2 -mtune=generic -fasynchronous-unwind-tables -fstack-clash-protection -fcf-protection -std=gnu99 -fPIC -Wall -Wwrite-strings -Wmissing-prototypes -Iinclude -DCAPSTONE_USE_SYS_DYN_MEM -DCAPSTONE_HAS_ARM -DCAPSTONE_HAS_ARM64 -DCAPSTONE_HAS_M68K -DCAPSTONE_HAS_MIPS -DCAPSTONE_HAS_SH -DCAPSTONE_HAS_POWERPC -DCAPSTONE_HAS_SPARC -DCAPSTONE_HAS_SYSZ -DCAPSTONE_HAS_X86 -DCAPSTONE_HAS_XCORE -DCAPSTONE_HAS_TMS320C64X -DCAPSTONE_HAS_M680X -DCAPSTONE_HAS_EVM -DCAPSTONE_HAS_RISCV -DCAPSTONE_HAS_WASM -DCAPSTONE_HAS_MOS65XX -DCAPSTONE_HAS_BPF -DCAPSTONE_HAS_TRICORE  -fvisibility=hidden -c arch/X86/X86IntelInstPrinter.c -o arch/X86/X86IntelInstPrinter.o
gcc -O2 -flto=auto -ffat-lto-objects -fexceptions -g -grecord-gcc-switches -pipe -Wall -Werror=format-security -Wp,-D_FORTIFY_SOURCE=2 -Wp,-D_GLIBCXX_ASSERTIONS -specs=/usr/lib/rpm/OpenCloudOS/OpenCloudOS-hardened-cc1 -fstack-protector-strong  -m64 -march=x86-64-v2 -mtune=generic -fasynchronous-unwind-tables -fstack-clash-protection -fcf-protection -std=gnu99 -fPIC -Wall -Wwrite-strings -Wmissing-prototypes -Iinclude -DCAPSTONE_USE_SYS_DYN_MEM -DCAPSTONE_HAS_ARM -DCAPSTONE_HAS_ARM64 -DCAPSTONE_HAS_M68K -DCAPSTONE_HAS_MIPS -DCAPSTONE_HAS_SH -DCAPSTONE_HAS_POWERPC -DCAPSTONE_HAS_SPARC -DCAPSTONE_HAS_SYSZ -DCAPSTONE_HAS_X86 -DCAPSTONE_HAS_XCORE -DCAPSTONE_HAS_TMS320C64X -DCAPSTONE_HAS_M680X -DCAPSTONE_HAS_EVM -DCAPSTONE_HAS_RISCV -DCAPSTONE_HAS_WASM -DCAPSTONE_HAS_MOS65XX -DCAPSTONE_HAS_BPF -DCAPSTONE_HAS_TRICORE  -fvisibility=hidden -c arch/TriCore/TriCoreInstPrinter.c -o arch/TriCore/TriCoreInstPrinter.o
gcc -O2 -flto=auto -ffat-lto-objects -fexceptions -g -grecord-gcc-switches -pipe -Wall -Werror=format-security -Wp,-D_FORTIFY_SOURCE=2 -Wp,-D_GLIBCXX_ASSERTIONS -specs=/usr/lib/rpm/OpenCloudOS/OpenCloudOS-hardened-cc1 -fstack-protector-strong  -m64 -march=x86-64-v2 -mtune=generic -fasynchronous-unwind-tables -fstack-clash-protection -fcf-protection -std=gnu99 -fPIC -Wall -Wwrite-strings -Wmissing-prototypes -Iinclude -DCAPSTONE_USE_SYS_DYN_MEM -DCAPSTONE_HAS_ARM -DCAPSTONE_HAS_ARM64 -DCAPSTONE_HAS_M68K -DCAPSTONE_HAS_MIPS -DCAPSTONE_HAS_SH -DCAPSTONE_HAS_POWERPC -DCAPSTONE_HAS_SPARC -DCAPSTONE_HAS_SYSZ -DCAPSTONE_HAS_X86 -DCAPSTONE_HAS_XCORE -DCAPSTONE_HAS_TMS320C64X -DCAPSTONE_HAS_M680X -DCAPSTONE_HAS_EVM -DCAPSTONE_HAS_RISCV -DCAPSTONE_HAS_WASM -DCAPSTONE_HAS_MOS65XX -DCAPSTONE_HAS_BPF -DCAPSTONE_HAS_TRICORE  -fvisibility=hidden -c arch/TriCore/TriCoreMapping.c -o arch/TriCore/TriCoreMapping.o
gcc -O2 -flto=auto -ffat-lto-objects -fexceptions -g -grecord-gcc-switches -pipe -Wall -Werror=format-security -Wp,-D_FORTIFY_SOURCE=2 -Wp,-D_GLIBCXX_ASSERTIONS -specs=/usr/lib/rpm/OpenCloudOS/OpenCloudOS-hardened-cc1 -fstack-protector-strong  -m64 -march=x86-64-v2 -mtune=generic -fasynchronous-unwind-tables -fstack-clash-protection -fcf-protection -std=gnu99 -fPIC -Wall -Wwrite-strings -Wmissing-prototypes -Iinclude -DCAPSTONE_USE_SYS_DYN_MEM -DCAPSTONE_HAS_ARM -DCAPSTONE_HAS_ARM64 -DCAPSTONE_HAS_M68K -DCAPSTONE_HAS_MIPS -DCAPSTONE_HAS_SH -DCAPSTONE_HAS_POWERPC -DCAPSTONE_HAS_SPARC -DCAPSTONE_HAS_SYSZ -DCAPSTONE_HAS_X86 -DCAPSTONE_HAS_XCORE -DCAPSTONE_HAS_TMS320C64X -DCAPSTONE_HAS_M680X -DCAPSTONE_HAS_EVM -DCAPSTONE_HAS_RISCV -DCAPSTONE_HAS_WASM -DCAPSTONE_HAS_MOS65XX -DCAPSTONE_HAS_BPF -DCAPSTONE_HAS_TRICORE  -fvisibility=hidden -c arch/AArch64/AArch64Mapping.c -o arch/AArch64/AArch64Mapping.o
gcc -O2 -flto=auto -ffat-lto-objects -fexceptions -g -grecord-gcc-switches -pipe -Wall -Werror=format-security -Wp,-D_FORTIFY_SOURCE=2 -Wp,-D_GLIBCXX_ASSERTIONS -specs=/usr/lib/rpm/OpenCloudOS/OpenCloudOS-hardened-cc1 -fstack-protector-strong  -m64 -march=x86-64-v2 -mtune=generic -fasynchronous-unwind-tables -fstack-clash-protection -fcf-protection -std=gnu99 -fPIC -Wall -Wwrite-strings -Wmissing-prototypes -Iinclude -DCAPSTONE_USE_SYS_DYN_MEM -DCAPSTONE_HAS_ARM -DCAPSTONE_HAS_ARM64 -DCAPSTONE_HAS_M68K -DCAPSTONE_HAS_MIPS -DCAPSTONE_HAS_SH -DCAPSTONE_HAS_POWERPC -DCAPSTONE_HAS_SPARC -DCAPSTONE_HAS_SYSZ -DCAPSTONE_HAS_X86 -DCAPSTONE_HAS_XCORE -DCAPSTONE_HAS_TMS320C64X -DCAPSTONE_HAS_M680X -DCAPSTONE_HAS_EVM -DCAPSTONE_HAS_RISCV -DCAPSTONE_HAS_WASM -DCAPSTONE_HAS_MOS65XX -DCAPSTONE_HAS_BPF -DCAPSTONE_HAS_TRICORE  -fvisibility=hidden -c arch/SH/SHDisassembler.c -o arch/SH/SHDisassembler.o
gcc -O2 -flto=auto -ffat-lto-objects -fexceptions -g -grecord-gcc-switches -pipe -Wall -Werror=format-security -Wp,-D_FORTIFY_SOURCE=2 -Wp,-D_GLIBCXX_ASSERTIONS -specs=/usr/lib/rpm/OpenCloudOS/OpenCloudOS-hardened-cc1 -fstack-protector-strong  -m64 -march=x86-64-v2 -mtune=generic -fasynchronous-unwind-tables -fstack-clash-protection -fcf-protection -std=gnu99 -fPIC -Wall -Wwrite-strings -Wmissing-prototypes -Iinclude -DCAPSTONE_USE_SYS_DYN_MEM -DCAPSTONE_HAS_ARM -DCAPSTONE_HAS_ARM64 -DCAPSTONE_HAS_M68K -DCAPSTONE_HAS_MIPS -DCAPSTONE_HAS_SH -DCAPSTONE_HAS_POWERPC -DCAPSTONE_HAS_SPARC -DCAPSTONE_HAS_SYSZ -DCAPSTONE_HAS_X86 -DCAPSTONE_HAS_XCORE -DCAPSTONE_HAS_TMS320C64X -DCAPSTONE_HAS_M680X -DCAPSTONE_HAS_EVM -DCAPSTONE_HAS_RISCV -DCAPSTONE_HAS_WASM -DCAPSTONE_HAS_MOS65XX -DCAPSTONE_HAS_BPF -DCAPSTONE_HAS_TRICORE  -fvisibility=hidden -c arch/M680X/M680XDisassembler.c -o arch/M680X/M680XDisassembler.o
gcc -O2 -flto=auto -ffat-lto-objects -fexceptions -g -grecord-gcc-switches -pipe -Wall -Werror=format-security -Wp,-D_FORTIFY_SOURCE=2 -Wp,-D_GLIBCXX_ASSERTIONS -specs=/usr/lib/rpm/OpenCloudOS/OpenCloudOS-hardened-cc1 -fstack-protector-strong  -m64 -march=x86-64-v2 -mtune=generic -fasynchronous-unwind-tables -fstack-clash-protection -fcf-protection -std=gnu99 -fPIC -Wall -Wwrite-strings -Wmissing-prototypes -Iinclude -DCAPSTONE_USE_SYS_DYN_MEM -DCAPSTONE_HAS_ARM -DCAPSTONE_HAS_ARM64 -DCAPSTONE_HAS_M68K -DCAPSTONE_HAS_MIPS -DCAPSTONE_HAS_SH -DCAPSTONE_HAS_POWERPC -DCAPSTONE_HAS_SPARC -DCAPSTONE_HAS_SYSZ -DCAPSTONE_HAS_X86 -DCAPSTONE_HAS_XCORE -DCAPSTONE_HAS_TMS320C64X -DCAPSTONE_HAS_M680X -DCAPSTONE_HAS_EVM -DCAPSTONE_HAS_RISCV -DCAPSTONE_HAS_WASM -DCAPSTONE_HAS_MOS65XX -DCAPSTONE_HAS_BPF -DCAPSTONE_HAS_TRICORE  -fvisibility=hidden -c arch/XCore/XCoreDisassembler.c -o arch/XCore/XCoreDisassembler.o
gcc -O2 -flto=auto -ffat-lto-objects -fexceptions -g -grecord-gcc-switches -pipe -Wall -Werror=format-security -Wp,-D_FORTIFY_SOURCE=2 -Wp,-D_GLIBCXX_ASSERTIONS -specs=/usr/lib/rpm/OpenCloudOS/OpenCloudOS-hardened-cc1 -fstack-protector-strong  -m64 -march=x86-64-v2 -mtune=generic -fasynchronous-unwind-tables -fstack-clash-protection -fcf-protection -std=gnu99 -fPIC -Wall -Wwrite-strings -Wmissing-prototypes -Iinclude -DCAPSTONE_USE_SYS_DYN_MEM -DCAPSTONE_HAS_ARM -DCAPSTONE_HAS_ARM64 -DCAPSTONE_HAS_M68K -DCAPSTONE_HAS_MIPS -DCAPSTONE_HAS_SH -DCAPSTONE_HAS_POWERPC -DCAPSTONE_HAS_SPARC -DCAPSTONE_HAS_SYSZ -DCAPSTONE_HAS_X86 -DCAPSTONE_HAS_XCORE -DCAPSTONE_HAS_TMS320C64X -DCAPSTONE_HAS_M680X -DCAPSTONE_HAS_EVM -DCAPSTONE_HAS_RISCV -DCAPSTONE_HAS_WASM -DCAPSTONE_HAS_MOS65XX -DCAPSTONE_HAS_BPF -DCAPSTONE_HAS_TRICORE  -fvisibility=hidden -c arch/X86/X86ATTInstPrinter.c -o arch/X86/X86ATTInstPrinter.o
gcc -O2 -flto=auto -ffat-lto-objects -fexceptions -g -grecord-gcc-switches -pipe -Wall -Werror=format-security -Wp,-D_FORTIFY_SOURCE=2 -Wp,-D_GLIBCXX_ASSERTIONS -specs=/usr/lib/rpm/OpenCloudOS/OpenCloudOS-hardened-cc1 -fstack-protector-strong  -m64 -march=x86-64-v2 -mtune=generic -fasynchronous-unwind-tables -fstack-clash-protection -fcf-protection -std=gnu99 -fPIC -Wall -Wwrite-strings -Wmissing-prototypes -Iinclude -DCAPSTONE_USE_SYS_DYN_MEM -DCAPSTONE_HAS_ARM -DCAPSTONE_HAS_ARM64 -DCAPSTONE_HAS_M68K -DCAPSTONE_HAS_MIPS -DCAPSTONE_HAS_SH -DCAPSTONE_HAS_POWERPC -DCAPSTONE_HAS_SPARC -DCAPSTONE_HAS_SYSZ -DCAPSTONE_HAS_X86 -DCAPSTONE_HAS_XCORE -DCAPSTONE_HAS_TMS320C64X -DCAPSTONE_HAS_M680X -DCAPSTONE_HAS_EVM -DCAPSTONE_HAS_RISCV -DCAPSTONE_HAS_WASM -DCAPSTONE_HAS_MOS65XX -DCAPSTONE_HAS_BPF -DCAPSTONE_HAS_TRICORE  -fvisibility=hidden -c arch/TriCore/TriCoreDisassembler.c -o arch/TriCore/TriCoreDisassembler.o
gcc -O2 -flto=auto -ffat-lto-objects -fexceptions -g -grecord-gcc-switches -pipe -Wall -Werror=format-security -Wp,-D_FORTIFY_SOURCE=2 -Wp,-D_GLIBCXX_ASSERTIONS -specs=/usr/lib/rpm/OpenCloudOS/OpenCloudOS-hardened-cc1 -fstack-protector-strong  -m64 -march=x86-64-v2 -mtune=generic -fasynchronous-unwind-tables -fstack-clash-protection -fcf-protection -std=gnu99 -fPIC -Wall -Wwrite-strings -Wmissing-prototypes -Iinclude -DCAPSTONE_USE_SYS_DYN_MEM -DCAPSTONE_HAS_ARM -DCAPSTONE_HAS_ARM64 -DCAPSTONE_HAS_M68K -DCAPSTONE_HAS_MIPS -DCAPSTONE_HAS_SH -DCAPSTONE_HAS_POWERPC -DCAPSTONE_HAS_SPARC -DCAPSTONE_HAS_SYSZ -DCAPSTONE_HAS_X86 -DCAPSTONE_HAS_XCORE -DCAPSTONE_HAS_TMS320C64X -DCAPSTONE_HAS_M680X -DCAPSTONE_HAS_EVM -DCAPSTONE_HAS_RISCV -DCAPSTONE_HAS_WASM -DCAPSTONE_HAS_MOS65XX -DCAPSTONE_HAS_BPF -DCAPSTONE_HAS_TRICORE  -fvisibility=hidden -c arch/TMS320C64x/TMS320C64xDisassembler.c -o arch/TMS320C64x/TMS320C64xDisassembler.o
gcc -O2 -flto=auto -ffat-lto-objects -fexceptions -g -grecord-gcc-switches -pipe -Wall -Werror=format-security -Wp,-D_FORTIFY_SOURCE=2 -Wp,-D_GLIBCXX_ASSERTIONS -specs=/usr/lib/rpm/OpenCloudOS/OpenCloudOS-hardened-cc1 -fstack-protector-strong  -m64 -march=x86-64-v2 -mtune=generic -fasynchronous-unwind-tables -fstack-clash-protection -fcf-protection -std=gnu99 -fPIC -Wall -Wwrite-strings -Wmissing-prototypes -Iinclude -DCAPSTONE_USE_SYS_DYN_MEM -DCAPSTONE_HAS_ARM -DCAPSTONE_HAS_ARM64 -DCAPSTONE_HAS_M68K -DCAPSTONE_HAS_MIPS -DCAPSTONE_HAS_SH -DCAPSTONE_HAS_POWERPC -DCAPSTONE_HAS_SPARC -DCAPSTONE_HAS_SYSZ -DCAPSTONE_HAS_X86 -DCAPSTONE_HAS_XCORE -DCAPSTONE_HAS_TMS320C64X -DCAPSTONE_HAS_M680X -DCAPSTONE_HAS_EVM -DCAPSTONE_HAS_RISCV -DCAPSTONE_HAS_WASM -DCAPSTONE_HAS_MOS65XX -DCAPSTONE_HAS_BPF -DCAPSTONE_HAS_TRICORE  -fvisibility=hidden -c arch/PowerPC/PPCDisassembler.c -o arch/PowerPC/PPCDisassembler.o
gcc -O2 -flto=auto -ffat-lto-objects -fexceptions -g -grecord-gcc-switches -pipe -Wall -Werror=format-security -Wp,-D_FORTIFY_SOURCE=2 -Wp,-D_GLIBCXX_ASSERTIONS -specs=/usr/lib/rpm/OpenCloudOS/OpenCloudOS-hardened-cc1 -fstack-protector-strong  -m64 -march=x86-64-v2 -mtune=generic -fasynchronous-unwind-tables -fstack-clash-protection -fcf-protection -std=gnu99 -fPIC -Wall -Wwrite-strings -Wmissing-prototypes -Iinclude -DCAPSTONE_USE_SYS_DYN_MEM -DCAPSTONE_HAS_ARM -DCAPSTONE_HAS_ARM64 -DCAPSTONE_HAS_M68K -DCAPSTONE_HAS_MIPS -DCAPSTONE_HAS_SH -DCAPSTONE_HAS_POWERPC -DCAPSTONE_HAS_SPARC -DCAPSTONE_HAS_SYSZ -DCAPSTONE_HAS_X86 -DCAPSTONE_HAS_XCORE -DCAPSTONE_HAS_TMS320C64X -DCAPSTONE_HAS_M680X -DCAPSTONE_HAS_EVM -DCAPSTONE_HAS_RISCV -DCAPSTONE_HAS_WASM -DCAPSTONE_HAS_MOS65XX -DCAPSTONE_HAS_BPF -DCAPSTONE_HAS_TRICORE  -fvisibility=hidden -c arch/X86/X86Mapping.c -o arch/X86/X86Mapping.o
gcc -O2 -flto=auto -ffat-lto-objects -fexceptions -g -grecord-gcc-switches -pipe -Wall -Werror=format-security -Wp,-D_FORTIFY_SOURCE=2 -Wp,-D_GLIBCXX_ASSERTIONS -specs=/usr/lib/rpm/OpenCloudOS/OpenCloudOS-hardened-cc1 -fstack-protector-strong  -m64 -march=x86-64-v2 -mtune=generic -fasynchronous-unwind-tables -fstack-clash-protection -fcf-protection -std=gnu99 -fPIC -Wall -Wwrite-strings -Wmissing-prototypes -Iinclude -DCAPSTONE_USE_SYS_DYN_MEM -DCAPSTONE_HAS_ARM -DCAPSTONE_HAS_ARM64 -DCAPSTONE_HAS_M68K -DCAPSTONE_HAS_MIPS -DCAPSTONE_HAS_SH -DCAPSTONE_HAS_POWERPC -DCAPSTONE_HAS_SPARC -DCAPSTONE_HAS_SYSZ -DCAPSTONE_HAS_X86 -DCAPSTONE_HAS_XCORE -DCAPSTONE_HAS_TMS320C64X -DCAPSTONE_HAS_M680X -DCAPSTONE_HAS_EVM -DCAPSTONE_HAS_RISCV -DCAPSTONE_HAS_WASM -DCAPSTONE_HAS_MOS65XX -DCAPSTONE_HAS_BPF -DCAPSTONE_HAS_TRICORE  -fvisibility=hidden -c arch/Mips/MipsDisassembler.c -o arch/Mips/MipsDisassembler.o
gcc -O2 -flto=auto -ffat-lto-objects -fexceptions -g -grecord-gcc-switches -pipe -Wall -Werror=format-security -Wp,-D_FORTIFY_SOURCE=2 -Wp,-D_GLIBCXX_ASSERTIONS -specs=/usr/lib/rpm/OpenCloudOS/OpenCloudOS-hardened-cc1 -fstack-protector-strong  -m64 -march=x86-64-v2 -mtune=generic -fasynchronous-unwind-tables -fstack-clash-protection -fcf-protection -std=gnu99 -fPIC -Wall -Wwrite-strings -Wmissing-prototypes -Iinclude -DCAPSTONE_USE_SYS_DYN_MEM -DCAPSTONE_HAS_ARM -DCAPSTONE_HAS_ARM64 -DCAPSTONE_HAS_M68K -DCAPSTONE_HAS_MIPS -DCAPSTONE_HAS_SH -DCAPSTONE_HAS_POWERPC -DCAPSTONE_HAS_SPARC -DCAPSTONE_HAS_SYSZ -DCAPSTONE_HAS_X86 -DCAPSTONE_HAS_XCORE -DCAPSTONE_HAS_TMS320C64X -DCAPSTONE_HAS_M680X -DCAPSTONE_HAS_EVM -DCAPSTONE_HAS_RISCV -DCAPSTONE_HAS_WASM -DCAPSTONE_HAS_MOS65XX -DCAPSTONE_HAS_BPF -DCAPSTONE_HAS_TRICORE  -fvisibility=hidden -c arch/AArch64/AArch64InstPrinter.c -o arch/AArch64/AArch64InstPrinter.o
gcc -O2 -flto=auto -ffat-lto-objects -fexceptions -g -grecord-gcc-switches -pipe -Wall -Werror=format-security -Wp,-D_FORTIFY_SOURCE=2 -Wp,-D_GLIBCXX_ASSERTIONS -specs=/usr/lib/rpm/OpenCloudOS/OpenCloudOS-hardened-cc1 -fstack-protector-strong  -m64 -march=x86-64-v2 -mtune=generic -fasynchronous-unwind-tables -fstack-clash-protection -fcf-protection -std=gnu99 -fPIC -Wall -Wwrite-strings -Wmissing-prototypes -Iinclude -DCAPSTONE_USE_SYS_DYN_MEM -DCAPSTONE_HAS_ARM -DCAPSTONE_HAS_ARM64 -DCAPSTONE_HAS_M68K -DCAPSTONE_HAS_MIPS -DCAPSTONE_HAS_SH -DCAPSTONE_HAS_POWERPC -DCAPSTONE_HAS_SPARC -DCAPSTONE_HAS_SYSZ -DCAPSTONE_HAS_X86 -DCAPSTONE_HAS_XCORE -DCAPSTONE_HAS_TMS320C64X -DCAPSTONE_HAS_M680X -DCAPSTONE_HAS_EVM -DCAPSTONE_HAS_RISCV -DCAPSTONE_HAS_WASM -DCAPSTONE_HAS_MOS65XX -DCAPSTONE_HAS_BPF -DCAPSTONE_HAS_TRICORE  -fvisibility=hidden -c arch/ARM/ARMInstPrinter.c -o arch/ARM/ARMInstPrinter.o
gcc -O2 -flto=auto -ffat-lto-objects -fexceptions -g -grecord-gcc-switches -pipe -Wall -Werror=format-security -Wp,-D_FORTIFY_SOURCE=2 -Wp,-D_GLIBCXX_ASSERTIONS -specs=/usr/lib/rpm/OpenCloudOS/OpenCloudOS-hardened-cc1 -fstack-protector-strong  -m64 -march=x86-64-v2 -mtune=generic -fasynchronous-unwind-tables -fstack-clash-protection -fcf-protection -std=gnu99 -fPIC -Wall -Wwrite-strings -Wmissing-prototypes -Iinclude -DCAPSTONE_USE_SYS_DYN_MEM -DCAPSTONE_HAS_ARM -DCAPSTONE_HAS_ARM64 -DCAPSTONE_HAS_M68K -DCAPSTONE_HAS_MIPS -DCAPSTONE_HAS_SH -DCAPSTONE_HAS_POWERPC -DCAPSTONE_HAS_SPARC -DCAPSTONE_HAS_SYSZ -DCAPSTONE_HAS_X86 -DCAPSTONE_HAS_XCORE -DCAPSTONE_HAS_TMS320C64X -DCAPSTONE_HAS_M680X -DCAPSTONE_HAS_EVM -DCAPSTONE_HAS_RISCV -DCAPSTONE_HAS_WASM -DCAPSTONE_HAS_MOS65XX -DCAPSTONE_HAS_BPF -DCAPSTONE_HAS_TRICORE  -fvisibility=hidden -c arch/X86/X86DisassemblerDecoder.c -o arch/X86/X86DisassemblerDecoder.o
gcc -O2 -flto=auto -ffat-lto-objects -fexceptions -g -grecord-gcc-switches -pipe -Wall -Werror=format-security -Wp,-D_FORTIFY_SOURCE=2 -Wp,-D_GLIBCXX_ASSERTIONS -specs=/usr/lib/rpm/OpenCloudOS/OpenCloudOS-hardened-cc1 -fstack-protector-strong  -m64 -march=x86-64-v2 -mtune=generic -fasynchronous-unwind-tables -fstack-clash-protection -fcf-protection -std=gnu99 -fPIC -Wall -Wwrite-strings -Wmissing-prototypes -Iinclude -DCAPSTONE_USE_SYS_DYN_MEM -DCAPSTONE_HAS_ARM -DCAPSTONE_HAS_ARM64 -DCAPSTONE_HAS_M68K -DCAPSTONE_HAS_MIPS -DCAPSTONE_HAS_SH -DCAPSTONE_HAS_POWERPC -DCAPSTONE_HAS_SPARC -DCAPSTONE_HAS_SYSZ -DCAPSTONE_HAS_X86 -DCAPSTONE_HAS_XCORE -DCAPSTONE_HAS_TMS320C64X -DCAPSTONE_HAS_M680X -DCAPSTONE_HAS_EVM -DCAPSTONE_HAS_RISCV -DCAPSTONE_HAS_WASM -DCAPSTONE_HAS_MOS65XX -DCAPSTONE_HAS_BPF -DCAPSTONE_HAS_TRICORE  -fvisibility=hidden -c arch/SystemZ/SystemZDisassembler.c -o arch/SystemZ/SystemZDisassembler.o
gcc -O2 -flto=auto -ffat-lto-objects -fexceptions -g -grecord-gcc-switches -pipe -Wall -Werror=format-security -Wp,-D_FORTIFY_SOURCE=2 -Wp,-D_GLIBCXX_ASSERTIONS -specs=/usr/lib/rpm/OpenCloudOS/OpenCloudOS-hardened-cc1 -fstack-protector-strong  -m64 -march=x86-64-v2 -mtune=generic -fasynchronous-unwind-tables -fstack-clash-protection -fcf-protection -std=gnu99 -fPIC -Wall -Wwrite-strings -Wmissing-prototypes -Iinclude -DCAPSTONE_USE_SYS_DYN_MEM -DCAPSTONE_HAS_ARM -DCAPSTONE_HAS_ARM64 -DCAPSTONE_HAS_M68K -DCAPSTONE_HAS_MIPS -DCAPSTONE_HAS_SH -DCAPSTONE_HAS_POWERPC -DCAPSTONE_HAS_SPARC -DCAPSTONE_HAS_SYSZ -DCAPSTONE_HAS_X86 -DCAPSTONE_HAS_XCORE -DCAPSTONE_HAS_TMS320C64X -DCAPSTONE_HAS_M680X -DCAPSTONE_HAS_EVM -DCAPSTONE_HAS_RISCV -DCAPSTONE_HAS_WASM -DCAPSTONE_HAS_MOS65XX -DCAPSTONE_HAS_BPF -DCAPSTONE_HAS_TRICORE  -fvisibility=hidden -c arch/M68K/M68KDisassembler.c -o arch/M68K/M68KDisassembler.o
gcc -O2 -flto=auto -ffat-lto-objects -fexceptions -g -grecord-gcc-switches -pipe -Wall -Werror=format-security -Wp,-D_FORTIFY_SOURCE=2 -Wp,-D_GLIBCXX_ASSERTIONS -specs=/usr/lib/rpm/OpenCloudOS/OpenCloudOS-hardened-cc1 -fstack-protector-strong  -m64 -march=x86-64-v2 -mtune=generic -fasynchronous-unwind-tables -fstack-clash-protection -fcf-protection -std=gnu99 -fPIC -Wall -Wwrite-strings -Wmissing-prototypes -Iinclude -DCAPSTONE_USE_SYS_DYN_MEM -DCAPSTONE_HAS_ARM -DCAPSTONE_HAS_ARM64 -DCAPSTONE_HAS_M68K -DCAPSTONE_HAS_MIPS -DCAPSTONE_HAS_SH -DCAPSTONE_HAS_POWERPC -DCAPSTONE_HAS_SPARC -DCAPSTONE_HAS_SYSZ -DCAPSTONE_HAS_X86 -DCAPSTONE_HAS_XCORE -DCAPSTONE_HAS_TMS320C64X -DCAPSTONE_HAS_M680X -DCAPSTONE_HAS_EVM -DCAPSTONE_HAS_RISCV -DCAPSTONE_HAS_WASM -DCAPSTONE_HAS_MOS65XX -DCAPSTONE_HAS_BPF -DCAPSTONE_HAS_TRICORE  -fvisibility=hidden -c arch/Sparc/SparcInstPrinter.c -o arch/Sparc/SparcInstPrinter.o
gcc -O2 -flto=auto -ffat-lto-objects -fexceptions -g -grecord-gcc-switches -pipe -Wall -Werror=format-security -Wp,-D_FORTIFY_SOURCE=2 -Wp,-D_GLIBCXX_ASSERTIONS -specs=/usr/lib/rpm/OpenCloudOS/OpenCloudOS-hardened-cc1 -fstack-protector-strong  -m64 -march=x86-64-v2 -mtune=generic -fasynchronous-unwind-tables -fstack-clash-protection -fcf-protection -std=gnu99 -fPIC -Wall -Wwrite-strings -Wmissing-prototypes -Iinclude -DCAPSTONE_USE_SYS_DYN_MEM -DCAPSTONE_HAS_ARM -DCAPSTONE_HAS_ARM64 -DCAPSTONE_HAS_M68K -DCAPSTONE_HAS_MIPS -DCAPSTONE_HAS_SH -DCAPSTONE_HAS_POWERPC -DCAPSTONE_HAS_SPARC -DCAPSTONE_HAS_SYSZ -DCAPSTONE_HAS_X86 -DCAPSTONE_HAS_XCORE -DCAPSTONE_HAS_TMS320C64X -DCAPSTONE_HAS_M680X -DCAPSTONE_HAS_EVM -DCAPSTONE_HAS_RISCV -DCAPSTONE_HAS_WASM -DCAPSTONE_HAS_MOS65XX -DCAPSTONE_HAS_BPF -DCAPSTONE_HAS_TRICORE  -fvisibility=hidden -c arch/PowerPC/PPCInstPrinter.c -o arch/PowerPC/PPCInstPrinter.o
gcc -O2 -flto=auto -ffat-lto-objects -fexceptions -g -grecord-gcc-switches -pipe -Wall -Werror=format-security -Wp,-D_FORTIFY_SOURCE=2 -Wp,-D_GLIBCXX_ASSERTIONS -specs=/usr/lib/rpm/OpenCloudOS/OpenCloudOS-hardened-cc1 -fstack-protector-strong  -m64 -march=x86-64-v2 -mtune=generic -fasynchronous-unwind-tables -fstack-clash-protection -fcf-protection -std=gnu99 -fPIC -Wall -Wwrite-strings -Wmissing-prototypes -Iinclude -DCAPSTONE_USE_SYS_DYN_MEM -DCAPSTONE_HAS_ARM -DCAPSTONE_HAS_ARM64 -DCAPSTONE_HAS_M68K -DCAPSTONE_HAS_MIPS -DCAPSTONE_HAS_SH -DCAPSTONE_HAS_POWERPC -DCAPSTONE_HAS_SPARC -DCAPSTONE_HAS_SYSZ -DCAPSTONE_HAS_X86 -DCAPSTONE_HAS_XCORE -DCAPSTONE_HAS_TMS320C64X -DCAPSTONE_HAS_M680X -DCAPSTONE_HAS_EVM -DCAPSTONE_HAS_RISCV -DCAPSTONE_HAS_WASM -DCAPSTONE_HAS_MOS65XX -DCAPSTONE_HAS_BPF -DCAPSTONE_HAS_TRICORE  -fvisibility=hidden -c arch/AArch64/AArch64Disassembler.c -o arch/AArch64/AArch64Disassembler.o
gcc -O2 -flto=auto -ffat-lto-objects -fexceptions -g -grecord-gcc-switches -pipe -Wall -Werror=format-security -Wp,-D_FORTIFY_SOURCE=2 -Wp,-D_GLIBCXX_ASSERTIONS -specs=/usr/lib/rpm/OpenCloudOS/OpenCloudOS-hardened-cc1 -fstack-protector-strong  -m64 -march=x86-64-v2 -mtune=generic -fasynchronous-unwind-tables -fstack-clash-protection -fcf-protection -std=gnu99 -fPIC -Wall -Wwrite-strings -Wmissing-prototypes -Iinclude -DCAPSTONE_USE_SYS_DYN_MEM -DCAPSTONE_HAS_ARM -DCAPSTONE_HAS_ARM64 -DCAPSTONE_HAS_M68K -DCAPSTONE_HAS_MIPS -DCAPSTONE_HAS_SH -DCAPSTONE_HAS_POWERPC -DCAPSTONE_HAS_SPARC -DCAPSTONE_HAS_SYSZ -DCAPSTONE_HAS_X86 -DCAPSTONE_HAS_XCORE -DCAPSTONE_HAS_TMS320C64X -DCAPSTONE_HAS_M680X -DCAPSTONE_HAS_EVM -DCAPSTONE_HAS_RISCV -DCAPSTONE_HAS_WASM -DCAPSTONE_HAS_MOS65XX -DCAPSTONE_HAS_BPF -DCAPSTONE_HAS_TRICORE  -fvisibility=hidden -c arch/ARM/ARMDisassembler.c -o arch/ARM/ARMDisassembler.o
ar q ./libcapstone.a ./cs.o ./utils.o ./SStream.o ./MCInstrDesc.o ./MCRegisterInfo.o ./MCInst.o ./Mapping.o ./arch/ARM/ARMDisassembler.o ./arch/ARM/ARMInstPrinter.o ./arch/ARM/ARMMapping.o ./arch/ARM/ARMModule.o ./arch/AArch64/AArch64BaseInfo.o ./arch/AArch64/AArch64Disassembler.o ./arch/AArch64/AArch64InstPrinter.o ./arch/AArch64/AArch64Mapping.o ./arch/AArch64/AArch64Module.o ./arch/M68K/M68KDisassembler.o ./arch/M68K/M68KInstPrinter.o ./arch/M68K/M68KModule.o ./arch/Mips/MipsDisassembler.o ./arch/Mips/MipsInstPrinter.o ./arch/Mips/MipsMapping.o ./arch/Mips/MipsModule.o ./arch/PowerPC/PPCDisassembler.o ./arch/PowerPC/PPCInstPrinter.o ./arch/PowerPC/PPCMapping.o ./arch/PowerPC/PPCModule.o ./arch/RISCV/RISCVDisassembler.o ./arch/RISCV/RISCVInstPrinter.o ./arch/RISCV/RISCVMapping.o ./arch/RISCV/RISCVModule.o ./arch/Sparc/SparcDisassembler.o ./arch/Sparc/SparcInstPrinter.o ./arch/Sparc/SparcMapping.o ./arch/Sparc/SparcModule.o ./arch/SystemZ/SystemZDisassembler.o ./arch/SystemZ/SystemZInstPrinter.o ./arch/SystemZ/SystemZMCTargetDesc.o ./arch/SystemZ/SystemZMapping.o ./arch/SystemZ/SystemZModule.o ./arch/SH/SHDisassembler.o ./arch/SH/SHInstPrinter.o ./arch/SH/SHModule.o ./arch/X86/X86DisassemblerDecoder.o ./arch/X86/X86Disassembler.o ./arch/X86/X86InstPrinterCommon.o ./arch/X86/X86IntelInstPrinter.o ./arch/X86/X86ATTInstPrinter.o ./arch/X86/X86Mapping.o ./arch/X86/X86Module.o ./arch/XCore/XCoreDisassembler.o ./arch/XCore/XCoreInstPrinter.o ./arch/XCore/XCoreMapping.o ./arch/XCore/XCoreModule.o ./arch/TMS320C64x/TMS320C64xDisassembler.o ./arch/TMS320C64x/TMS320C64xInstPrinter.o ./arch/TMS320C64x/TMS320C64xMapping.o ./arch/TMS320C64x/TMS320C64xModule.o ./arch/M680X/M680XDisassembler.o ./arch/M680X/M680XInstPrinter.o ./arch/M680X/M680XModule.o ./arch/EVM/EVMDisassembler.o ./arch/EVM/EVMInstPrinter.o ./arch/EVM/EVMMapping.o ./arch/EVM/EVMModule.o ./arch/MOS65XX/MOS65XXDisassembler.o ./arch/MOS65XX/MOS65XXModule.o ./arch/WASM/WASMDisassembler.o ./arch/WASM/WASMInstPrinter.o ./arch/WASM/WASMMapping.o ./arch/WASM/WASMModule.o ./arch/BPF/BPFDisassembler.o ./arch/BPF/BPFInstPrinter.o ./arch/BPF/BPFMapping.o ./arch/BPF/BPFModule.o ./arch/TriCore/TriCoreDisassembler.o ./arch/TriCore/TriCoreInstPrinter.o ./arch/TriCore/TriCoreMapping.o ./arch/TriCore/TriCoreModule.o
ranlib ./libcapstone.a
ar: creating ./libcapstone.a
gcc -Wl,-z,relro -Wl,--as-needed  -Wl,-z,now -specs=/usr/lib/rpm/OpenCloudOS/OpenCloudOS-hardened-ld  -Wl,--build-id=sha1  -shared -Wl,-soname,libcapstone.so.5 ./cs.o ./utils.o ./SStream.o ./MCInstrDesc.o ./MCRegisterInfo.o ./MCInst.o ./Mapping.o ./arch/ARM/ARMDisassembler.o ./arch/ARM/ARMInstPrinter.o ./arch/ARM/ARMMapping.o ./arch/ARM/ARMModule.o ./arch/AArch64/AArch64BaseInfo.o ./arch/AArch64/AArch64Disassembler.o ./arch/AArch64/AArch64InstPrinter.o ./arch/AArch64/AArch64Mapping.o ./arch/AArch64/AArch64Module.o ./arch/M68K/M68KDisassembler.o ./arch/M68K/M68KInstPrinter.o ./arch/M68K/M68KModule.o ./arch/Mips/MipsDisassembler.o ./arch/Mips/MipsInstPrinter.o ./arch/Mips/MipsMapping.o ./arch/Mips/MipsModule.o ./arch/PowerPC/PPCDisassembler.o ./arch/PowerPC/PPCInstPrinter.o ./arch/PowerPC/PPCMapping.o ./arch/PowerPC/PPCModule.o ./arch/RISCV/RISCVDisassembler.o ./arch/RISCV/RISCVInstPrinter.o ./arch/RISCV/RISCVMapping.o ./arch/RISCV/RISCVModule.o ./arch/Sparc/SparcDisassembler.o ./arch/Sparc/SparcInstPrinter.o ./arch/Sparc/SparcMapping.o ./arch/Sparc/SparcModule.o ./arch/SystemZ/SystemZDisassembler.o ./arch/SystemZ/SystemZInstPrinter.o ./arch/SystemZ/SystemZMCTargetDesc.o ./arch/SystemZ/SystemZMapping.o ./arch/SystemZ/SystemZModule.o ./arch/SH/SHDisassembler.o ./arch/SH/SHInstPrinter.o ./arch/SH/SHModule.o ./arch/X86/X86DisassemblerDecoder.o ./arch/X86/X86Disassembler.o ./arch/X86/X86InstPrinterCommon.o ./arch/X86/X86IntelInstPrinter.o ./arch/X86/X86ATTInstPrinter.o ./arch/X86/X86Mapping.o ./arch/X86/X86Module.o ./arch/XCore/XCoreDisassembler.o ./arch/XCore/XCoreInstPrinter.o ./arch/XCore/XCoreMapping.o ./arch/XCore/XCoreModule.o ./arch/TMS320C64x/TMS320C64xDisassembler.o ./arch/TMS320C64x/TMS320C64xInstPrinter.o ./arch/TMS320C64x/TMS320C64xMapping.o ./arch/TMS320C64x/TMS320C64xModule.o ./arch/M680X/M680XDisassembler.o ./arch/M680X/M680XInstPrinter.o ./arch/M680X/M680XModule.o ./arch/EVM/EVMDisassembler.o ./arch/EVM/EVMInstPrinter.o ./arch/EVM/EVMMapping.o ./arch/EVM/EVMModule.o ./arch/MOS65XX/MOS65XXDisassembler.o ./arch/MOS65XX/MOS65XXModule.o ./arch/WASM/WASMDisassembler.o ./arch/WASM/WASMInstPrinter.o ./arch/WASM/WASMMapping.o ./arch/WASM/WASMModule.o ./arch/BPF/BPFDisassembler.o ./arch/BPF/BPFInstPrinter.o ./arch/BPF/BPFMapping.o ./arch/BPF/BPFModule.o ./arch/TriCore/TriCoreDisassembler.o ./arch/TriCore/TriCoreInstPrinter.o ./arch/TriCore/TriCoreMapping.o ./arch/TriCore/TriCoreModule.o -o ./libcapstone.so.5
make[1]: Entering directory '/builddir/build/BUILD/capstone-5.0.1/cstool'
gcc -O2 -flto=auto -ffat-lto-objects -fexceptions -g -grecord-gcc-switches -pipe -Wall -Werror=format-security -Wp,-D_FORTIFY_SOURCE=2 -Wp,-D_GLIBCXX_ASSERTIONS -specs=/usr/lib/rpm/OpenCloudOS/OpenCloudOS-hardened-cc1 -fstack-protector-strong  -m64 -march=x86-64-v2 -mtune=generic -fasynchronous-unwind-tables -fstack-clash-protection -fcf-protection -std=gnu99 -fPIC -Wall -Wwrite-strings -Wmissing-prototypes -Iinclude -DCAPSTONE_USE_SYS_DYN_MEM -DCAPSTONE_HAS_ARM -DCAPSTONE_HAS_ARM64 -DCAPSTONE_HAS_M68K -DCAPSTONE_HAS_MIPS -DCAPSTONE_HAS_SH -DCAPSTONE_HAS_POWERPC -DCAPSTONE_HAS_SPARC -DCAPSTONE_HAS_SYSZ -DCAPSTONE_HAS_X86 -DCAPSTONE_HAS_XCORE -DCAPSTONE_HAS_TMS320C64X -DCAPSTONE_HAS_M680X -DCAPSTONE_HAS_EVM -DCAPSTONE_HAS_RISCV -DCAPSTONE_HAS_WASM -DCAPSTONE_HAS_MOS65XX -DCAPSTONE_HAS_BPF -DCAPSTONE_HAS_TRICORE  -fvisibility=hidden -I../include -I. -c cstool_mips.c -o cstool_mips.o
make[1]: Leaving directory '/builddir/build/BUILD/capstone-5.0.1/cstool'
make[1]: Entering directory '/builddir/build/BUILD/capstone-5.0.1/cstool'
gcc -O2 -flto=auto -ffat-lto-objects -fexceptions -g -grecord-gcc-switches -pipe -Wall -Werror=format-security -Wp,-D_FORTIFY_SOURCE=2 -Wp,-D_GLIBCXX_ASSERTIONS -specs=/usr/lib/rpm/OpenCloudOS/OpenCloudOS-hardened-cc1 -fstack-protector-strong  -m64 -march=x86-64-v2 -mtune=generic -fasynchronous-unwind-tables -fstack-clash-protection -fcf-protection -std=gnu99 -fPIC -Wall -Wwrite-strings -Wmissing-prototypes -Iinclude -DCAPSTONE_USE_SYS_DYN_MEM -DCAPSTONE_HAS_ARM -DCAPSTONE_HAS_ARM64 -DCAPSTONE_HAS_M68K -DCAPSTONE_HAS_MIPS -DCAPSTONE_HAS_SH -DCAPSTONE_HAS_POWERPC -DCAPSTONE_HAS_SPARC -DCAPSTONE_HAS_SYSZ -DCAPSTONE_HAS_X86 -DCAPSTONE_HAS_XCORE -DCAPSTONE_HAS_TMS320C64X -DCAPSTONE_HAS_M680X -DCAPSTONE_HAS_EVM -DCAPSTONE_HAS_RISCV -DCAPSTONE_HAS_WASM -DCAPSTONE_HAS_MOS65XX -DCAPSTONE_HAS_BPF -DCAPSTONE_HAS_TRICORE  -fvisibility=hidden -I../include -I. -c cstool_m68k.c -o cstool_m68k.o
make[1]: Leaving directory '/builddir/build/BUILD/capstone-5.0.1/cstool'
make[1]: Entering directory '/builddir/build/BUILD/capstone-5.0.1/cstool'
gcc -O2 -flto=auto -ffat-lto-objects -fexceptions -g -grecord-gcc-switches -pipe -Wall -Werror=format-security -Wp,-D_FORTIFY_SOURCE=2 -Wp,-D_GLIBCXX_ASSERTIONS -specs=/usr/lib/rpm/OpenCloudOS/OpenCloudOS-hardened-cc1 -fstack-protector-strong  -m64 -march=x86-64-v2 -mtune=generic -fasynchronous-unwind-tables -fstack-clash-protection -fcf-protection -std=gnu99 -fPIC -Wall -Wwrite-strings -Wmissing-prototypes -Iinclude -DCAPSTONE_USE_SYS_DYN_MEM -DCAPSTONE_HAS_ARM -DCAPSTONE_HAS_ARM64 -DCAPSTONE_HAS_M68K -DCAPSTONE_HAS_MIPS -DCAPSTONE_HAS_SH -DCAPSTONE_HAS_POWERPC -DCAPSTONE_HAS_SPARC -DCAPSTONE_HAS_SYSZ -DCAPSTONE_HAS_X86 -DCAPSTONE_HAS_XCORE -DCAPSTONE_HAS_TMS320C64X -DCAPSTONE_HAS_M680X -DCAPSTONE_HAS_EVM -DCAPSTONE_HAS_RISCV -DCAPSTONE_HAS_WASM -DCAPSTONE_HAS_MOS65XX -DCAPSTONE_HAS_BPF -DCAPSTONE_HAS_TRICORE  -fvisibility=hidden -I../include -I. -c cstool_m680x.c -o cstool_m680x.o
make[1]: Leaving directory '/builddir/build/BUILD/capstone-5.0.1/cstool'
make[1]: Entering directory '/builddir/build/BUILD/capstone-5.0.1/cstool'
gcc -O2 -flto=auto -ffat-lto-objects -fexceptions -g -grecord-gcc-switches -pipe -Wall -Werror=format-security -Wp,-D_FORTIFY_SOURCE=2 -Wp,-D_GLIBCXX_ASSERTIONS -specs=/usr/lib/rpm/OpenCloudOS/OpenCloudOS-hardened-cc1 -fstack-protector-strong  -m64 -march=x86-64-v2 -mtune=generic -fasynchronous-unwind-tables -fstack-clash-protection -fcf-protection -std=gnu99 -fPIC -Wall -Wwrite-strings -Wmissing-prototypes -Iinclude -DCAPSTONE_USE_SYS_DYN_MEM -DCAPSTONE_HAS_ARM -DCAPSTONE_HAS_ARM64 -DCAPSTONE_HAS_M68K -DCAPSTONE_HAS_MIPS -DCAPSTONE_HAS_SH -DCAPSTONE_HAS_POWERPC -DCAPSTONE_HAS_SPARC -DCAPSTONE_HAS_SYSZ -DCAPSTONE_HAS_X86 -DCAPSTONE_HAS_XCORE -DCAPSTONE_HAS_TMS320C64X -DCAPSTONE_HAS_M680X -DCAPSTONE_HAS_EVM -DCAPSTONE_HAS_RISCV -DCAPSTONE_HAS_WASM -DCAPSTONE_HAS_MOS65XX -DCAPSTONE_HAS_BPF -DCAPSTONE_HAS_TRICORE  -fvisibility=hidden -I../include -I. -c getopt.c -o getopt.o
make[1]: Leaving directory '/builddir/build/BUILD/capstone-5.0.1/cstool'
make[1]: Entering directory '/builddir/build/BUILD/capstone-5.0.1/cstool'
gcc -O2 -flto=auto -ffat-lto-objects -fexceptions -g -grecord-gcc-switches -pipe -Wall -Werror=format-security -Wp,-D_FORTIFY_SOURCE=2 -Wp,-D_GLIBCXX_ASSERTIONS -specs=/usr/lib/rpm/OpenCloudOS/OpenCloudOS-hardened-cc1 -fstack-protector-strong  -m64 -march=x86-64-v2 -mtune=generic -fasynchronous-unwind-tables -fstack-clash-protection -fcf-protection -std=gnu99 -fPIC -Wall -Wwrite-strings -Wmissing-prototypes -Iinclude -DCAPSTONE_USE_SYS_DYN_MEM -DCAPSTONE_HAS_ARM -DCAPSTONE_HAS_ARM64 -DCAPSTONE_HAS_M68K -DCAPSTONE_HAS_MIPS -DCAPSTONE_HAS_SH -DCAPSTONE_HAS_POWERPC -DCAPSTONE_HAS_SPARC -DCAPSTONE_HAS_SYSZ -DCAPSTONE_HAS_X86 -DCAPSTONE_HAS_XCORE -DCAPSTONE_HAS_TMS320C64X -DCAPSTONE_HAS_M680X -DCAPSTONE_HAS_EVM -DCAPSTONE_HAS_RISCV -DCAPSTONE_HAS_WASM -DCAPSTONE_HAS_MOS65XX -DCAPSTONE_HAS_BPF -DCAPSTONE_HAS_TRICORE  -fvisibility=hidden -I../include -I. -c cstool_arm.c -o cstool_arm.o
make[1]: Leaving directory '/builddir/build/BUILD/capstone-5.0.1/cstool'
make[1]: Entering directory '/builddir/build/BUILD/capstone-5.0.1/cstool'
gcc -O2 -flto=auto -ffat-lto-objects -fexceptions -g -grecord-gcc-switches -pipe -Wall -Werror=format-security -Wp,-D_FORTIFY_SOURCE=2 -Wp,-D_GLIBCXX_ASSERTIONS -specs=/usr/lib/rpm/OpenCloudOS/OpenCloudOS-hardened-cc1 -fstack-protector-strong  -m64 -march=x86-64-v2 -mtune=generic -fasynchronous-unwind-tables -fstack-clash-protection -fcf-protection -std=gnu99 -fPIC -Wall -Wwrite-strings -Wmissing-prototypes -Iinclude -DCAPSTONE_USE_SYS_DYN_MEM -DCAPSTONE_HAS_ARM -DCAPSTONE_HAS_ARM64 -DCAPSTONE_HAS_M68K -DCAPSTONE_HAS_MIPS -DCAPSTONE_HAS_SH -DCAPSTONE_HAS_POWERPC -DCAPSTONE_HAS_SPARC -DCAPSTONE_HAS_SYSZ -DCAPSTONE_HAS_X86 -DCAPSTONE_HAS_XCORE -DCAPSTONE_HAS_TMS320C64X -DCAPSTONE_HAS_M680X -DCAPSTONE_HAS_EVM -DCAPSTONE_HAS_RISCV -DCAPSTONE_HAS_WASM -DCAPSTONE_HAS_MOS65XX -DCAPSTONE_HAS_BPF -DCAPSTONE_HAS_TRICORE  -fvisibility=hidden -I../include -I. -c cstool_arm64.c -o cstool_arm64.o
make[1]: Leaving directory '/builddir/build/BUILD/capstone-5.0.1/cstool'
make[1]: Entering directory '/builddir/build/BUILD/capstone-5.0.1/cstool'
gcc -O2 -flto=auto -ffat-lto-objects -fexceptions -g -grecord-gcc-switches -pipe -Wall -Werror=format-security -Wp,-D_FORTIFY_SOURCE=2 -Wp,-D_GLIBCXX_ASSERTIONS -specs=/usr/lib/rpm/OpenCloudOS/OpenCloudOS-hardened-cc1 -fstack-protector-strong  -m64 -march=x86-64-v2 -mtune=generic -fasynchronous-unwind-tables -fstack-clash-protection -fcf-protection -std=gnu99 -fPIC -Wall -Wwrite-strings -Wmissing-prototypes -Iinclude -DCAPSTONE_USE_SYS_DYN_MEM -DCAPSTONE_HAS_ARM -DCAPSTONE_HAS_ARM64 -DCAPSTONE_HAS_M68K -DCAPSTONE_HAS_MIPS -DCAPSTONE_HAS_SH -DCAPSTONE_HAS_POWERPC -DCAPSTONE_HAS_SPARC -DCAPSTONE_HAS_SYSZ -DCAPSTONE_HAS_X86 -DCAPSTONE_HAS_XCORE -DCAPSTONE_HAS_TMS320C64X -DCAPSTONE_HAS_M680X -DCAPSTONE_HAS_EVM -DCAPSTONE_HAS_RISCV -DCAPSTONE_HAS_WASM -DCAPSTONE_HAS_MOS65XX -DCAPSTONE_HAS_BPF -DCAPSTONE_HAS_TRICORE  -fvisibility=hidden -I../include -I. -c cstool_bpf.c -o cstool_bpf.o
make[1]: Leaving directory '/builddir/build/BUILD/capstone-5.0.1/cstool'
make[1]: Entering directory '/builddir/build/BUILD/capstone-5.0.1/cstool'
gcc -O2 -flto=auto -ffat-lto-objects -fexceptions -g -grecord-gcc-switches -pipe -Wall -Werror=format-security -Wp,-D_FORTIFY_SOURCE=2 -Wp,-D_GLIBCXX_ASSERTIONS -specs=/usr/lib/rpm/OpenCloudOS/OpenCloudOS-hardened-cc1 -fstack-protector-strong  -m64 -march=x86-64-v2 -mtune=generic -fasynchronous-unwind-tables -fstack-clash-protection -fcf-protection -std=gnu99 -fPIC -Wall -Wwrite-strings -Wmissing-prototypes -Iinclude -DCAPSTONE_USE_SYS_DYN_MEM -DCAPSTONE_HAS_ARM -DCAPSTONE_HAS_ARM64 -DCAPSTONE_HAS_M68K -DCAPSTONE_HAS_MIPS -DCAPSTONE_HAS_SH -DCAPSTONE_HAS_POWERPC -DCAPSTONE_HAS_SPARC -DCAPSTONE_HAS_SYSZ -DCAPSTONE_HAS_X86 -DCAPSTONE_HAS_XCORE -DCAPSTONE_HAS_TMS320C64X -DCAPSTONE_HAS_M680X -DCAPSTONE_HAS_EVM -DCAPSTONE_HAS_RISCV -DCAPSTONE_HAS_WASM -DCAPSTONE_HAS_MOS65XX -DCAPSTONE_HAS_BPF -DCAPSTONE_HAS_TRICORE  -fvisibility=hidden -I../include -I. -c cstool_systemz.c -o cstool_systemz.o
make[1]: Leaving directory '/builddir/build/BUILD/capstone-5.0.1/cstool'
make[1]: Entering directory '/builddir/build/BUILD/capstone-5.0.1/cstool'
gcc -O2 -flto=auto -ffat-lto-objects -fexceptions -g -grecord-gcc-switches -pipe -Wall -Werror=format-security -Wp,-D_FORTIFY_SOURCE=2 -Wp,-D_GLIBCXX_ASSERTIONS -specs=/usr/lib/rpm/OpenCloudOS/OpenCloudOS-hardened-cc1 -fstack-protector-strong  -m64 -march=x86-64-v2 -mtune=generic -fasynchronous-unwind-tables -fstack-clash-protection -fcf-protection -std=gnu99 -fPIC -Wall -Wwrite-strings -Wmissing-prototypes -Iinclude -DCAPSTONE_USE_SYS_DYN_MEM -DCAPSTONE_HAS_ARM -DCAPSTONE_HAS_ARM64 -DCAPSTONE_HAS_M68K -DCAPSTONE_HAS_MIPS -DCAPSTONE_HAS_SH -DCAPSTONE_HAS_POWERPC -DCAPSTONE_HAS_SPARC -DCAPSTONE_HAS_SYSZ -DCAPSTONE_HAS_X86 -DCAPSTONE_HAS_XCORE -DCAPSTONE_HAS_TMS320C64X -DCAPSTONE_HAS_M680X -DCAPSTONE_HAS_EVM -DCAPSTONE_HAS_RISCV -DCAPSTONE_HAS_WASM -DCAPSTONE_HAS_MOS65XX -DCAPSTONE_HAS_BPF -DCAPSTONE_HAS_TRICORE  -fvisibility=hidden -I../include -I. -c cstool_evm.c -o cstool_evm.o
make[1]: Leaving directory '/builddir/build/BUILD/capstone-5.0.1/cstool'
make[1]: Entering directory '/builddir/build/BUILD/capstone-5.0.1/cstool'
gcc -O2 -flto=auto -ffat-lto-objects -fexceptions -g -grecord-gcc-switches -pipe -Wall -Werror=format-security -Wp,-D_FORTIFY_SOURCE=2 -Wp,-D_GLIBCXX_ASSERTIONS -specs=/usr/lib/rpm/OpenCloudOS/OpenCloudOS-hardened-cc1 -fstack-protector-strong  -m64 -march=x86-64-v2 -mtune=generic -fasynchronous-unwind-tables -fstack-clash-protection -fcf-protection -std=gnu99 -fPIC -Wall -Wwrite-strings -Wmissing-prototypes -Iinclude -DCAPSTONE_USE_SYS_DYN_MEM -DCAPSTONE_HAS_ARM -DCAPSTONE_HAS_ARM64 -DCAPSTONE_HAS_M68K -DCAPSTONE_HAS_MIPS -DCAPSTONE_HAS_SH -DCAPSTONE_HAS_POWERPC -DCAPSTONE_HAS_SPARC -DCAPSTONE_HAS_SYSZ -DCAPSTONE_HAS_X86 -DCAPSTONE_HAS_XCORE -DCAPSTONE_HAS_TMS320C64X -DCAPSTONE_HAS_M680X -DCAPSTONE_HAS_EVM -DCAPSTONE_HAS_RISCV -DCAPSTONE_HAS_WASM -DCAPSTONE_HAS_MOS65XX -DCAPSTONE_HAS_BPF -DCAPSTONE_HAS_TRICORE  -fvisibility=hidden -I../include -I. -c cstool_sh.c -o cstool_sh.o
make[1]: Leaving directory '/builddir/build/BUILD/capstone-5.0.1/cstool'
make[1]: Entering directory '/builddir/build/BUILD/capstone-5.0.1/cstool'
gcc -O2 -flto=auto -ffat-lto-objects -fexceptions -g -grecord-gcc-switches -pipe -Wall -Werror=format-security -Wp,-D_FORTIFY_SOURCE=2 -Wp,-D_GLIBCXX_ASSERTIONS -specs=/usr/lib/rpm/OpenCloudOS/OpenCloudOS-hardened-cc1 -fstack-protector-strong  -m64 -march=x86-64-v2 -mtune=generic -fasynchronous-unwind-tables -fstack-clash-protection -fcf-protection -std=gnu99 -fPIC -Wall -Wwrite-strings -Wmissing-prototypes -Iinclude -DCAPSTONE_USE_SYS_DYN_MEM -DCAPSTONE_HAS_ARM -DCAPSTONE_HAS_ARM64 -DCAPSTONE_HAS_M68K -DCAPSTONE_HAS_MIPS -DCAPSTONE_HAS_SH -DCAPSTONE_HAS_POWERPC -DCAPSTONE_HAS_SPARC -DCAPSTONE_HAS_SYSZ -DCAPSTONE_HAS_X86 -DCAPSTONE_HAS_XCORE -DCAPSTONE_HAS_TMS320C64X -DCAPSTONE_HAS_M680X -DCAPSTONE_HAS_EVM -DCAPSTONE_HAS_RISCV -DCAPSTONE_HAS_WASM -DCAPSTONE_HAS_MOS65XX -DCAPSTONE_HAS_BPF -DCAPSTONE_HAS_TRICORE  -fvisibility=hidden -I../include -I. -c cstool_riscv.c -o cstool_riscv.o
make[1]: Leaving directory '/builddir/build/BUILD/capstone-5.0.1/cstool'
make[1]: Entering directory '/builddir/build/BUILD/capstone-5.0.1/cstool'
gcc -O2 -flto=auto -ffat-lto-objects -fexceptions -g -grecord-gcc-switches -pipe -Wall -Werror=format-security -Wp,-D_FORTIFY_SOURCE=2 -Wp,-D_GLIBCXX_ASSERTIONS -specs=/usr/lib/rpm/OpenCloudOS/OpenCloudOS-hardened-cc1 -fstack-protector-strong  -m64 -march=x86-64-v2 -mtune=generic -fasynchronous-unwind-tables -fstack-clash-protection -fcf-protection -std=gnu99 -fPIC -Wall -Wwrite-strings -Wmissing-prototypes -Iinclude -DCAPSTONE_USE_SYS_DYN_MEM -DCAPSTONE_HAS_ARM -DCAPSTONE_HAS_ARM64 -DCAPSTONE_HAS_M68K -DCAPSTONE_HAS_MIPS -DCAPSTONE_HAS_SH -DCAPSTONE_HAS_POWERPC -DCAPSTONE_HAS_SPARC -DCAPSTONE_HAS_SYSZ -DCAPSTONE_HAS_X86 -DCAPSTONE_HAS_XCORE -DCAPSTONE_HAS_TMS320C64X -DCAPSTONE_HAS_M680X -DCAPSTONE_HAS_EVM -DCAPSTONE_HAS_RISCV -DCAPSTONE_HAS_WASM -DCAPSTONE_HAS_MOS65XX -DCAPSTONE_HAS_BPF -DCAPSTONE_HAS_TRICORE  -fvisibility=hidden -I../include -I. -c cstool_tms320c64x.c -o cstool_tms320c64x.o
make[1]: Leaving directory '/builddir/build/BUILD/capstone-5.0.1/cstool'
make[1]: Entering directory '/builddir/build/BUILD/capstone-5.0.1/cstool'
gcc -O2 -flto=auto -ffat-lto-objects -fexceptions -g -grecord-gcc-switches -pipe -Wall -Werror=format-security -Wp,-D_FORTIFY_SOURCE=2 -Wp,-D_GLIBCXX_ASSERTIONS -specs=/usr/lib/rpm/OpenCloudOS/OpenCloudOS-hardened-cc1 -fstack-protector-strong  -m64 -march=x86-64-v2 -mtune=generic -fasynchronous-unwind-tables -fstack-clash-protection -fcf-protection -std=gnu99 -fPIC -Wall -Wwrite-strings -Wmissing-prototypes -Iinclude -DCAPSTONE_USE_SYS_DYN_MEM -DCAPSTONE_HAS_ARM -DCAPSTONE_HAS_ARM64 -DCAPSTONE_HAS_M68K -DCAPSTONE_HAS_MIPS -DCAPSTONE_HAS_SH -DCAPSTONE_HAS_POWERPC -DCAPSTONE_HAS_SPARC -DCAPSTONE_HAS_SYSZ -DCAPSTONE_HAS_X86 -DCAPSTONE_HAS_XCORE -DCAPSTONE_HAS_TMS320C64X -DCAPSTONE_HAS_M680X -DCAPSTONE_HAS_EVM -DCAPSTONE_HAS_RISCV -DCAPSTONE_HAS_WASM -DCAPSTONE_HAS_MOS65XX -DCAPSTONE_HAS_BPF -DCAPSTONE_HAS_TRICORE  -fvisibility=hidden -I../include -I. -c cstool.c -o cstool.o
make[1]: Leaving directory '/builddir/build/BUILD/capstone-5.0.1/cstool'
make[1]: Entering directory '/builddir/build/BUILD/capstone-5.0.1/cstool'
gcc -O2 -flto=auto -ffat-lto-objects -fexceptions -g -grecord-gcc-switches -pipe -Wall -Werror=format-security -Wp,-D_FORTIFY_SOURCE=2 -Wp,-D_GLIBCXX_ASSERTIONS -specs=/usr/lib/rpm/OpenCloudOS/OpenCloudOS-hardened-cc1 -fstack-protector-strong  -m64 -march=x86-64-v2 -mtune=generic -fasynchronous-unwind-tables -fstack-clash-protection -fcf-protection -std=gnu99 -fPIC -Wall -Wwrite-strings -Wmissing-prototypes -Iinclude -DCAPSTONE_USE_SYS_DYN_MEM -DCAPSTONE_HAS_ARM -DCAPSTONE_HAS_ARM64 -DCAPSTONE_HAS_M68K -DCAPSTONE_HAS_MIPS -DCAPSTONE_HAS_SH -DCAPSTONE_HAS_POWERPC -DCAPSTONE_HAS_SPARC -DCAPSTONE_HAS_SYSZ -DCAPSTONE_HAS_X86 -DCAPSTONE_HAS_XCORE -DCAPSTONE_HAS_TMS320C64X -DCAPSTONE_HAS_M680X -DCAPSTONE_HAS_EVM -DCAPSTONE_HAS_RISCV -DCAPSTONE_HAS_WASM -DCAPSTONE_HAS_MOS65XX -DCAPSTONE_HAS_BPF -DCAPSTONE_HAS_TRICORE  -fvisibility=hidden -I../include -I. -c cstool_powerpc.c -o cstool_powerpc.o
make[1]: Leaving directory '/builddir/build/BUILD/capstone-5.0.1/cstool'
make[1]: Entering directory '/builddir/build/BUILD/capstone-5.0.1/cstool'
gcc -O2 -flto=auto -ffat-lto-objects -fexceptions -g -grecord-gcc-switches -pipe -Wall -Werror=format-security -Wp,-D_FORTIFY_SOURCE=2 -Wp,-D_GLIBCXX_ASSERTIONS -specs=/usr/lib/rpm/OpenCloudOS/OpenCloudOS-hardened-cc1 -fstack-protector-strong  -m64 -march=x86-64-v2 -mtune=generic -fasynchronous-unwind-tables -fstack-clash-protection -fcf-protection -std=gnu99 -fPIC -Wall -Wwrite-strings -Wmissing-prototypes -Iinclude -DCAPSTONE_USE_SYS_DYN_MEM -DCAPSTONE_HAS_ARM -DCAPSTONE_HAS_ARM64 -DCAPSTONE_HAS_M68K -DCAPSTONE_HAS_MIPS -DCAPSTONE_HAS_SH -DCAPSTONE_HAS_POWERPC -DCAPSTONE_HAS_SPARC -DCAPSTONE_HAS_SYSZ -DCAPSTONE_HAS_X86 -DCAPSTONE_HAS_XCORE -DCAPSTONE_HAS_TMS320C64X -DCAPSTONE_HAS_M680X -DCAPSTONE_HAS_EVM -DCAPSTONE_HAS_RISCV -DCAPSTONE_HAS_WASM -DCAPSTONE_HAS_MOS65XX -DCAPSTONE_HAS_BPF -DCAPSTONE_HAS_TRICORE  -fvisibility=hidden -I../include -I. -c cstool_wasm.c -o cstool_wasm.o
make[1]: Leaving directory '/builddir/build/BUILD/capstone-5.0.1/cstool'
make[1]: Entering directory '/builddir/build/BUILD/capstone-5.0.1/cstool'
gcc -O2 -flto=auto -ffat-lto-objects -fexceptions -g -grecord-gcc-switches -pipe -Wall -Werror=format-security -Wp,-D_FORTIFY_SOURCE=2 -Wp,-D_GLIBCXX_ASSERTIONS -specs=/usr/lib/rpm/OpenCloudOS/OpenCloudOS-hardened-cc1 -fstack-protector-strong  -m64 -march=x86-64-v2 -mtune=generic -fasynchronous-unwind-tables -fstack-clash-protection -fcf-protection -std=gnu99 -fPIC -Wall -Wwrite-strings -Wmissing-prototypes -Iinclude -DCAPSTONE_USE_SYS_DYN_MEM -DCAPSTONE_HAS_ARM -DCAPSTONE_HAS_ARM64 -DCAPSTONE_HAS_M68K -DCAPSTONE_HAS_MIPS -DCAPSTONE_HAS_SH -DCAPSTONE_HAS_POWERPC -DCAPSTONE_HAS_SPARC -DCAPSTONE_HAS_SYSZ -DCAPSTONE_HAS_X86 -DCAPSTONE_HAS_XCORE -DCAPSTONE_HAS_TMS320C64X -DCAPSTONE_HAS_M680X -DCAPSTONE_HAS_EVM -DCAPSTONE_HAS_RISCV -DCAPSTONE_HAS_WASM -DCAPSTONE_HAS_MOS65XX -DCAPSTONE_HAS_BPF -DCAPSTONE_HAS_TRICORE  -fvisibility=hidden -I../include -I. -c cstool_mos65xx.c -o cstool_mos65xx.o
make[1]: Leaving directory '/builddir/build/BUILD/capstone-5.0.1/cstool'
make[1]: Entering directory '/builddir/build/BUILD/capstone-5.0.1/cstool'
gcc -O2 -flto=auto -ffat-lto-objects -fexceptions -g -grecord-gcc-switches -pipe -Wall -Werror=format-security -Wp,-D_FORTIFY_SOURCE=2 -Wp,-D_GLIBCXX_ASSERTIONS -specs=/usr/lib/rpm/OpenCloudOS/OpenCloudOS-hardened-cc1 -fstack-protector-strong  -m64 -march=x86-64-v2 -mtune=generic -fasynchronous-unwind-tables -fstack-clash-protection -fcf-protection -std=gnu99 -fPIC -Wall -Wwrite-strings -Wmissing-prototypes -Iinclude -DCAPSTONE_USE_SYS_DYN_MEM -DCAPSTONE_HAS_ARM -DCAPSTONE_HAS_ARM64 -DCAPSTONE_HAS_M68K -DCAPSTONE_HAS_MIPS -DCAPSTONE_HAS_SH -DCAPSTONE_HAS_POWERPC -DCAPSTONE_HAS_SPARC -DCAPSTONE_HAS_SYSZ -DCAPSTONE_HAS_X86 -DCAPSTONE_HAS_XCORE -DCAPSTONE_HAS_TMS320C64X -DCAPSTONE_HAS_M680X -DCAPSTONE_HAS_EVM -DCAPSTONE_HAS_RISCV -DCAPSTONE_HAS_WASM -DCAPSTONE_HAS_MOS65XX -DCAPSTONE_HAS_BPF -DCAPSTONE_HAS_TRICORE  -fvisibility=hidden -I../include -I. -c cstool_sparc.c -o cstool_sparc.o
make[1]: Leaving directory '/builddir/build/BUILD/capstone-5.0.1/cstool'
make[1]: Entering directory '/builddir/build/BUILD/capstone-5.0.1/cstool'
gcc -O2 -flto=auto -ffat-lto-objects -fexceptions -g -grecord-gcc-switches -pipe -Wall -Werror=format-security -Wp,-D_FORTIFY_SOURCE=2 -Wp,-D_GLIBCXX_ASSERTIONS -specs=/usr/lib/rpm/OpenCloudOS/OpenCloudOS-hardened-cc1 -fstack-protector-strong  -m64 -march=x86-64-v2 -mtune=generic -fasynchronous-unwind-tables -fstack-clash-protection -fcf-protection -std=gnu99 -fPIC -Wall -Wwrite-strings -Wmissing-prototypes -Iinclude -DCAPSTONE_USE_SYS_DYN_MEM -DCAPSTONE_HAS_ARM -DCAPSTONE_HAS_ARM64 -DCAPSTONE_HAS_M68K -DCAPSTONE_HAS_MIPS -DCAPSTONE_HAS_SH -DCAPSTONE_HAS_POWERPC -DCAPSTONE_HAS_SPARC -DCAPSTONE_HAS_SYSZ -DCAPSTONE_HAS_X86 -DCAPSTONE_HAS_XCORE -DCAPSTONE_HAS_TMS320C64X -DCAPSTONE_HAS_M680X -DCAPSTONE_HAS_EVM -DCAPSTONE_HAS_RISCV -DCAPSTONE_HAS_WASM -DCAPSTONE_HAS_MOS65XX -DCAPSTONE_HAS_BPF -DCAPSTONE_HAS_TRICORE  -fvisibility=hidden -I../include -I. -c cstool_xcore.c -o cstool_xcore.o
make[1]: Leaving directory '/builddir/build/BUILD/capstone-5.0.1/cstool'
make[1]: Entering directory '/builddir/build/BUILD/capstone-5.0.1/cstool'
gcc -O2 -flto=auto -ffat-lto-objects -fexceptions -g -grecord-gcc-switches -pipe -Wall -Werror=format-security -Wp,-D_FORTIFY_SOURCE=2 -Wp,-D_GLIBCXX_ASSERTIONS -specs=/usr/lib/rpm/OpenCloudOS/OpenCloudOS-hardened-cc1 -fstack-protector-strong  -m64 -march=x86-64-v2 -mtune=generic -fasynchronous-unwind-tables -fstack-clash-protection -fcf-protection -std=gnu99 -fPIC -Wall -Wwrite-strings -Wmissing-prototypes -Iinclude -DCAPSTONE_USE_SYS_DYN_MEM -DCAPSTONE_HAS_ARM -DCAPSTONE_HAS_ARM64 -DCAPSTONE_HAS_M68K -DCAPSTONE_HAS_MIPS -DCAPSTONE_HAS_SH -DCAPSTONE_HAS_POWERPC -DCAPSTONE_HAS_SPARC -DCAPSTONE_HAS_SYSZ -DCAPSTONE_HAS_X86 -DCAPSTONE_HAS_XCORE -DCAPSTONE_HAS_TMS320C64X -DCAPSTONE_HAS_M680X -DCAPSTONE_HAS_EVM -DCAPSTONE_HAS_RISCV -DCAPSTONE_HAS_WASM -DCAPSTONE_HAS_MOS65XX -DCAPSTONE_HAS_BPF -DCAPSTONE_HAS_TRICORE  -fvisibility=hidden -I../include -I. -c cstool_tricore.c -o cstool_tricore.o
make[1]: Leaving directory '/builddir/build/BUILD/capstone-5.0.1/cstool'
make[1]: Entering directory '/builddir/build/BUILD/capstone-5.0.1/cstool'
gcc -O2 -flto=auto -ffat-lto-objects -fexceptions -g -grecord-gcc-switches -pipe -Wall -Werror=format-security -Wp,-D_FORTIFY_SOURCE=2 -Wp,-D_GLIBCXX_ASSERTIONS -specs=/usr/lib/rpm/OpenCloudOS/OpenCloudOS-hardened-cc1 -fstack-protector-strong  -m64 -march=x86-64-v2 -mtune=generic -fasynchronous-unwind-tables -fstack-clash-protection -fcf-protection -std=gnu99 -fPIC -Wall -Wwrite-strings -Wmissing-prototypes -Iinclude -DCAPSTONE_USE_SYS_DYN_MEM -DCAPSTONE_HAS_ARM -DCAPSTONE_HAS_ARM64 -DCAPSTONE_HAS_M68K -DCAPSTONE_HAS_MIPS -DCAPSTONE_HAS_SH -DCAPSTONE_HAS_POWERPC -DCAPSTONE_HAS_SPARC -DCAPSTONE_HAS_SYSZ -DCAPSTONE_HAS_X86 -DCAPSTONE_HAS_XCORE -DCAPSTONE_HAS_TMS320C64X -DCAPSTONE_HAS_M680X -DCAPSTONE_HAS_EVM -DCAPSTONE_HAS_RISCV -DCAPSTONE_HAS_WASM -DCAPSTONE_HAS_MOS65XX -DCAPSTONE_HAS_BPF -DCAPSTONE_HAS_TRICORE  -fvisibility=hidden -I../include -I. -c cstool_x86.c -o cstool_x86.o
make[1]: Leaving directory '/builddir/build/BUILD/capstone-5.0.1/cstool'
make[1]: Entering directory '/builddir/build/BUILD/capstone-5.0.1/cstool'
gcc cstool.o cstool_arm.o cstool_arm64.o cstool_bpf.o cstool_evm.o cstool_m680x.o cstool_m68k.o cstool_mips.o cstool_mos65xx.o cstool_powerpc.o cstool_riscv.o cstool_sh.o cstool_sparc.o cstool_systemz.o cstool_tms320c64x.o cstool_tricore.o cstool_wasm.o cstool_x86.o cstool_xcore.o getopt.o -Wl,-z,relro -Wl,--as-needed  -Wl,-z,now -specs=/usr/lib/rpm/OpenCloudOS/OpenCloudOS-hardened-ld  -Wl,--build-id=sha1  -O3 -Wall -L.. -lcapstone -o cstool
make[1]: Leaving directory '/builddir/build/BUILD/capstone-5.0.1/cstool'
/usr/bin/make -C tests
make[1]: Entering directory '/builddir/build/BUILD/capstone-5.0.1/tests'
gcc -O2 -flto=auto -ffat-lto-objects -fexceptions -g -grecord-gcc-switches -pipe -Wall -Werror=format-security -Wp,-D_FORTIFY_SOURCE=2 -Wp,-D_GLIBCXX_ASSERTIONS -specs=/usr/lib/rpm/OpenCloudOS/OpenCloudOS-hardened-cc1 -fstack-protector-strong  -m64 -march=x86-64-v2 -mtune=generic -fasynchronous-unwind-tables -fstack-clash-protection -fcf-protection -std=gnu99 -fPIC -Wall -Wwrite-strings -Wmissing-prototypes -Iinclude -DCAPSTONE_USE_SYS_DYN_MEM -DCAPSTONE_HAS_ARM -DCAPSTONE_HAS_ARM64 -DCAPSTONE_HAS_M68K -DCAPSTONE_HAS_MIPS -DCAPSTONE_HAS_SH -DCAPSTONE_HAS_POWERPC -DCAPSTONE_HAS_SPARC -DCAPSTONE_HAS_SYSZ -DCAPSTONE_HAS_X86 -DCAPSTONE_HAS_XCORE -DCAPSTONE_HAS_TMS320C64X -DCAPSTONE_HAS_M680X -DCAPSTONE_HAS_EVM -DCAPSTONE_HAS_RISCV -DCAPSTONE_HAS_WASM -DCAPSTONE_HAS_MOS65XX -DCAPSTONE_HAS_BPF -DCAPSTONE_HAS_TRICORE  -fvisibility=hidden -Wall -I../include  -DCAPSTONE_HAS_ARM -DCAPSTONE_HAS_ARM64 -DCAPSTONE_HAS_M68K -DCAPSTONE_HAS_MIPS -DCAPSTONE_HAS_POWERPC -DCAPSTONE_HAS_SPARC -DCAPSTONE_HAS_SYSZ -DCAPSTONE_HAS_X86 -DCAPSTONE_HAS_XCORE -DCAPSTONE_HAS_TMS320C64X -DCAPSTONE_HAS_M680X -DCAPSTONE_HAS_EVM -DCAPSTONE_HAS_RISCV -DCAPSTONE_HAS_WASM -DCAPSTONE_HAS_MOS65XX -DCAPSTONE_HAS_BPF -DCAPSTONE_HAS_SH -c test_customized_mnem.c -o test_customized_mnem.o
make[1]: Leaving directory '/builddir/build/BUILD/capstone-5.0.1/tests'
make[1]: Entering directory '/builddir/build/BUILD/capstone-5.0.1/tests'
gcc -O2 -flto=auto -ffat-lto-objects -fexceptions -g -grecord-gcc-switches -pipe -Wall -Werror=format-security -Wp,-D_FORTIFY_SOURCE=2 -Wp,-D_GLIBCXX_ASSERTIONS -specs=/usr/lib/rpm/OpenCloudOS/OpenCloudOS-hardened-cc1 -fstack-protector-strong  -m64 -march=x86-64-v2 -mtune=generic -fasynchronous-unwind-tables -fstack-clash-protection -fcf-protection -std=gnu99 -fPIC -Wall -Wwrite-strings -Wmissing-prototypes -Iinclude -DCAPSTONE_USE_SYS_DYN_MEM -DCAPSTONE_HAS_ARM -DCAPSTONE_HAS_ARM64 -DCAPSTONE_HAS_M68K -DCAPSTONE_HAS_MIPS -DCAPSTONE_HAS_SH -DCAPSTONE_HAS_POWERPC -DCAPSTONE_HAS_SPARC -DCAPSTONE_HAS_SYSZ -DCAPSTONE_HAS_X86 -DCAPSTONE_HAS_XCORE -DCAPSTONE_HAS_TMS320C64X -DCAPSTONE_HAS_M680X -DCAPSTONE_HAS_EVM -DCAPSTONE_HAS_RISCV -DCAPSTONE_HAS_WASM -DCAPSTONE_HAS_MOS65XX -DCAPSTONE_HAS_BPF -DCAPSTONE_HAS_TRICORE  -fvisibility=hidden -Wall -I../include  -DCAPSTONE_HAS_ARM -DCAPSTONE_HAS_ARM64 -DCAPSTONE_HAS_M68K -DCAPSTONE_HAS_MIPS -DCAPSTONE_HAS_POWERPC -DCAPSTONE_HAS_SPARC -DCAPSTONE_HAS_SYSZ -DCAPSTONE_HAS_X86 -DCAPSTONE_HAS_XCORE -DCAPSTONE_HAS_TMS320C64X -DCAPSTONE_HAS_M680X -DCAPSTONE_HAS_EVM -DCAPSTONE_HAS_RISCV -DCAPSTONE_HAS_WASM -DCAPSTONE_HAS_MOS65XX -DCAPSTONE_HAS_BPF -DCAPSTONE_HAS_SH -c test_skipdata.c -o test_skipdata.o
make[1]: Leaving directory '/builddir/build/BUILD/capstone-5.0.1/tests'
make[1]: Entering directory '/builddir/build/BUILD/capstone-5.0.1/tests'
gcc -O2 -flto=auto -ffat-lto-objects -fexceptions -g -grecord-gcc-switches -pipe -Wall -Werror=format-security -Wp,-D_FORTIFY_SOURCE=2 -Wp,-D_GLIBCXX_ASSERTIONS -specs=/usr/lib/rpm/OpenCloudOS/OpenCloudOS-hardened-cc1 -fstack-protector-strong  -m64 -march=x86-64-v2 -mtune=generic -fasynchronous-unwind-tables -fstack-clash-protection -fcf-protection -std=gnu99 -fPIC -Wall -Wwrite-strings -Wmissing-prototypes -Iinclude -DCAPSTONE_USE_SYS_DYN_MEM -DCAPSTONE_HAS_ARM -DCAPSTONE_HAS_ARM64 -DCAPSTONE_HAS_M68K -DCAPSTONE_HAS_MIPS -DCAPSTONE_HAS_SH -DCAPSTONE_HAS_POWERPC -DCAPSTONE_HAS_SPARC -DCAPSTONE_HAS_SYSZ -DCAPSTONE_HAS_X86 -DCAPSTONE_HAS_XCORE -DCAPSTONE_HAS_TMS320C64X -DCAPSTONE_HAS_M680X -DCAPSTONE_HAS_EVM -DCAPSTONE_HAS_RISCV -DCAPSTONE_HAS_WASM -DCAPSTONE_HAS_MOS65XX -DCAPSTONE_HAS_BPF -DCAPSTONE_HAS_TRICORE  -fvisibility=hidden -Wall -I../include  -DCAPSTONE_HAS_ARM -DCAPSTONE_HAS_ARM64 -DCAPSTONE_HAS_M68K -DCAPSTONE_HAS_MIPS -DCAPSTONE_HAS_POWERPC -DCAPSTONE_HAS_SPARC -DCAPSTONE_HAS_SYSZ -DCAPSTONE_HAS_X86 -DCAPSTONE_HAS_XCORE -DCAPSTONE_HAS_TMS320C64X -DCAPSTONE_HAS_M680X -DCAPSTONE_HAS_EVM -DCAPSTONE_HAS_RISCV -DCAPSTONE_HAS_WASM -DCAPSTONE_HAS_MOS65XX -DCAPSTONE_HAS_BPF -DCAPSTONE_HAS_SH -c test_sparc.c -o test_sparc.o
make[1]: Leaving directory '/builddir/build/BUILD/capstone-5.0.1/tests'
make[1]: Entering directory '/builddir/build/BUILD/capstone-5.0.1/tests'
gcc -O2 -flto=auto -ffat-lto-objects -fexceptions -g -grecord-gcc-switches -pipe -Wall -Werror=format-security -Wp,-D_FORTIFY_SOURCE=2 -Wp,-D_GLIBCXX_ASSERTIONS -specs=/usr/lib/rpm/OpenCloudOS/OpenCloudOS-hardened-cc1 -fstack-protector-strong  -m64 -march=x86-64-v2 -mtune=generic -fasynchronous-unwind-tables -fstack-clash-protection -fcf-protection -std=gnu99 -fPIC -Wall -Wwrite-strings -Wmissing-prototypes -Iinclude -DCAPSTONE_USE_SYS_DYN_MEM -DCAPSTONE_HAS_ARM -DCAPSTONE_HAS_ARM64 -DCAPSTONE_HAS_M68K -DCAPSTONE_HAS_MIPS -DCAPSTONE_HAS_SH -DCAPSTONE_HAS_POWERPC -DCAPSTONE_HAS_SPARC -DCAPSTONE_HAS_SYSZ -DCAPSTONE_HAS_X86 -DCAPSTONE_HAS_XCORE -DCAPSTONE_HAS_TMS320C64X -DCAPSTONE_HAS_M680X -DCAPSTONE_HAS_EVM -DCAPSTONE_HAS_RISCV -DCAPSTONE_HAS_WASM -DCAPSTONE_HAS_MOS65XX -DCAPSTONE_HAS_BPF -DCAPSTONE_HAS_TRICORE  -fvisibility=hidden -Wall -I../include  -DCAPSTONE_HAS_ARM -DCAPSTONE_HAS_ARM64 -DCAPSTONE_HAS_M68K -DCAPSTONE_HAS_MIPS -DCAPSTONE_HAS_POWERPC -DCAPSTONE_HAS_SPARC -DCAPSTONE_HAS_SYSZ -DCAPSTONE_HAS_X86 -DCAPSTONE_HAS_XCORE -DCAPSTONE_HAS_TMS320C64X -DCAPSTONE_HAS_M680X -DCAPSTONE_HAS_EVM -DCAPSTONE_HAS_RISCV -DCAPSTONE_HAS_WASM -DCAPSTONE_HAS_MOS65XX -DCAPSTONE_HAS_BPF -DCAPSTONE_HAS_SH -c test_evm.c -o test_evm.o
make[1]: Leaving directory '/builddir/build/BUILD/capstone-5.0.1/tests'
make[1]: Entering directory '/builddir/build/BUILD/capstone-5.0.1/tests'
gcc -O2 -flto=auto -ffat-lto-objects -fexceptions -g -grecord-gcc-switches -pipe -Wall -Werror=format-security -Wp,-D_FORTIFY_SOURCE=2 -Wp,-D_GLIBCXX_ASSERTIONS -specs=/usr/lib/rpm/OpenCloudOS/OpenCloudOS-hardened-cc1 -fstack-protector-strong  -m64 -march=x86-64-v2 -mtune=generic -fasynchronous-unwind-tables -fstack-clash-protection -fcf-protection -std=gnu99 -fPIC -Wall -Wwrite-strings -Wmissing-prototypes -Iinclude -DCAPSTONE_USE_SYS_DYN_MEM -DCAPSTONE_HAS_ARM -DCAPSTONE_HAS_ARM64 -DCAPSTONE_HAS_M68K -DCAPSTONE_HAS_MIPS -DCAPSTONE_HAS_SH -DCAPSTONE_HAS_POWERPC -DCAPSTONE_HAS_SPARC -DCAPSTONE_HAS_SYSZ -DCAPSTONE_HAS_X86 -DCAPSTONE_HAS_XCORE -DCAPSTONE_HAS_TMS320C64X -DCAPSTONE_HAS_M680X -DCAPSTONE_HAS_EVM -DCAPSTONE_HAS_RISCV -DCAPSTONE_HAS_WASM -DCAPSTONE_HAS_MOS65XX -DCAPSTONE_HAS_BPF -DCAPSTONE_HAS_TRICORE  -fvisibility=hidden -Wall -I../include  -DCAPSTONE_HAS_ARM -DCAPSTONE_HAS_ARM64 -DCAPSTONE_HAS_M68K -DCAPSTONE_HAS_MIPS -DCAPSTONE_HAS_POWERPC -DCAPSTONE_HAS_SPARC -DCAPSTONE_HAS_SYSZ -DCAPSTONE_HAS_X86 -DCAPSTONE_HAS_XCORE -DCAPSTONE_HAS_TMS320C64X -DCAPSTONE_HAS_M680X -DCAPSTONE_HAS_EVM -DCAPSTONE_HAS_RISCV -DCAPSTONE_HAS_WASM -DCAPSTONE_HAS_MOS65XX -DCAPSTONE_HAS_BPF -DCAPSTONE_HAS_SH -c test_systemz.c -o test_systemz.o
make[1]: Leaving directory '/builddir/build/BUILD/capstone-5.0.1/tests'
make[1]: Entering directory '/builddir/build/BUILD/capstone-5.0.1/tests'
gcc -O2 -flto=auto -ffat-lto-objects -fexceptions -g -grecord-gcc-switches -pipe -Wall -Werror=format-security -Wp,-D_FORTIFY_SOURCE=2 -Wp,-D_GLIBCXX_ASSERTIONS -specs=/usr/lib/rpm/OpenCloudOS/OpenCloudOS-hardened-cc1 -fstack-protector-strong  -m64 -march=x86-64-v2 -mtune=generic -fasynchronous-unwind-tables -fstack-clash-protection -fcf-protection -std=gnu99 -fPIC -Wall -Wwrite-strings -Wmissing-prototypes -Iinclude -DCAPSTONE_USE_SYS_DYN_MEM -DCAPSTONE_HAS_ARM -DCAPSTONE_HAS_ARM64 -DCAPSTONE_HAS_M68K -DCAPSTONE_HAS_MIPS -DCAPSTONE_HAS_SH -DCAPSTONE_HAS_POWERPC -DCAPSTONE_HAS_SPARC -DCAPSTONE_HAS_SYSZ -DCAPSTONE_HAS_X86 -DCAPSTONE_HAS_XCORE -DCAPSTONE_HAS_TMS320C64X -DCAPSTONE_HAS_M680X -DCAPSTONE_HAS_EVM -DCAPSTONE_HAS_RISCV -DCAPSTONE_HAS_WASM -DCAPSTONE_HAS_MOS65XX -DCAPSTONE_HAS_BPF -DCAPSTONE_HAS_TRICORE  -fvisibility=hidden -Wall -I../include  -DCAPSTONE_HAS_ARM -DCAPSTONE_HAS_ARM64 -DCAPSTONE_HAS_M68K -DCAPSTONE_HAS_MIPS -DCAPSTONE_HAS_POWERPC -DCAPSTONE_HAS_SPARC -DCAPSTONE_HAS_SYSZ -DCAPSTONE_HAS_X86 -DCAPSTONE_HAS_XCORE -DCAPSTONE_HAS_TMS320C64X -DCAPSTONE_HAS_M680X -DCAPSTONE_HAS_EVM -DCAPSTONE_HAS_RISCV -DCAPSTONE_HAS_WASM -DCAPSTONE_HAS_MOS65XX -DCAPSTONE_HAS_BPF -DCAPSTONE_HAS_SH -c test_iter.c -o test_iter.o
make[1]: Leaving directory '/builddir/build/BUILD/capstone-5.0.1/tests'
make[1]: Entering directory '/builddir/build/BUILD/capstone-5.0.1/tests'
gcc -O2 -flto=auto -ffat-lto-objects -fexceptions -g -grecord-gcc-switches -pipe -Wall -Werror=format-security -Wp,-D_FORTIFY_SOURCE=2 -Wp,-D_GLIBCXX_ASSERTIONS -specs=/usr/lib/rpm/OpenCloudOS/OpenCloudOS-hardened-cc1 -fstack-protector-strong  -m64 -march=x86-64-v2 -mtune=generic -fasynchronous-unwind-tables -fstack-clash-protection -fcf-protection -std=gnu99 -fPIC -Wall -Wwrite-strings -Wmissing-prototypes -Iinclude -DCAPSTONE_USE_SYS_DYN_MEM -DCAPSTONE_HAS_ARM -DCAPSTONE_HAS_ARM64 -DCAPSTONE_HAS_M68K -DCAPSTONE_HAS_MIPS -DCAPSTONE_HAS_SH -DCAPSTONE_HAS_POWERPC -DCAPSTONE_HAS_SPARC -DCAPSTONE_HAS_SYSZ -DCAPSTONE_HAS_X86 -DCAPSTONE_HAS_XCORE -DCAPSTONE_HAS_TMS320C64X -DCAPSTONE_HAS_M680X -DCAPSTONE_HAS_EVM -DCAPSTONE_HAS_RISCV -DCAPSTONE_HAS_WASM -DCAPSTONE_HAS_MOS65XX -DCAPSTONE_HAS_BPF -DCAPSTONE_HAS_TRICORE  -fvisibility=hidden -Wall -I../include  -DCAPSTONE_HAS_ARM -DCAPSTONE_HAS_ARM64 -DCAPSTONE_HAS_M68K -DCAPSTONE_HAS_MIPS -DCAPSTONE_HAS_POWERPC -DCAPSTONE_HAS_SPARC -DCAPSTONE_HAS_SYSZ -DCAPSTONE_HAS_X86 -DCAPSTONE_HAS_XCORE -DCAPSTONE_HAS_TMS320C64X -DCAPSTONE_HAS_M680X -DCAPSTONE_HAS_EVM -DCAPSTONE_HAS_RISCV -DCAPSTONE_HAS_WASM -DCAPSTONE_HAS_MOS65XX -DCAPSTONE_HAS_BPF -DCAPSTONE_HAS_SH -c test_mips.c -o test_mips.o
make[1]: Leaving directory '/builddir/build/BUILD/capstone-5.0.1/tests'
make[1]: Entering directory '/builddir/build/BUILD/capstone-5.0.1/tests'
gcc -O2 -flto=auto -ffat-lto-objects -fexceptions -g -grecord-gcc-switches -pipe -Wall -Werror=format-security -Wp,-D_FORTIFY_SOURCE=2 -Wp,-D_GLIBCXX_ASSERTIONS -specs=/usr/lib/rpm/OpenCloudOS/OpenCloudOS-hardened-cc1 -fstack-protector-strong  -m64 -march=x86-64-v2 -mtune=generic -fasynchronous-unwind-tables -fstack-clash-protection -fcf-protection -std=gnu99 -fPIC -Wall -Wwrite-strings -Wmissing-prototypes -Iinclude -DCAPSTONE_USE_SYS_DYN_MEM -DCAPSTONE_HAS_ARM -DCAPSTONE_HAS_ARM64 -DCAPSTONE_HAS_M68K -DCAPSTONE_HAS_MIPS -DCAPSTONE_HAS_SH -DCAPSTONE_HAS_POWERPC -DCAPSTONE_HAS_SPARC -DCAPSTONE_HAS_SYSZ -DCAPSTONE_HAS_X86 -DCAPSTONE_HAS_XCORE -DCAPSTONE_HAS_TMS320C64X -DCAPSTONE_HAS_M680X -DCAPSTONE_HAS_EVM -DCAPSTONE_HAS_RISCV -DCAPSTONE_HAS_WASM -DCAPSTONE_HAS_MOS65XX -DCAPSTONE_HAS_BPF -DCAPSTONE_HAS_TRICORE  -fvisibility=hidden -Wall -I../include  -DCAPSTONE_HAS_ARM -DCAPSTONE_HAS_ARM64 -DCAPSTONE_HAS_M68K -DCAPSTONE_HAS_MIPS -DCAPSTONE_HAS_POWERPC -DCAPSTONE_HAS_SPARC -DCAPSTONE_HAS_SYSZ -DCAPSTONE_HAS_X86 -DCAPSTONE_HAS_XCORE -DCAPSTONE_HAS_TMS320C64X -DCAPSTONE_HAS_M680X -DCAPSTONE_HAS_EVM -DCAPSTONE_HAS_RISCV -DCAPSTONE_HAS_WASM -DCAPSTONE_HAS_MOS65XX -DCAPSTONE_HAS_BPF -DCAPSTONE_HAS_SH -c test_riscv.c -o test_riscv.o
make[1]: Leaving directory '/builddir/build/BUILD/capstone-5.0.1/tests'
make[1]: Entering directory '/builddir/build/BUILD/capstone-5.0.1/tests'
gcc -O2 -flto=auto -ffat-lto-objects -fexceptions -g -grecord-gcc-switches -pipe -Wall -Werror=format-security -Wp,-D_FORTIFY_SOURCE=2 -Wp,-D_GLIBCXX_ASSERTIONS -specs=/usr/lib/rpm/OpenCloudOS/OpenCloudOS-hardened-cc1 -fstack-protector-strong  -m64 -march=x86-64-v2 -mtune=generic -fasynchronous-unwind-tables -fstack-clash-protection -fcf-protection -std=gnu99 -fPIC -Wall -Wwrite-strings -Wmissing-prototypes -Iinclude -DCAPSTONE_USE_SYS_DYN_MEM -DCAPSTONE_HAS_ARM -DCAPSTONE_HAS_ARM64 -DCAPSTONE_HAS_M68K -DCAPSTONE_HAS_MIPS -DCAPSTONE_HAS_SH -DCAPSTONE_HAS_POWERPC -DCAPSTONE_HAS_SPARC -DCAPSTONE_HAS_SYSZ -DCAPSTONE_HAS_X86 -DCAPSTONE_HAS_XCORE -DCAPSTONE_HAS_TMS320C64X -DCAPSTONE_HAS_M680X -DCAPSTONE_HAS_EVM -DCAPSTONE_HAS_RISCV -DCAPSTONE_HAS_WASM -DCAPSTONE_HAS_MOS65XX -DCAPSTONE_HAS_BPF -DCAPSTONE_HAS_TRICORE  -fvisibility=hidden -Wall -I../include  -DCAPSTONE_HAS_ARM -DCAPSTONE_HAS_ARM64 -DCAPSTONE_HAS_M68K -DCAPSTONE_HAS_MIPS -DCAPSTONE_HAS_POWERPC -DCAPSTONE_HAS_SPARC -DCAPSTONE_HAS_SYSZ -DCAPSTONE_HAS_X86 -DCAPSTONE_HAS_XCORE -DCAPSTONE_HAS_TMS320C64X -DCAPSTONE_HAS_M680X -DCAPSTONE_HAS_EVM -DCAPSTONE_HAS_RISCV -DCAPSTONE_HAS_WASM -DCAPSTONE_HAS_MOS65XX -DCAPSTONE_HAS_BPF -DCAPSTONE_HAS_SH -c test_xcore.c -o test_xcore.o
make[1]: Leaving directory '/builddir/build/BUILD/capstone-5.0.1/tests'
make[1]: Entering directory '/builddir/build/BUILD/capstone-5.0.1/tests'
gcc -O2 -flto=auto -ffat-lto-objects -fexceptions -g -grecord-gcc-switches -pipe -Wall -Werror=format-security -Wp,-D_FORTIFY_SOURCE=2 -Wp,-D_GLIBCXX_ASSERTIONS -specs=/usr/lib/rpm/OpenCloudOS/OpenCloudOS-hardened-cc1 -fstack-protector-strong  -m64 -march=x86-64-v2 -mtune=generic -fasynchronous-unwind-tables -fstack-clash-protection -fcf-protection -std=gnu99 -fPIC -Wall -Wwrite-strings -Wmissing-prototypes -Iinclude -DCAPSTONE_USE_SYS_DYN_MEM -DCAPSTONE_HAS_ARM -DCAPSTONE_HAS_ARM64 -DCAPSTONE_HAS_M68K -DCAPSTONE_HAS_MIPS -DCAPSTONE_HAS_SH -DCAPSTONE_HAS_POWERPC -DCAPSTONE_HAS_SPARC -DCAPSTONE_HAS_SYSZ -DCAPSTONE_HAS_X86 -DCAPSTONE_HAS_XCORE -DCAPSTONE_HAS_TMS320C64X -DCAPSTONE_HAS_M680X -DCAPSTONE_HAS_EVM -DCAPSTONE_HAS_RISCV -DCAPSTONE_HAS_WASM -DCAPSTONE_HAS_MOS65XX -DCAPSTONE_HAS_BPF -DCAPSTONE_HAS_TRICORE  -fvisibility=hidden -Wall -I../include  -DCAPSTONE_HAS_ARM -DCAPSTONE_HAS_ARM64 -DCAPSTONE_HAS_M68K -DCAPSTONE_HAS_MIPS -DCAPSTONE_HAS_POWERPC -DCAPSTONE_HAS_SPARC -DCAPSTONE_HAS_SYSZ -DCAPSTONE_HAS_X86 -DCAPSTONE_HAS_XCORE -DCAPSTONE_HAS_TMS320C64X -DCAPSTONE_HAS_M680X -DCAPSTONE_HAS_EVM -DCAPSTONE_HAS_RISCV -DCAPSTONE_HAS_WASM -DCAPSTONE_HAS_MOS65XX -DCAPSTONE_HAS_BPF -DCAPSTONE_HAS_SH -c test_detail.c -o test_detail.o
make[1]: Leaving directory '/builddir/build/BUILD/capstone-5.0.1/tests'
make[1]: Entering directory '/builddir/build/BUILD/capstone-5.0.1/tests'
gcc -O2 -flto=auto -ffat-lto-objects -fexceptions -g -grecord-gcc-switches -pipe -Wall -Werror=format-security -Wp,-D_FORTIFY_SOURCE=2 -Wp,-D_GLIBCXX_ASSERTIONS -specs=/usr/lib/rpm/OpenCloudOS/OpenCloudOS-hardened-cc1 -fstack-protector-strong  -m64 -march=x86-64-v2 -mtune=generic -fasynchronous-unwind-tables -fstack-clash-protection -fcf-protection -std=gnu99 -fPIC -Wall -Wwrite-strings -Wmissing-prototypes -Iinclude -DCAPSTONE_USE_SYS_DYN_MEM -DCAPSTONE_HAS_ARM -DCAPSTONE_HAS_ARM64 -DCAPSTONE_HAS_M68K -DCAPSTONE_HAS_MIPS -DCAPSTONE_HAS_SH -DCAPSTONE_HAS_POWERPC -DCAPSTONE_HAS_SPARC -DCAPSTONE_HAS_SYSZ -DCAPSTONE_HAS_X86 -DCAPSTONE_HAS_XCORE -DCAPSTONE_HAS_TMS320C64X -DCAPSTONE_HAS_M680X -DCAPSTONE_HAS_EVM -DCAPSTONE_HAS_RISCV -DCAPSTONE_HAS_WASM -DCAPSTONE_HAS_MOS65XX -DCAPSTONE_HAS_BPF -DCAPSTONE_HAS_TRICORE  -fvisibility=hidden -Wall -I../include  -DCAPSTONE_HAS_ARM -DCAPSTONE_HAS_ARM64 -DCAPSTONE_HAS_M68K -DCAPSTONE_HAS_MIPS -DCAPSTONE_HAS_POWERPC -DCAPSTONE_HAS_SPARC -DCAPSTONE_HAS_SYSZ -DCAPSTONE_HAS_X86 -DCAPSTONE_HAS_XCORE -DCAPSTONE_HAS_TMS320C64X -DCAPSTONE_HAS_M680X -DCAPSTONE_HAS_EVM -DCAPSTONE_HAS_RISCV -DCAPSTONE_HAS_WASM -DCAPSTONE_HAS_MOS65XX -DCAPSTONE_HAS_BPF -DCAPSTONE_HAS_SH -c test_wasm.c -o test_wasm.o
make[1]: Leaving directory '/builddir/build/BUILD/capstone-5.0.1/tests'
make[1]: Entering directory '/builddir/build/BUILD/capstone-5.0.1/tests'
gcc -O2 -flto=auto -ffat-lto-objects -fexceptions -g -grecord-gcc-switches -pipe -Wall -Werror=format-security -Wp,-D_FORTIFY_SOURCE=2 -Wp,-D_GLIBCXX_ASSERTIONS -specs=/usr/lib/rpm/OpenCloudOS/OpenCloudOS-hardened-cc1 -fstack-protector-strong  -m64 -march=x86-64-v2 -mtune=generic -fasynchronous-unwind-tables -fstack-clash-protection -fcf-protection -std=gnu99 -fPIC -Wall -Wwrite-strings -Wmissing-prototypes -Iinclude -DCAPSTONE_USE_SYS_DYN_MEM -DCAPSTONE_HAS_ARM -DCAPSTONE_HAS_ARM64 -DCAPSTONE_HAS_M68K -DCAPSTONE_HAS_MIPS -DCAPSTONE_HAS_SH -DCAPSTONE_HAS_POWERPC -DCAPSTONE_HAS_SPARC -DCAPSTONE_HAS_SYSZ -DCAPSTONE_HAS_X86 -DCAPSTONE_HAS_XCORE -DCAPSTONE_HAS_TMS320C64X -DCAPSTONE_HAS_M680X -DCAPSTONE_HAS_EVM -DCAPSTONE_HAS_RISCV -DCAPSTONE_HAS_WASM -DCAPSTONE_HAS_MOS65XX -DCAPSTONE_HAS_BPF -DCAPSTONE_HAS_TRICORE  -fvisibility=hidden -Wall -I../include  -DCAPSTONE_HAS_ARM -DCAPSTONE_HAS_ARM64 -DCAPSTONE_HAS_M68K -DCAPSTONE_HAS_MIPS -DCAPSTONE_HAS_POWERPC -DCAPSTONE_HAS_SPARC -DCAPSTONE_HAS_SYSZ -DCAPSTONE_HAS_X86 -DCAPSTONE_HAS_XCORE -DCAPSTONE_HAS_TMS320C64X -DCAPSTONE_HAS_M680X -DCAPSTONE_HAS_EVM -DCAPSTONE_HAS_RISCV -DCAPSTONE_HAS_WASM -DCAPSTONE_HAS_MOS65XX -DCAPSTONE_HAS_BPF -DCAPSTONE_HAS_SH -c test_arm64.c -o test_arm64.o
make[1]: Leaving directory '/builddir/build/BUILD/capstone-5.0.1/tests'
make[1]: Entering directory '/builddir/build/BUILD/capstone-5.0.1/tests'
gcc -O2 -flto=auto -ffat-lto-objects -fexceptions -g -grecord-gcc-switches -pipe -Wall -Werror=format-security -Wp,-D_FORTIFY_SOURCE=2 -Wp,-D_GLIBCXX_ASSERTIONS -specs=/usr/lib/rpm/OpenCloudOS/OpenCloudOS-hardened-cc1 -fstack-protector-strong  -m64 -march=x86-64-v2 -mtune=generic -fasynchronous-unwind-tables -fstack-clash-protection -fcf-protection -std=gnu99 -fPIC -Wall -Wwrite-strings -Wmissing-prototypes -Iinclude -DCAPSTONE_USE_SYS_DYN_MEM -DCAPSTONE_HAS_ARM -DCAPSTONE_HAS_ARM64 -DCAPSTONE_HAS_M68K -DCAPSTONE_HAS_MIPS -DCAPSTONE_HAS_SH -DCAPSTONE_HAS_POWERPC -DCAPSTONE_HAS_SPARC -DCAPSTONE_HAS_SYSZ -DCAPSTONE_HAS_X86 -DCAPSTONE_HAS_XCORE -DCAPSTONE_HAS_TMS320C64X -DCAPSTONE_HAS_M680X -DCAPSTONE_HAS_EVM -DCAPSTONE_HAS_RISCV -DCAPSTONE_HAS_WASM -DCAPSTONE_HAS_MOS65XX -DCAPSTONE_HAS_BPF -DCAPSTONE_HAS_TRICORE  -fvisibility=hidden -Wall -I../include  -DCAPSTONE_HAS_ARM -DCAPSTONE_HAS_ARM64 -DCAPSTONE_HAS_M68K -DCAPSTONE_HAS_MIPS -DCAPSTONE_HAS_POWERPC -DCAPSTONE_HAS_SPARC -DCAPSTONE_HAS_SYSZ -DCAPSTONE_HAS_X86 -DCAPSTONE_HAS_XCORE -DCAPSTONE_HAS_TMS320C64X -DCAPSTONE_HAS_M680X -DCAPSTONE_HAS_EVM -DCAPSTONE_HAS_RISCV -DCAPSTONE_HAS_WASM -DCAPSTONE_HAS_MOS65XX -DCAPSTONE_HAS_BPF -DCAPSTONE_HAS_SH -c test_arm.c -o test_arm.o
make[1]: Leaving directory '/builddir/build/BUILD/capstone-5.0.1/tests'
make[1]: Entering directory '/builddir/build/BUILD/capstone-5.0.1/tests'
gcc -O2 -flto=auto -ffat-lto-objects -fexceptions -g -grecord-gcc-switches -pipe -Wall -Werror=format-security -Wp,-D_FORTIFY_SOURCE=2 -Wp,-D_GLIBCXX_ASSERTIONS -specs=/usr/lib/rpm/OpenCloudOS/OpenCloudOS-hardened-cc1 -fstack-protector-strong  -m64 -march=x86-64-v2 -mtune=generic -fasynchronous-unwind-tables -fstack-clash-protection -fcf-protection -std=gnu99 -fPIC -Wall -Wwrite-strings -Wmissing-prototypes -Iinclude -DCAPSTONE_USE_SYS_DYN_MEM -DCAPSTONE_HAS_ARM -DCAPSTONE_HAS_ARM64 -DCAPSTONE_HAS_M68K -DCAPSTONE_HAS_MIPS -DCAPSTONE_HAS_SH -DCAPSTONE_HAS_POWERPC -DCAPSTONE_HAS_SPARC -DCAPSTONE_HAS_SYSZ -DCAPSTONE_HAS_X86 -DCAPSTONE_HAS_XCORE -DCAPSTONE_HAS_TMS320C64X -DCAPSTONE_HAS_M680X -DCAPSTONE_HAS_EVM -DCAPSTONE_HAS_RISCV -DCAPSTONE_HAS_WASM -DCAPSTONE_HAS_MOS65XX -DCAPSTONE_HAS_BPF -DCAPSTONE_HAS_TRICORE  -fvisibility=hidden -Wall -I../include  -DCAPSTONE_HAS_ARM -DCAPSTONE_HAS_ARM64 -DCAPSTONE_HAS_M68K -DCAPSTONE_HAS_MIPS -DCAPSTONE_HAS_POWERPC -DCAPSTONE_HAS_SPARC -DCAPSTONE_HAS_SYSZ -DCAPSTONE_HAS_X86 -DCAPSTONE_HAS_XCORE -DCAPSTONE_HAS_TMS320C64X -DCAPSTONE_HAS_M680X -DCAPSTONE_HAS_EVM -DCAPSTONE_HAS_RISCV -DCAPSTONE_HAS_WASM -DCAPSTONE_HAS_MOS65XX -DCAPSTONE_HAS_BPF -DCAPSTONE_HAS_SH -c test_basic.c -o test_basic.o
make[1]: Leaving directory '/builddir/build/BUILD/capstone-5.0.1/tests'
make[1]: Entering directory '/builddir/build/BUILD/capstone-5.0.1/tests'
gcc -O2 -flto=auto -ffat-lto-objects -fexceptions -g -grecord-gcc-switches -pipe -Wall -Werror=format-security -Wp,-D_FORTIFY_SOURCE=2 -Wp,-D_GLIBCXX_ASSERTIONS -specs=/usr/lib/rpm/OpenCloudOS/OpenCloudOS-hardened-cc1 -fstack-protector-strong  -m64 -march=x86-64-v2 -mtune=generic -fasynchronous-unwind-tables -fstack-clash-protection -fcf-protection -std=gnu99 -fPIC -Wall -Wwrite-strings -Wmissing-prototypes -Iinclude -DCAPSTONE_USE_SYS_DYN_MEM -DCAPSTONE_HAS_ARM -DCAPSTONE_HAS_ARM64 -DCAPSTONE_HAS_M68K -DCAPSTONE_HAS_MIPS -DCAPSTONE_HAS_SH -DCAPSTONE_HAS_POWERPC -DCAPSTONE_HAS_SPARC -DCAPSTONE_HAS_SYSZ -DCAPSTONE_HAS_X86 -DCAPSTONE_HAS_XCORE -DCAPSTONE_HAS_TMS320C64X -DCAPSTONE_HAS_M680X -DCAPSTONE_HAS_EVM -DCAPSTONE_HAS_RISCV -DCAPSTONE_HAS_WASM -DCAPSTONE_HAS_MOS65XX -DCAPSTONE_HAS_BPF -DCAPSTONE_HAS_TRICORE  -fvisibility=hidden -Wall -I../include  -DCAPSTONE_HAS_ARM -DCAPSTONE_HAS_ARM64 -DCAPSTONE_HAS_M68K -DCAPSTONE_HAS_MIPS -DCAPSTONE_HAS_POWERPC -DCAPSTONE_HAS_SPARC -DCAPSTONE_HAS_SYSZ -DCAPSTONE_HAS_X86 -DCAPSTONE_HAS_XCORE -DCAPSTONE_HAS_TMS320C64X -DCAPSTONE_HAS_M680X -DCAPSTONE_HAS_EVM -DCAPSTONE_HAS_RISCV -DCAPSTONE_HAS_WASM -DCAPSTONE_HAS_MOS65XX -DCAPSTONE_HAS_BPF -DCAPSTONE_HAS_SH -c test_m68k.c -o test_m68k.o
make[1]: Leaving directory '/builddir/build/BUILD/capstone-5.0.1/tests'
make[1]: Entering directory '/builddir/build/BUILD/capstone-5.0.1/tests'
gcc -O2 -flto=auto -ffat-lto-objects -fexceptions -g -grecord-gcc-switches -pipe -Wall -Werror=format-security -Wp,-D_FORTIFY_SOURCE=2 -Wp,-D_GLIBCXX_ASSERTIONS -specs=/usr/lib/rpm/OpenCloudOS/OpenCloudOS-hardened-cc1 -fstack-protector-strong  -m64 -march=x86-64-v2 -mtune=generic -fasynchronous-unwind-tables -fstack-clash-protection -fcf-protection -std=gnu99 -fPIC -Wall -Wwrite-strings -Wmissing-prototypes -Iinclude -DCAPSTONE_USE_SYS_DYN_MEM -DCAPSTONE_HAS_ARM -DCAPSTONE_HAS_ARM64 -DCAPSTONE_HAS_M68K -DCAPSTONE_HAS_MIPS -DCAPSTONE_HAS_SH -DCAPSTONE_HAS_POWERPC -DCAPSTONE_HAS_SPARC -DCAPSTONE_HAS_SYSZ -DCAPSTONE_HAS_X86 -DCAPSTONE_HAS_XCORE -DCAPSTONE_HAS_TMS320C64X -DCAPSTONE_HAS_M680X -DCAPSTONE_HAS_EVM -DCAPSTONE_HAS_RISCV -DCAPSTONE_HAS_WASM -DCAPSTONE_HAS_MOS65XX -DCAPSTONE_HAS_BPF -DCAPSTONE_HAS_TRICORE  -fvisibility=hidden -Wall -I../include  -DCAPSTONE_HAS_ARM -DCAPSTONE_HAS_ARM64 -DCAPSTONE_HAS_M68K -DCAPSTONE_HAS_MIPS -DCAPSTONE_HAS_POWERPC -DCAPSTONE_HAS_SPARC -DCAPSTONE_HAS_SYSZ -DCAPSTONE_HAS_X86 -DCAPSTONE_HAS_XCORE -DCAPSTONE_HAS_TMS320C64X -DCAPSTONE_HAS_M680X -DCAPSTONE_HAS_EVM -DCAPSTONE_HAS_RISCV -DCAPSTONE_HAS_WASM -DCAPSTONE_HAS_MOS65XX -DCAPSTONE_HAS_BPF -DCAPSTONE_HAS_SH -c test_tms320c64x.c -o test_tms320c64x.o
make[1]: Leaving directory '/builddir/build/BUILD/capstone-5.0.1/tests'
make[1]: Entering directory '/builddir/build/BUILD/capstone-5.0.1/tests'
gcc -O2 -flto=auto -ffat-lto-objects -fexceptions -g -grecord-gcc-switches -pipe -Wall -Werror=format-security -Wp,-D_FORTIFY_SOURCE=2 -Wp,-D_GLIBCXX_ASSERTIONS -specs=/usr/lib/rpm/OpenCloudOS/OpenCloudOS-hardened-cc1 -fstack-protector-strong  -m64 -march=x86-64-v2 -mtune=generic -fasynchronous-unwind-tables -fstack-clash-protection -fcf-protection -std=gnu99 -fPIC -Wall -Wwrite-strings -Wmissing-prototypes -Iinclude -DCAPSTONE_USE_SYS_DYN_MEM -DCAPSTONE_HAS_ARM -DCAPSTONE_HAS_ARM64 -DCAPSTONE_HAS_M68K -DCAPSTONE_HAS_MIPS -DCAPSTONE_HAS_SH -DCAPSTONE_HAS_POWERPC -DCAPSTONE_HAS_SPARC -DCAPSTONE_HAS_SYSZ -DCAPSTONE_HAS_X86 -DCAPSTONE_HAS_XCORE -DCAPSTONE_HAS_TMS320C64X -DCAPSTONE_HAS_M680X -DCAPSTONE_HAS_EVM -DCAPSTONE_HAS_RISCV -DCAPSTONE_HAS_WASM -DCAPSTONE_HAS_MOS65XX -DCAPSTONE_HAS_BPF -DCAPSTONE_HAS_TRICORE  -fvisibility=hidden -Wall -I../include  -DCAPSTONE_HAS_ARM -DCAPSTONE_HAS_ARM64 -DCAPSTONE_HAS_M68K -DCAPSTONE_HAS_MIPS -DCAPSTONE_HAS_POWERPC -DCAPSTONE_HAS_SPARC -DCAPSTONE_HAS_SYSZ -DCAPSTONE_HAS_X86 -DCAPSTONE_HAS_XCORE -DCAPSTONE_HAS_TMS320C64X -DCAPSTONE_HAS_M680X -DCAPSTONE_HAS_EVM -DCAPSTONE_HAS_RISCV -DCAPSTONE_HAS_WASM -DCAPSTONE_HAS_MOS65XX -DCAPSTONE_HAS_BPF -DCAPSTONE_HAS_SH -c test_ppc.c -o test_ppc.o
make[1]: Leaving directory '/builddir/build/BUILD/capstone-5.0.1/tests'
make[1]: Entering directory '/builddir/build/BUILD/capstone-5.0.1/tests'
gcc -O2 -flto=auto -ffat-lto-objects -fexceptions -g -grecord-gcc-switches -pipe -Wall -Werror=format-security -Wp,-D_FORTIFY_SOURCE=2 -Wp,-D_GLIBCXX_ASSERTIONS -specs=/usr/lib/rpm/OpenCloudOS/OpenCloudOS-hardened-cc1 -fstack-protector-strong  -m64 -march=x86-64-v2 -mtune=generic -fasynchronous-unwind-tables -fstack-clash-protection -fcf-protection -std=gnu99 -fPIC -Wall -Wwrite-strings -Wmissing-prototypes -Iinclude -DCAPSTONE_USE_SYS_DYN_MEM -DCAPSTONE_HAS_ARM -DCAPSTONE_HAS_ARM64 -DCAPSTONE_HAS_M68K -DCAPSTONE_HAS_MIPS -DCAPSTONE_HAS_SH -DCAPSTONE_HAS_POWERPC -DCAPSTONE_HAS_SPARC -DCAPSTONE_HAS_SYSZ -DCAPSTONE_HAS_X86 -DCAPSTONE_HAS_XCORE -DCAPSTONE_HAS_TMS320C64X -DCAPSTONE_HAS_M680X -DCAPSTONE_HAS_EVM -DCAPSTONE_HAS_RISCV -DCAPSTONE_HAS_WASM -DCAPSTONE_HAS_MOS65XX -DCAPSTONE_HAS_BPF -DCAPSTONE_HAS_TRICORE  -fvisibility=hidden -Wall -I../include  -DCAPSTONE_HAS_ARM -DCAPSTONE_HAS_ARM64 -DCAPSTONE_HAS_M68K -DCAPSTONE_HAS_MIPS -DCAPSTONE_HAS_POWERPC -DCAPSTONE_HAS_SPARC -DCAPSTONE_HAS_SYSZ -DCAPSTONE_HAS_X86 -DCAPSTONE_HAS_XCORE -DCAPSTONE_HAS_TMS320C64X -DCAPSTONE_HAS_M680X -DCAPSTONE_HAS_EVM -DCAPSTONE_HAS_RISCV -DCAPSTONE_HAS_WASM -DCAPSTONE_HAS_MOS65XX -DCAPSTONE_HAS_BPF -DCAPSTONE_HAS_SH -c test_m680x.c -o test_m680x.o
make[1]: Leaving directory '/builddir/build/BUILD/capstone-5.0.1/tests'
make[1]: Entering directory '/builddir/build/BUILD/capstone-5.0.1/tests'
gcc -O2 -flto=auto -ffat-lto-objects -fexceptions -g -grecord-gcc-switches -pipe -Wall -Werror=format-security -Wp,-D_FORTIFY_SOURCE=2 -Wp,-D_GLIBCXX_ASSERTIONS -specs=/usr/lib/rpm/OpenCloudOS/OpenCloudOS-hardened-cc1 -fstack-protector-strong  -m64 -march=x86-64-v2 -mtune=generic -fasynchronous-unwind-tables -fstack-clash-protection -fcf-protection -std=gnu99 -fPIC -Wall -Wwrite-strings -Wmissing-prototypes -Iinclude -DCAPSTONE_USE_SYS_DYN_MEM -DCAPSTONE_HAS_ARM -DCAPSTONE_HAS_ARM64 -DCAPSTONE_HAS_M68K -DCAPSTONE_HAS_MIPS -DCAPSTONE_HAS_SH -DCAPSTONE_HAS_POWERPC -DCAPSTONE_HAS_SPARC -DCAPSTONE_HAS_SYSZ -DCAPSTONE_HAS_X86 -DCAPSTONE_HAS_XCORE -DCAPSTONE_HAS_TMS320C64X -DCAPSTONE_HAS_M680X -DCAPSTONE_HAS_EVM -DCAPSTONE_HAS_RISCV -DCAPSTONE_HAS_WASM -DCAPSTONE_HAS_MOS65XX -DCAPSTONE_HAS_BPF -DCAPSTONE_HAS_TRICORE  -fvisibility=hidden -Wall -I../include  -DCAPSTONE_HAS_ARM -DCAPSTONE_HAS_ARM64 -DCAPSTONE_HAS_M68K -DCAPSTONE_HAS_MIPS -DCAPSTONE_HAS_POWERPC -DCAPSTONE_HAS_SPARC -DCAPSTONE_HAS_SYSZ -DCAPSTONE_HAS_X86 -DCAPSTONE_HAS_XCORE -DCAPSTONE_HAS_TMS320C64X -DCAPSTONE_HAS_M680X -DCAPSTONE_HAS_EVM -DCAPSTONE_HAS_RISCV -DCAPSTONE_HAS_WASM -DCAPSTONE_HAS_MOS65XX -DCAPSTONE_HAS_BPF -DCAPSTONE_HAS_SH -c test_mos65xx.c -o test_mos65xx.o
make[1]: Leaving directory '/builddir/build/BUILD/capstone-5.0.1/tests'
make[1]: Entering directory '/builddir/build/BUILD/capstone-5.0.1/tests'
gcc -O2 -flto=auto -ffat-lto-objects -fexceptions -g -grecord-gcc-switches -pipe -Wall -Werror=format-security -Wp,-D_FORTIFY_SOURCE=2 -Wp,-D_GLIBCXX_ASSERTIONS -specs=/usr/lib/rpm/OpenCloudOS/OpenCloudOS-hardened-cc1 -fstack-protector-strong  -m64 -march=x86-64-v2 -mtune=generic -fasynchronous-unwind-tables -fstack-clash-protection -fcf-protection -std=gnu99 -fPIC -Wall -Wwrite-strings -Wmissing-prototypes -Iinclude -DCAPSTONE_USE_SYS_DYN_MEM -DCAPSTONE_HAS_ARM -DCAPSTONE_HAS_ARM64 -DCAPSTONE_HAS_M68K -DCAPSTONE_HAS_MIPS -DCAPSTONE_HAS_SH -DCAPSTONE_HAS_POWERPC -DCAPSTONE_HAS_SPARC -DCAPSTONE_HAS_SYSZ -DCAPSTONE_HAS_X86 -DCAPSTONE_HAS_XCORE -DCAPSTONE_HAS_TMS320C64X -DCAPSTONE_HAS_M680X -DCAPSTONE_HAS_EVM -DCAPSTONE_HAS_RISCV -DCAPSTONE_HAS_WASM -DCAPSTONE_HAS_MOS65XX -DCAPSTONE_HAS_BPF -DCAPSTONE_HAS_TRICORE  -fvisibility=hidden -Wall -I../include  -DCAPSTONE_HAS_ARM -DCAPSTONE_HAS_ARM64 -DCAPSTONE_HAS_M68K -DCAPSTONE_HAS_MIPS -DCAPSTONE_HAS_POWERPC -DCAPSTONE_HAS_SPARC -DCAPSTONE_HAS_SYSZ -DCAPSTONE_HAS_X86 -DCAPSTONE_HAS_XCORE -DCAPSTONE_HAS_TMS320C64X -DCAPSTONE_HAS_M680X -DCAPSTONE_HAS_EVM -DCAPSTONE_HAS_RISCV -DCAPSTONE_HAS_WASM -DCAPSTONE_HAS_MOS65XX -DCAPSTONE_HAS_BPF -DCAPSTONE_HAS_SH -c test_sh.c -o test_sh.o
make[1]: Leaving directory '/builddir/build/BUILD/capstone-5.0.1/tests'
test_sh.c:66:9: warning: initialization discards 'const' qualifier from pointer target type [-Wdiscarded-qualifiers]
   66 |         "Register indirect",
      |         ^~~~~~~~~~~~~~~~~~~
test_sh.c:67:9: warning: initialization discards 'const' qualifier from pointer target type [-Wdiscarded-qualifiers]
   67 |         "Register indirect with predecrement",
      |         ^~~~~~~~~~~~~~~~~~~~~~~~~~~~~~~~~~~~~
test_sh.c:68:9: warning: initialization discards 'const' qualifier from pointer target type [-Wdiscarded-qualifiers]
   68 |         "Register indirect with postincrement",
      |         ^~~~~~~~~~~~~~~~~~~~~~~~~~~~~~~~~~~~~~
test_sh.c: In function 'print_insn_detail':
test_sh.c:99:72: warning: format '%llu' expects argument of type 'long long unsigned int', but argument 3 has type 'uint64_t' {aka 'long unsigned int'} [-Wformat=]
   99 |                         printf("\t\toperands[%u].type: IMMEDIATE = #%llu\n", i,
      |                                                                     ~~~^
      |                                                                        |
      |                                                                        long long unsigned int
      |                                                                     %lu
  100 |                                op->imm);
      |                                ~~~~~~~                                  
      |                                  |
      |                                  uint64_t {aka long unsigned int}
make[1]: Entering directory '/builddir/build/BUILD/capstone-5.0.1/tests'
gcc -O2 -flto=auto -ffat-lto-objects -fexceptions -g -grecord-gcc-switches -pipe -Wall -Werror=format-security -Wp,-D_FORTIFY_SOURCE=2 -Wp,-D_GLIBCXX_ASSERTIONS -specs=/usr/lib/rpm/OpenCloudOS/OpenCloudOS-hardened-cc1 -fstack-protector-strong  -m64 -march=x86-64-v2 -mtune=generic -fasynchronous-unwind-tables -fstack-clash-protection -fcf-protection -std=gnu99 -fPIC -Wall -Wwrite-strings -Wmissing-prototypes -Iinclude -DCAPSTONE_USE_SYS_DYN_MEM -DCAPSTONE_HAS_ARM -DCAPSTONE_HAS_ARM64 -DCAPSTONE_HAS_M68K -DCAPSTONE_HAS_MIPS -DCAPSTONE_HAS_SH -DCAPSTONE_HAS_POWERPC -DCAPSTONE_HAS_SPARC -DCAPSTONE_HAS_SYSZ -DCAPSTONE_HAS_X86 -DCAPSTONE_HAS_XCORE -DCAPSTONE_HAS_TMS320C64X -DCAPSTONE_HAS_M680X -DCAPSTONE_HAS_EVM -DCAPSTONE_HAS_RISCV -DCAPSTONE_HAS_WASM -DCAPSTONE_HAS_MOS65XX -DCAPSTONE_HAS_BPF -DCAPSTONE_HAS_TRICORE  -fvisibility=hidden -Wall -I../include  -DCAPSTONE_HAS_ARM -DCAPSTONE_HAS_ARM64 -DCAPSTONE_HAS_M68K -DCAPSTONE_HAS_MIPS -DCAPSTONE_HAS_POWERPC -DCAPSTONE_HAS_SPARC -DCAPSTONE_HAS_SYSZ -DCAPSTONE_HAS_X86 -DCAPSTONE_HAS_XCORE -DCAPSTONE_HAS_TMS320C64X -DCAPSTONE_HAS_M680X -DCAPSTONE_HAS_EVM -DCAPSTONE_HAS_RISCV -DCAPSTONE_HAS_WASM -DCAPSTONE_HAS_MOS65XX -DCAPSTONE_HAS_BPF -DCAPSTONE_HAS_SH -c test_tricore.c -o test_tricore.o
make[1]: Leaving directory '/builddir/build/BUILD/capstone-5.0.1/tests'
test_tricore.c: In function 'test':
test_tricore.c:85:25: warning: initialization discards 'const' qualifier from pointer target type [-Wdiscarded-qualifiers]
   85 |                         "TriCore",
      |                         ^~~~~~~~~
test_tricore.c:112:42: warning: passing argument 1 of 'print_string_hex' discards 'const' qualifier from pointer target type [-Wdiscarded-qualifiers]
  112 |                         print_string_hex("Code:", platforms[i].code,
      |                                          ^~~~~~~
test_tricore.c:19:36: note: expected 'char *' but argument is of type 'const char *'
   19 | static void print_string_hex(char *comment, unsigned char *str, size_t len)
      |                              ~~~~~~^~~~~~~
test_tricore.c:130:42: warning: passing argument 1 of 'print_string_hex' discards 'const' qualifier from pointer target type [-Wdiscarded-qualifiers]
  130 |                         print_string_hex("Code:", platforms[i].code,
      |                                          ^~~~~~~
test_tricore.c:19:36: note: expected 'char *' but argument is of type 'const char *'
   19 | static void print_string_hex(char *comment, unsigned char *str, size_t len)
      |                              ~~~~~~^~~~~~~
make[1]: Entering directory '/builddir/build/BUILD/capstone-5.0.1/tests'
gcc -O2 -flto=auto -ffat-lto-objects -fexceptions -g -grecord-gcc-switches -pipe -Wall -Werror=format-security -Wp,-D_FORTIFY_SOURCE=2 -Wp,-D_GLIBCXX_ASSERTIONS -specs=/usr/lib/rpm/OpenCloudOS/OpenCloudOS-hardened-cc1 -fstack-protector-strong  -m64 -march=x86-64-v2 -mtune=generic -fasynchronous-unwind-tables -fstack-clash-protection -fcf-protection -std=gnu99 -fPIC -Wall -Wwrite-strings -Wmissing-prototypes -Iinclude -DCAPSTONE_USE_SYS_DYN_MEM -DCAPSTONE_HAS_ARM -DCAPSTONE_HAS_ARM64 -DCAPSTONE_HAS_M68K -DCAPSTONE_HAS_MIPS -DCAPSTONE_HAS_SH -DCAPSTONE_HAS_POWERPC -DCAPSTONE_HAS_SPARC -DCAPSTONE_HAS_SYSZ -DCAPSTONE_HAS_X86 -DCAPSTONE_HAS_XCORE -DCAPSTONE_HAS_TMS320C64X -DCAPSTONE_HAS_M680X -DCAPSTONE_HAS_EVM -DCAPSTONE_HAS_RISCV -DCAPSTONE_HAS_WASM -DCAPSTONE_HAS_MOS65XX -DCAPSTONE_HAS_BPF -DCAPSTONE_HAS_TRICORE  -fvisibility=hidden -Wall -I../include  -DCAPSTONE_HAS_ARM -DCAPSTONE_HAS_ARM64 -DCAPSTONE_HAS_M68K -DCAPSTONE_HAS_MIPS -DCAPSTONE_HAS_POWERPC -DCAPSTONE_HAS_SPARC -DCAPSTONE_HAS_SYSZ -DCAPSTONE_HAS_X86 -DCAPSTONE_HAS_XCORE -DCAPSTONE_HAS_TMS320C64X -DCAPSTONE_HAS_M680X -DCAPSTONE_HAS_EVM -DCAPSTONE_HAS_RISCV -DCAPSTONE_HAS_WASM -DCAPSTONE_HAS_MOS65XX -DCAPSTONE_HAS_BPF -DCAPSTONE_HAS_SH -c test_bpf.c -o test_bpf.o
make[1]: Leaving directory '/builddir/build/BUILD/capstone-5.0.1/tests'
make[1]: Entering directory '/builddir/build/BUILD/capstone-5.0.1/tests'
gcc -O2 -flto=auto -ffat-lto-objects -fexceptions -g -grecord-gcc-switches -pipe -Wall -Werror=format-security -Wp,-D_FORTIFY_SOURCE=2 -Wp,-D_GLIBCXX_ASSERTIONS -specs=/usr/lib/rpm/OpenCloudOS/OpenCloudOS-hardened-cc1 -fstack-protector-strong  -m64 -march=x86-64-v2 -mtune=generic -fasynchronous-unwind-tables -fstack-clash-protection -fcf-protection -std=gnu99 -fPIC -Wall -Wwrite-strings -Wmissing-prototypes -Iinclude -DCAPSTONE_USE_SYS_DYN_MEM -DCAPSTONE_HAS_ARM -DCAPSTONE_HAS_ARM64 -DCAPSTONE_HAS_M68K -DCAPSTONE_HAS_MIPS -DCAPSTONE_HAS_SH -DCAPSTONE_HAS_POWERPC -DCAPSTONE_HAS_SPARC -DCAPSTONE_HAS_SYSZ -DCAPSTONE_HAS_X86 -DCAPSTONE_HAS_XCORE -DCAPSTONE_HAS_TMS320C64X -DCAPSTONE_HAS_M680X -DCAPSTONE_HAS_EVM -DCAPSTONE_HAS_RISCV -DCAPSTONE_HAS_WASM -DCAPSTONE_HAS_MOS65XX -DCAPSTONE_HAS_BPF -DCAPSTONE_HAS_TRICORE  -fvisibility=hidden -Wall -I../include  -DCAPSTONE_HAS_ARM -DCAPSTONE_HAS_ARM64 -DCAPSTONE_HAS_M68K -DCAPSTONE_HAS_MIPS -DCAPSTONE_HAS_POWERPC -DCAPSTONE_HAS_SPARC -DCAPSTONE_HAS_SYSZ -DCAPSTONE_HAS_X86 -DCAPSTONE_HAS_XCORE -DCAPSTONE_HAS_TMS320C64X -DCAPSTONE_HAS_M680X -DCAPSTONE_HAS_EVM -DCAPSTONE_HAS_RISCV -DCAPSTONE_HAS_WASM -DCAPSTONE_HAS_MOS65XX -DCAPSTONE_HAS_BPF -DCAPSTONE_HAS_SH -c test_x86.c -o test_x86.o
make[1]: Leaving directory '/builddir/build/BUILD/capstone-5.0.1/tests'
make[1]: Entering directory '/builddir/build/BUILD/capstone-5.0.1/tests'
gcc -Wl,-z,relro -Wl,--as-needed  -Wl,-z,now -specs=/usr/lib/rpm/OpenCloudOS/OpenCloudOS-hardened-ld  -Wl,--build-id=sha1  -L..  test_customized_mnem.o -lcapstone -o test_customized_mnem
gcc -Wl,-z,relro -Wl,--as-needed  -Wl,-z,now -specs=/usr/lib/rpm/OpenCloudOS/OpenCloudOS-hardened-ld  -Wl,--build-id=sha1  -L..  test_customized_mnem.o ../libcapstone.a -o test_customized_mnem.static
make[1]: Leaving directory '/builddir/build/BUILD/capstone-5.0.1/tests'
make[1]: Entering directory '/builddir/build/BUILD/capstone-5.0.1/tests'
gcc -Wl,-z,relro -Wl,--as-needed  -Wl,-z,now -specs=/usr/lib/rpm/OpenCloudOS/OpenCloudOS-hardened-ld  -Wl,--build-id=sha1  -L..  test_skipdata.o -lcapstone -o test_skipdata
gcc -Wl,-z,relro -Wl,--as-needed  -Wl,-z,now -specs=/usr/lib/rpm/OpenCloudOS/OpenCloudOS-hardened-ld  -Wl,--build-id=sha1  -L..  test_skipdata.o ../libcapstone.a -o test_skipdata.static
make[1]: Leaving directory '/builddir/build/BUILD/capstone-5.0.1/tests'
make[1]: Entering directory '/builddir/build/BUILD/capstone-5.0.1/tests'
gcc -Wl,-z,relro -Wl,--as-needed  -Wl,-z,now -specs=/usr/lib/rpm/OpenCloudOS/OpenCloudOS-hardened-ld  -Wl,--build-id=sha1  -L..  test_m68k.o -lcapstone -o test_m68k
gcc -Wl,-z,relro -Wl,--as-needed  -Wl,-z,now -specs=/usr/lib/rpm/OpenCloudOS/OpenCloudOS-hardened-ld  -Wl,--build-id=sha1  -L..  test_m68k.o ../libcapstone.a -o test_m68k.static
make[1]: Leaving directory '/builddir/build/BUILD/capstone-5.0.1/tests'
make[1]: Entering directory '/builddir/build/BUILD/capstone-5.0.1/tests'
gcc -Wl,-z,relro -Wl,--as-needed  -Wl,-z,now -specs=/usr/lib/rpm/OpenCloudOS/OpenCloudOS-hardened-ld  -Wl,--build-id=sha1  -L..  test_wasm.o -lcapstone -o test_wasm
gcc -Wl,-z,relro -Wl,--as-needed  -Wl,-z,now -specs=/usr/lib/rpm/OpenCloudOS/OpenCloudOS-hardened-ld  -Wl,--build-id=sha1  -L..  test_wasm.o ../libcapstone.a -o test_wasm.static
make[1]: Leaving directory '/builddir/build/BUILD/capstone-5.0.1/tests'
make[1]: Entering directory '/builddir/build/BUILD/capstone-5.0.1/tests'
gcc -Wl,-z,relro -Wl,--as-needed  -Wl,-z,now -specs=/usr/lib/rpm/OpenCloudOS/OpenCloudOS-hardened-ld  -Wl,--build-id=sha1  -L..  test_iter.o -lcapstone -o test_iter
gcc -Wl,-z,relro -Wl,--as-needed  -Wl,-z,now -specs=/usr/lib/rpm/OpenCloudOS/OpenCloudOS-hardened-ld  -Wl,--build-id=sha1  -L..  test_iter.o ../libcapstone.a -o test_iter.static
make[1]: Leaving directory '/builddir/build/BUILD/capstone-5.0.1/tests'
make[1]: Entering directory '/builddir/build/BUILD/capstone-5.0.1/tests'
gcc -Wl,-z,relro -Wl,--as-needed  -Wl,-z,now -specs=/usr/lib/rpm/OpenCloudOS/OpenCloudOS-hardened-ld  -Wl,--build-id=sha1  -L..  test_evm.o -lcapstone -o test_evm
gcc -Wl,-z,relro -Wl,--as-needed  -Wl,-z,now -specs=/usr/lib/rpm/OpenCloudOS/OpenCloudOS-hardened-ld  -Wl,--build-id=sha1  -L..  test_evm.o ../libcapstone.a -o test_evm.static
make[1]: Leaving directory '/builddir/build/BUILD/capstone-5.0.1/tests'
make[1]: Entering directory '/builddir/build/BUILD/capstone-5.0.1/tests'
gcc -Wl,-z,relro -Wl,--as-needed  -Wl,-z,now -specs=/usr/lib/rpm/OpenCloudOS/OpenCloudOS-hardened-ld  -Wl,--build-id=sha1  -L..  test_x86.o -lcapstone -o test_x86
gcc -Wl,-z,relro -Wl,--as-needed  -Wl,-z,now -specs=/usr/lib/rpm/OpenCloudOS/OpenCloudOS-hardened-ld  -Wl,--build-id=sha1  -L..  test_x86.o ../libcapstone.a -o test_x86.static
make[1]: Leaving directory '/builddir/build/BUILD/capstone-5.0.1/tests'
make[1]: Entering directory '/builddir/build/BUILD/capstone-5.0.1/tests'
gcc -Wl,-z,relro -Wl,--as-needed  -Wl,-z,now -specs=/usr/lib/rpm/OpenCloudOS/OpenCloudOS-hardened-ld  -Wl,--build-id=sha1  -L..  test_bpf.o -lcapstone -o test_bpf
gcc -Wl,-z,relro -Wl,--as-needed  -Wl,-z,now -specs=/usr/lib/rpm/OpenCloudOS/OpenCloudOS-hardened-ld  -Wl,--build-id=sha1  -L..  test_bpf.o ../libcapstone.a -o test_bpf.static
make[1]: Leaving directory '/builddir/build/BUILD/capstone-5.0.1/tests'
make[1]: Entering directory '/builddir/build/BUILD/capstone-5.0.1/tests'
gcc -Wl,-z,relro -Wl,--as-needed  -Wl,-z,now -specs=/usr/lib/rpm/OpenCloudOS/OpenCloudOS-hardened-ld  -Wl,--build-id=sha1  -L..  test_m680x.o -lcapstone -o test_m680x
gcc -Wl,-z,relro -Wl,--as-needed  -Wl,-z,now -specs=/usr/lib/rpm/OpenCloudOS/OpenCloudOS-hardened-ld  -Wl,--build-id=sha1  -L..  test_m680x.o ../libcapstone.a -o test_m680x.static
make[1]: Leaving directory '/builddir/build/BUILD/capstone-5.0.1/tests'
make[1]: Entering directory '/builddir/build/BUILD/capstone-5.0.1/tests'
gcc -Wl,-z,relro -Wl,--as-needed  -Wl,-z,now -specs=/usr/lib/rpm/OpenCloudOS/OpenCloudOS-hardened-ld  -Wl,--build-id=sha1  -L..  test_mips.o -lcapstone -o test_mips
gcc -Wl,-z,relro -Wl,--as-needed  -Wl,-z,now -specs=/usr/lib/rpm/OpenCloudOS/OpenCloudOS-hardened-ld  -Wl,--build-id=sha1  -L..  test_mips.o ../libcapstone.a -o test_mips.static
make[1]: Leaving directory '/builddir/build/BUILD/capstone-5.0.1/tests'
make[1]: Entering directory '/builddir/build/BUILD/capstone-5.0.1/tests'
gcc -Wl,-z,relro -Wl,--as-needed  -Wl,-z,now -specs=/usr/lib/rpm/OpenCloudOS/OpenCloudOS-hardened-ld  -Wl,--build-id=sha1  -L..  test_riscv.o -lcapstone -o test_riscv
gcc -Wl,-z,relro -Wl,--as-needed  -Wl,-z,now -specs=/usr/lib/rpm/OpenCloudOS/OpenCloudOS-hardened-ld  -Wl,--build-id=sha1  -L..  test_riscv.o ../libcapstone.a -o test_riscv.static
make[1]: Leaving directory '/builddir/build/BUILD/capstone-5.0.1/tests'
make[1]: Entering directory '/builddir/build/BUILD/capstone-5.0.1/tests'
gcc -Wl,-z,relro -Wl,--as-needed  -Wl,-z,now -specs=/usr/lib/rpm/OpenCloudOS/OpenCloudOS-hardened-ld  -Wl,--build-id=sha1  -L..  test_detail.o -lcapstone -o test_detail
gcc -Wl,-z,relro -Wl,--as-needed  -Wl,-z,now -specs=/usr/lib/rpm/OpenCloudOS/OpenCloudOS-hardened-ld  -Wl,--build-id=sha1  -L..  test_detail.o ../libcapstone.a -o test_detail.static
make[1]: Leaving directory '/builddir/build/BUILD/capstone-5.0.1/tests'
make[1]: Entering directory '/builddir/build/BUILD/capstone-5.0.1/tests'
gcc -Wl,-z,relro -Wl,--as-needed  -Wl,-z,now -specs=/usr/lib/rpm/OpenCloudOS/OpenCloudOS-hardened-ld  -Wl,--build-id=sha1  -L..  test_systemz.o -lcapstone -o test_systemz
gcc -Wl,-z,relro -Wl,--as-needed  -Wl,-z,now -specs=/usr/lib/rpm/OpenCloudOS/OpenCloudOS-hardened-ld  -Wl,--build-id=sha1  -L..  test_systemz.o ../libcapstone.a -o test_systemz.static
make[1]: Leaving directory '/builddir/build/BUILD/capstone-5.0.1/tests'
make[1]: Entering directory '/builddir/build/BUILD/capstone-5.0.1/tests'
gcc -Wl,-z,relro -Wl,--as-needed  -Wl,-z,now -specs=/usr/lib/rpm/OpenCloudOS/OpenCloudOS-hardened-ld  -Wl,--build-id=sha1  -L..  test_tricore.o -lcapstone -o test_tricore
gcc -Wl,-z,relro -Wl,--as-needed  -Wl,-z,now -specs=/usr/lib/rpm/OpenCloudOS/OpenCloudOS-hardened-ld  -Wl,--build-id=sha1  -L..  test_tricore.o ../libcapstone.a -o test_tricore.static
make[1]: Leaving directory '/builddir/build/BUILD/capstone-5.0.1/tests'
make[1]: Entering directory '/builddir/build/BUILD/capstone-5.0.1/tests'
gcc -Wl,-z,relro -Wl,--as-needed  -Wl,-z,now -specs=/usr/lib/rpm/OpenCloudOS/OpenCloudOS-hardened-ld  -Wl,--build-id=sha1  -L..  test_arm.o -lcapstone -o test_arm
gcc -Wl,-z,relro -Wl,--as-needed  -Wl,-z,now -specs=/usr/lib/rpm/OpenCloudOS/OpenCloudOS-hardened-ld  -Wl,--build-id=sha1  -L..  test_arm.o ../libcapstone.a -o test_arm.static
make[1]: Leaving directory '/builddir/build/BUILD/capstone-5.0.1/tests'
make[1]: Entering directory '/builddir/build/BUILD/capstone-5.0.1/tests'
gcc -Wl,-z,relro -Wl,--as-needed  -Wl,-z,now -specs=/usr/lib/rpm/OpenCloudOS/OpenCloudOS-hardened-ld  -Wl,--build-id=sha1  -L..  test_xcore.o -lcapstone -o test_xcore
gcc -Wl,-z,relro -Wl,--as-needed  -Wl,-z,now -specs=/usr/lib/rpm/OpenCloudOS/OpenCloudOS-hardened-ld  -Wl,--build-id=sha1  -L..  test_xcore.o ../libcapstone.a -o test_xcore.static
make[1]: Leaving directory '/builddir/build/BUILD/capstone-5.0.1/tests'
make[1]: Entering directory '/builddir/build/BUILD/capstone-5.0.1/tests'
gcc -Wl,-z,relro -Wl,--as-needed  -Wl,-z,now -specs=/usr/lib/rpm/OpenCloudOS/OpenCloudOS-hardened-ld  -Wl,--build-id=sha1  -L..  test_ppc.o -lcapstone -o test_ppc
gcc -Wl,-z,relro -Wl,--as-needed  -Wl,-z,now -specs=/usr/lib/rpm/OpenCloudOS/OpenCloudOS-hardened-ld  -Wl,--build-id=sha1  -L..  test_ppc.o ../libcapstone.a -o test_ppc.static
make[1]: Leaving directory '/builddir/build/BUILD/capstone-5.0.1/tests'
make[1]: Entering directory '/builddir/build/BUILD/capstone-5.0.1/tests'
gcc -Wl,-z,relro -Wl,--as-needed  -Wl,-z,now -specs=/usr/lib/rpm/OpenCloudOS/OpenCloudOS-hardened-ld  -Wl,--build-id=sha1  -L..  test_sparc.o -lcapstone -o test_sparc
gcc -Wl,-z,relro -Wl,--as-needed  -Wl,-z,now -specs=/usr/lib/rpm/OpenCloudOS/OpenCloudOS-hardened-ld  -Wl,--build-id=sha1  -L..  test_sparc.o ../libcapstone.a -o test_sparc.static
make[1]: Leaving directory '/builddir/build/BUILD/capstone-5.0.1/tests'
make[1]: Entering directory '/builddir/build/BUILD/capstone-5.0.1/tests'
gcc -Wl,-z,relro -Wl,--as-needed  -Wl,-z,now -specs=/usr/lib/rpm/OpenCloudOS/OpenCloudOS-hardened-ld  -Wl,--build-id=sha1  -L..  test_sh.o -lcapstone -o test_sh
gcc -Wl,-z,relro -Wl,--as-needed  -Wl,-z,now -specs=/usr/lib/rpm/OpenCloudOS/OpenCloudOS-hardened-ld  -Wl,--build-id=sha1  -L..  test_sh.o ../libcapstone.a -o test_sh.static
make[1]: Leaving directory '/builddir/build/BUILD/capstone-5.0.1/tests'
make[1]: Entering directory '/builddir/build/BUILD/capstone-5.0.1/tests'
gcc -Wl,-z,relro -Wl,--as-needed  -Wl,-z,now -specs=/usr/lib/rpm/OpenCloudOS/OpenCloudOS-hardened-ld  -Wl,--build-id=sha1  -L..  test_basic.o -lcapstone -o test_basic
gcc -Wl,-z,relro -Wl,--as-needed  -Wl,-z,now -specs=/usr/lib/rpm/OpenCloudOS/OpenCloudOS-hardened-ld  -Wl,--build-id=sha1  -L..  test_basic.o ../libcapstone.a -o test_basic.static
make[1]: Leaving directory '/builddir/build/BUILD/capstone-5.0.1/tests'
make[1]: Entering directory '/builddir/build/BUILD/capstone-5.0.1/tests'
gcc -Wl,-z,relro -Wl,--as-needed  -Wl,-z,now -specs=/usr/lib/rpm/OpenCloudOS/OpenCloudOS-hardened-ld  -Wl,--build-id=sha1  -L..  test_mos65xx.o -lcapstone -o test_mos65xx
gcc -Wl,-z,relro -Wl,--as-needed  -Wl,-z,now -specs=/usr/lib/rpm/OpenCloudOS/OpenCloudOS-hardened-ld  -Wl,--build-id=sha1  -L..  test_mos65xx.o ../libcapstone.a -o test_mos65xx.static
make[1]: Leaving directory '/builddir/build/BUILD/capstone-5.0.1/tests'
make[1]: Entering directory '/builddir/build/BUILD/capstone-5.0.1/tests'
gcc -Wl,-z,relro -Wl,--as-needed  -Wl,-z,now -specs=/usr/lib/rpm/OpenCloudOS/OpenCloudOS-hardened-ld  -Wl,--build-id=sha1  -L..  test_tms320c64x.o -lcapstone -o test_tms320c64x
gcc -Wl,-z,relro -Wl,--as-needed  -Wl,-z,now -specs=/usr/lib/rpm/OpenCloudOS/OpenCloudOS-hardened-ld  -Wl,--build-id=sha1  -L..  test_tms320c64x.o ../libcapstone.a -o test_tms320c64x.static
make[1]: Leaving directory '/builddir/build/BUILD/capstone-5.0.1/tests'
make[1]: Entering directory '/builddir/build/BUILD/capstone-5.0.1/tests'
gcc -Wl,-z,relro -Wl,--as-needed  -Wl,-z,now -specs=/usr/lib/rpm/OpenCloudOS/OpenCloudOS-hardened-ld  -Wl,--build-id=sha1  -L..  test_arm64.o -lcapstone -o test_arm64
gcc -Wl,-z,relro -Wl,--as-needed  -Wl,-z,now -specs=/usr/lib/rpm/OpenCloudOS/OpenCloudOS-hardened-ld  -Wl,--build-id=sha1  -L..  test_arm64.o ../libcapstone.a -o test_arm64.static
make[1]: Leaving directory '/builddir/build/BUILD/capstone-5.0.1/tests'
install -m0755 ./libcapstone.so.5 ./tests/
cd ./tests/ && rm -f libcapstone.so && ln -s libcapstone.so.5 libcapstone.so
+ sed -i 's;/builddir/build/BUILDROOT/capstone-5.0.1-3.ocs23.x86_64;;' capstone.pc
+ grep -v archive capstone.pc
+ mv capstone.pc.tmp capstone.pc
+ pushd bindings/python
~/build/BUILD/capstone-5.0.1/bindings/python ~/build/BUILD/capstone-5.0.1
+ CFLAGS='-O2 -flto=auto -ffat-lto-objects -fexceptions -g -grecord-gcc-switches -pipe -Wall -Werror=format-security -Wp,-D_FORTIFY_SOURCE=2 -Wp,-D_GLIBCXX_ASSERTIONS -specs=/usr/lib/rpm/OpenCloudOS/OpenCloudOS-hardened-cc1 -fstack-protector-strong  -m64 -march=x86-64-v2 -mtune=generic -fasynchronous-unwind-tables -fstack-clash-protection -fcf-protection'
+ LDFLAGS='-Wl,-z,relro -Wl,--as-needed  -Wl,-z,now -specs=/usr/lib/rpm/OpenCloudOS/OpenCloudOS-hardened-ld  -Wl,--build-id=sha1'
+ /usr/bin/python3 setup.py build '--executable=/usr/bin/python3 -s'
running build
Building C extensions
make: Nothing to be done for 'all'.
running build_py
creating build
creating build/lib
creating build/lib/capstone
copying capstone/evm_const.py -> build/lib/capstone
copying capstone/riscv.py -> build/lib/capstone
copying capstone/evm.py -> build/lib/capstone
copying capstone/tms320c64x.py -> build/lib/capstone
copying capstone/ppc_const.py -> build/lib/capstone
copying capstone/xcore.py -> build/lib/capstone
copying capstone/arm.py -> build/lib/capstone
copying capstone/tms320c64x_const.py -> build/lib/capstone
copying capstone/m68k_const.py -> build/lib/capstone
copying capstone/arm64_const.py -> build/lib/capstone
copying capstone/sysz_const.py -> build/lib/capstone
copying capstone/arm64.py -> build/lib/capstone
copying capstone/sh.py -> build/lib/capstone
copying capstone/wasm_const.py -> build/lib/capstone
copying capstone/mips.py -> build/lib/capstone
copying capstone/xcore_const.py -> build/lib/capstone
copying capstone/__init__.py -> build/lib/capstone
copying capstone/systemz.py -> build/lib/capstone
copying capstone/x86.py -> build/lib/capstone
copying capstone/riscv_const.py -> build/lib/capstone
copying capstone/sparc.py -> build/lib/capstone
copying capstone/bpf_const.py -> build/lib/capstone
copying capstone/m680x_const.py -> build/lib/capstone
copying capstone/x86_const.py -> build/lib/capstone
copying capstone/mos65xx_const.py -> build/lib/capstone
copying capstone/m680x.py -> build/lib/capstone
copying capstone/sh_const.py -> build/lib/capstone
copying capstone/mips_const.py -> build/lib/capstone
copying capstone/m68k.py -> build/lib/capstone
copying capstone/bpf.py -> build/lib/capstone
copying capstone/wasm.py -> build/lib/capstone
copying capstone/tricore.py -> build/lib/capstone
copying capstone/tricore_const.py -> build/lib/capstone
copying capstone/ppc.py -> build/lib/capstone
copying capstone/mos65xx.py -> build/lib/capstone
copying capstone/arm_const.py -> build/lib/capstone
copying capstone/sparc_const.py -> build/lib/capstone
running egg_info
creating capstone.egg-info
writing capstone.egg-info/PKG-INFO
writing dependency_links to capstone.egg-info/dependency_links.txt
writing top-level names to capstone.egg-info/top_level.txt
writing manifest file 'capstone.egg-info/SOURCES.txt'
reading manifest file 'capstone.egg-info/SOURCES.txt'
reading manifest template 'MANIFEST.in'
warning: no files found matching '*' under directory 'src'
adding license file 'LICENSE.TXT'
writing manifest file 'capstone.egg-info/SOURCES.txt'
/usr/lib/python3.11/site-packages/setuptools/command/build_py.py:201: _Warning: Package 'capstone.include.capstone' is absent from the `packages` configuration.
!!
        ********************************************************************************
        ############################
        # Package would be ignored #
        ############################
        Python recognizes 'capstone.include.capstone' as an importable package[^1],
        but it is absent from setuptools' `packages` configuration.
        This leads to an ambiguous overall configuration. If you want to distribute this
        package, please make sure that 'capstone.include.capstone' is explicitly added
        to the `packages` configuration field.
        Alternatively, you can also rely on setuptools' discovery methods
        (for example by using `find_namespace_packages(...)`/`find_namespace:`
        instead of `find_packages(...)`/`find:`).
        You can read more about "package discovery" on setuptools documentation page:
        - https://setuptools.pypa.io/en/latest/userguide/package_discovery.html
        If you don't want 'capstone.include.capstone' to be distributed and are
        already explicitly excluding 'capstone.include.capstone' via
        `find_namespace_packages(...)/find_namespace` or `find_packages(...)/find`,
        you can try to use `exclude_package_data`, or `include-package-data=False` in
        combination with a more fine grained `package-data` configuration.
        You can read more about "package data files" on setuptools documentation page:
        - https://setuptools.pypa.io/en/latest/userguide/datafiles.html
        [^1]: For Python, any directory (with suitable naming) can be imported,
              even if it does not contain any `.py` files.
              On the other hand, currently there is no concept of package data
              directory, all directories are treated like packages.
        ********************************************************************************
!!
  check.warn(importable)
creating build/lib/capstone/include
/usr/lib/python3.11/site-packages/setuptools/command/build_py.py:201: _Warning: Package 'capstone.lib' is absent from the `packages` configuration.
!!
        ********************************************************************************
        ############################
        # Package would be ignored #
        ############################
        Python recognizes 'capstone.lib' as an importable package[^1],
        but it is absent from setuptools' `packages` configuration.
        This leads to an ambiguous overall configuration. If you want to distribute this
        package, please make sure that 'capstone.lib' is explicitly added
        to the `packages` configuration field.
        Alternatively, you can also rely on setuptools' discovery methods
        (for example by using `find_namespace_packages(...)`/`find_namespace:`
        instead of `find_packages(...)`/`find:`).
        You can read more about "package discovery" on setuptools documentation page:
        - https://setuptools.pypa.io/en/latest/userguide/package_discovery.html
        If you don't want 'capstone.lib' to be distributed and are
        already explicitly excluding 'capstone.lib' via
        `find_namespace_packages(...)/find_namespace` or `find_packages(...)/find`,
        you can try to use `exclude_package_data`, or `include-package-data=False` in
        combination with a more fine grained `package-data` configuration.
        You can read more about "package data files" on setuptools documentation page:
        - https://setuptools.pypa.io/en/latest/userguide/datafiles.html
        [^1]: For Python, any directory (with suitable naming) can be imported,
              even if it does not contain any `.py` files.
              On the other hand, currently there is no concept of package data
              directory, all directories are treated like packages.
        ********************************************************************************
!!
  check.warn(importable)
creating build/lib/capstone/include/capstone
copying capstone/include/capstone/arm.h -> build/lib/capstone/include/capstone
copying capstone/include/capstone/arm64.h -> build/lib/capstone/include/capstone
copying capstone/include/capstone/bpf.h -> build/lib/capstone/include/capstone
copying capstone/include/capstone/capstone.h -> build/lib/capstone/include/capstone
copying capstone/include/capstone/evm.h -> build/lib/capstone/include/capstone
copying capstone/include/capstone/m680x.h -> build/lib/capstone/include/capstone
copying capstone/include/capstone/m68k.h -> build/lib/capstone/include/capstone
copying capstone/include/capstone/mips.h -> build/lib/capstone/include/capstone
copying capstone/include/capstone/mos65xx.h -> build/lib/capstone/include/capstone
copying capstone/include/capstone/platform.h -> build/lib/capstone/include/capstone
copying capstone/include/capstone/ppc.h -> build/lib/capstone/include/capstone
copying capstone/include/capstone/riscv.h -> build/lib/capstone/include/capstone
copying capstone/include/capstone/sh.h -> build/lib/capstone/include/capstone
copying capstone/include/capstone/sparc.h -> build/lib/capstone/include/capstone
copying capstone/include/capstone/systemz.h -> build/lib/capstone/include/capstone
copying capstone/include/capstone/tms320c64x.h -> build/lib/capstone/include/capstone
copying capstone/include/capstone/tricore.h -> build/lib/capstone/include/capstone
copying capstone/include/capstone/wasm.h -> build/lib/capstone/include/capstone
copying capstone/include/capstone/x86.h -> build/lib/capstone/include/capstone
copying capstone/include/capstone/xcore.h -> build/lib/capstone/include/capstone
creating build/lib/capstone/lib
copying capstone/lib/libcapstone.a -> build/lib/capstone/lib
copying capstone/lib/libcapstone.so -> build/lib/capstone/lib
+ popd
~/build/BUILD/capstone-5.0.1
~/build/BUILD/capstone-5.0.1/bindings/java ~/build/BUILD/capstone-5.0.1
+ pushd bindings/java
+ /usr/bin/make -O -j32 V=1 VERBOSE=1 PYTHON2=/usr/bin/python3 PYTHON3=/usr/bin/python3
cd ../ && /usr/bin/python3 const_generator.py java
Generating bindings for java
Generating bindings for java
Warning: No binding found for mos65xx.h
Warning: No binding found for bpf.h
Warning: No binding found for riscv.h
Warning: No binding found for sh.h
Warning: No binding found for tricore.h
cd capstone && javac -classpath /usr/share/java/jna.jar Capstone.java Arm_const.java Arm64_const.java Mips_const.java X86_const.java Xcore_const.java Ppc_const.java Sparc_const.java Sysz_const.java M680x_const.java Arm.java Arm64.java Mips.java X86.java Xcore.java Ppc.java Sparc.java Systemz.java M680x.java
Note: Capstone.java uses or overrides a deprecated API.
Note: Recompile with -Xlint:deprecation for details.
Note: Some input files use unchecked or unsafe operations.
Note: Recompile with -Xlint:unchecked for details.
cd . && jar cf ./capstone.jar capstone/*.class
javac -d . -classpath "/usr/share/java/jna.jar:./capstone.jar" TestBasic.java\
	TestArm.java TestArm64.java TestMips.java TestX86.java TestXcore.java\
	TestPpc.java TestSparc.java TestSystemz.java TestM680x.java
TestBasic.java:4: error: package capstone does not exist
import capstone.Capstone;
               ^
TestArm.java:4: error: package capstone does not exist
import capstone.Capstone;
               ^
TestArm.java:5: error: package capstone does not exist
import capstone.Arm;
               ^
TestArm.java:7: error: package capstone does not exist
import static capstone.Arm_const.*;
                      ^
TestArm.java:27: error: cannot find symbol
  public static Capstone cs;
                ^
  symbol:   class Capstone
  location: class TestArm
TestArm.java:37: error: package Capstone does not exist
  public static void print_ins_detail(Capstone.CsInsn ins) {
                                              ^
TestArm64.java:4: error: package capstone does not exist
import capstone.Capstone;
               ^
TestArm64.java:5: error: package capstone does not exist
import capstone.Arm64;
               ^
TestArm64.java:7: error: package capstone does not exist
import static capstone.Arm64_const.*;
                      ^
TestArm64.java:24: error: cannot find symbol
  public static Capstone cs;
                ^
  symbol:   class Capstone
  location: class TestArm64
TestArm64.java:34: error: package Capstone does not exist
  public static void print_ins_detail(Capstone.CsInsn ins) {
                                              ^
TestMips.java:4: error: package capstone does not exist
import capstone.Capstone;
               ^
TestMips.java:5: error: package capstone does not exist
import capstone.Mips;
               ^
TestMips.java:7: error: package capstone does not exist
import static capstone.Mips_const.*;
                      ^
TestMips.java:25: error: cannot find symbol
  public static Capstone cs;
                ^
  symbol:   class Capstone
  location: class TestMips
TestMips.java:35: error: package Capstone does not exist
  public static void print_ins_detail(Capstone.CsInsn ins) {
                                              ^
TestX86.java:4: error: package capstone does not exist
import capstone.Capstone;
               ^
TestX86.java:5: error: package capstone does not exist
import static capstone.Capstone.CS_AC_READ;
                      ^
TestX86.java:5: error: static import only from classes and interfaces
import static capstone.Capstone.CS_AC_READ;
^
TestX86.java:6: error: package capstone does not exist
import static capstone.Capstone.CS_AC_WRITE;
                      ^
TestX86.java:6: error: static import only from classes and interfaces
import static capstone.Capstone.CS_AC_WRITE;
^
TestX86.java:7: error: package capstone.Capstone does not exist
import capstone.Capstone.CsRegsAccess;
                        ^
TestX86.java:8: error: package capstone does not exist
import capstone.X86;
               ^
TestX86.java:10: error: package capstone does not exist
import static capstone.X86_const.*;
                      ^
TestX86.java:29: error: cannot find symbol
  public static Capstone cs;
                ^
  symbol:   class Capstone
  location: class TestX86
TestX86.java:46: error: package Capstone does not exist
  public static void print_ins_detail(Capstone.CsInsn ins) {
                                              ^
TestXcore.java:4: error: package capstone does not exist
import capstone.Capstone;
               ^
TestXcore.java:5: error: package capstone does not exist
import capstone.Xcore;
               ^
TestXcore.java:7: error: package capstone does not exist
import static capstone.Xcore_const.*;
                      ^
TestXcore.java:23: error: cannot find symbol
  public static Capstone cs;
                ^
  symbol:   class Capstone
  location: class TestXcore
TestXcore.java:33: error: package Capstone does not exist
  public static void print_ins_detail(Capstone.CsInsn ins) {
                                              ^
TestPpc.java:4: error: package capstone does not exist
import capstone.Capstone;
               ^
TestPpc.java:5: error: package capstone does not exist
import capstone.Ppc;
               ^
TestPpc.java:7: error: package capstone does not exist
import static capstone.Ppc_const.*;
                      ^
TestPpc.java:24: error: cannot find symbol
  public static Capstone cs;
                ^
  symbol:   class Capstone
  location: class TestPpc
TestPpc.java:34: error: package Capstone does not exist
  public static void print_ins_detail(Capstone.CsInsn ins) {
                                              ^
TestSparc.java:4: error: package capstone does not exist
import capstone.Capstone;
               ^
TestSparc.java:5: error: package capstone does not exist
import capstone.Sparc;
               ^
TestSparc.java:7: error: package capstone does not exist
import static capstone.Sparc_const.*;
                      ^
TestSparc.java:25: error: cannot find symbol
  public static Capstone cs;
                ^
  symbol:   class Capstone
  location: class TestSparc
TestSparc.java:35: error: package Capstone does not exist
  public static void print_ins_detail(Capstone.CsInsn ins) {
                                              ^
TestSystemz.java:4: error: package capstone does not exist
import capstone.Capstone;
               ^
TestSystemz.java:5: error: package capstone does not exist
import capstone.Systemz;
               ^
TestSystemz.java:7: error: package capstone does not exist
import static capstone.Sysz_const.*;
                      ^
TestSystemz.java:24: error: cannot find symbol
  public static Capstone cs;
                ^
  symbol:   class Capstone
  location: class TestSystemz
TestSystemz.java:34: error: package Capstone does not exist
  public static void print_ins_detail(Capstone.CsInsn ins) {
                                              ^
TestM680x.java:5: error: package capstone does not exist
import capstone.Capstone;
               ^
TestM680x.java:6: error: package capstone does not exist
import capstone.M680x;
               ^
TestM680x.java:8: error: package capstone does not exist
import static capstone.M680x_const.*;
                      ^
TestM680x.java:54: error: cannot find symbol
  public static Capstone cs;
                ^
  symbol:   class Capstone
  location: class TestM680x
TestM680x.java:64: error: package Capstone does not exist
  public static void print_ins_detail(Capstone.CsInsn ins) {
                                              ^
TestBasic.java:50: error: cannot find symbol
          Capstone.CS_ARCH_X86,
          ^
  symbol:   variable Capstone
  location: class TestBasic
TestBasic.java:51: error: cannot find symbol
          Capstone.CS_MODE_16,
          ^
  symbol:   variable Capstone
  location: class TestBasic
TestBasic.java:52: error: cannot find symbol
          Capstone.CS_OPT_SYNTAX_INTEL,
          ^
  symbol:   variable Capstone
  location: class TestBasic
TestBasic.java:57: error: cannot find symbol
          Capstone.CS_ARCH_X86,
          ^
  symbol:   variable Capstone
  location: class TestBasic
TestBasic.java:58: error: cannot find symbol
          Capstone.CS_MODE_32,
          ^
  symbol:   variable Capstone
  location: class TestBasic
TestBasic.java:59: error: cannot find symbol
          Capstone.CS_OPT_SYNTAX_ATT,
          ^
  symbol:   variable Capstone
  location: class TestBasic
TestBasic.java:64: error: cannot find symbol
          Capstone.CS_ARCH_X86,
          ^
  symbol:   variable Capstone
  location: class TestBasic
TestBasic.java:65: error: cannot find symbol
          Capstone.CS_MODE_32,
          ^
  symbol:   variable Capstone
  location: class TestBasic
TestBasic.java:70: error: cannot find symbol
          Capstone.CS_ARCH_X86,
          ^
  symbol:   variable Capstone
  location: class TestBasic
TestBasic.java:71: error: cannot find symbol
          Capstone.CS_MODE_64,
          ^
  symbol:   variable Capstone
  location: class TestBasic
TestBasic.java:76: error: cannot find symbol
          Capstone.CS_ARCH_ARM,
          ^
  symbol:   variable Capstone
  location: class TestBasic
TestBasic.java:77: error: cannot find symbol
          Capstone.CS_MODE_ARM,
          ^
  symbol:   variable Capstone
  location: class TestBasic
TestBasic.java:82: error: cannot find symbol
          Capstone.CS_ARCH_ARM,
          ^
  symbol:   variable Capstone
  location: class TestBasic
TestBasic.java:83: error: cannot find symbol
          Capstone.CS_MODE_THUMB,
          ^
  symbol:   variable Capstone
  location: class TestBasic
TestBasic.java:88: error: cannot find symbol
          Capstone.CS_ARCH_ARM,
          ^
  symbol:   variable Capstone
  location: class TestBasic
TestBasic.java:89: error: cannot find symbol
          Capstone.CS_MODE_ARM,
          ^
  symbol:   variable Capstone
  location: class TestBasic
TestBasic.java:94: error: cannot find symbol
          Capstone.CS_ARCH_ARM,
          ^
  symbol:   variable Capstone
  location: class TestBasic
TestBasic.java:95: error: cannot find symbol
          Capstone.CS_MODE_THUMB,
          ^
  symbol:   variable Capstone
  location: class TestBasic
TestBasic.java:100: error: cannot find symbol
          Capstone.CS_ARCH_MIPS,
          ^
  symbol:   variable Capstone
  location: class TestBasic
TestBasic.java:101: error: cannot find symbol
          Capstone.CS_MODE_MIPS32 + Capstone.CS_MODE_BIG_ENDIAN,
          ^
  symbol:   variable Capstone
  location: class TestBasic
TestBasic.java:101: error: cannot find symbol
          Capstone.CS_MODE_MIPS32 + Capstone.CS_MODE_BIG_ENDIAN,
                                    ^
  symbol:   variable Capstone
  location: class TestBasic
TestBasic.java:106: error: cannot find symbol
          Capstone.CS_ARCH_MIPS,
          ^
  symbol:   variable Capstone
  location: class TestBasic
TestBasic.java:107: error: cannot find symbol
          Capstone.CS_MODE_MIPS64+ Capstone.CS_MODE_LITTLE_ENDIAN,
          ^
  symbol:   variable Capstone
  location: class TestBasic
TestBasic.java:107: error: cannot find symbol
          Capstone.CS_MODE_MIPS64+ Capstone.CS_MODE_LITTLE_ENDIAN,
                                   ^
  symbol:   variable Capstone
  location: class TestBasic
TestBasic.java:112: error: cannot find symbol
          Capstone.CS_ARCH_ARM64,
          ^
  symbol:   variable Capstone
  location: class TestBasic
TestBasic.java:113: error: cannot find symbol
          Capstone.CS_MODE_ARM,
          ^
  symbol:   variable Capstone
  location: class TestBasic
TestBasic.java:118: error: cannot find symbol
          Capstone.CS_ARCH_PPC,
          ^
  symbol:   variable Capstone
  location: class TestBasic
TestBasic.java:119: error: cannot find symbol
          Capstone.CS_MODE_BIG_ENDIAN,
          ^
  symbol:   variable Capstone
  location: class TestBasic
TestBasic.java:124: error: cannot find symbol
          Capstone.CS_ARCH_PPC,
          ^
  symbol:   variable Capstone
  location: class TestBasic
TestBasic.java:125: error: cannot find symbol
          Capstone.CS_MODE_BIG_ENDIAN,
          ^
  symbol:   variable Capstone
  location: class TestBasic
TestBasic.java:126: error: cannot find symbol
          Capstone.CS_OPT_SYNTAX_NOREGNAME,
          ^
  symbol:   variable Capstone
  location: class TestBasic
TestBasic.java:131: error: cannot find symbol
          Capstone.CS_ARCH_SPARC,
          ^
  symbol:   variable Capstone
  location: class TestBasic
TestBasic.java:132: error: cannot find symbol
          Capstone.CS_MODE_BIG_ENDIAN,
          ^
  symbol:   variable Capstone
  location: class TestBasic
TestBasic.java:137: error: cannot find symbol
          Capstone.CS_ARCH_SPARC,
          ^
  symbol:   variable Capstone
  location: class TestBasic
TestBasic.java:138: error: cannot find symbol
          Capstone.CS_MODE_BIG_ENDIAN + Capstone.CS_MODE_V9,
          ^
  symbol:   variable Capstone
  location: class TestBasic
TestBasic.java:138: error: cannot find symbol
          Capstone.CS_MODE_BIG_ENDIAN + Capstone.CS_MODE_V9,
                                        ^
  symbol:   variable Capstone
  location: class TestBasic
TestBasic.java:143: error: cannot find symbol
          Capstone.CS_ARCH_SYSZ,
          ^
  symbol:   variable Capstone
  location: class TestBasic
TestBasic.java:149: error: cannot find symbol
          Capstone.CS_ARCH_XCORE,
          ^
  symbol:   variable Capstone
  location: class TestBasic
TestBasic.java:162: error: cannot find symbol
      Capstone cs = new Capstone(platforms[j].arch, platforms[j].mode);
      ^
  symbol:   class Capstone
  location: class TestBasic
TestBasic.java:162: error: cannot find symbol
      Capstone cs = new Capstone(platforms[j].arch, platforms[j].mode);
                        ^
  symbol:   class Capstone
  location: class TestBasic
TestBasic.java:166: error: package Capstone does not exist
      Capstone.CsInsn[] all_insn = cs.disasm(platforms[j].code, 0x1000);
              ^
TestArm.java:40: error: package Arm does not exist
    Arm.OpInfo operands = (Arm.OpInfo) ins.operands;
       ^
TestArm.java:40: error: package Arm does not exist
    Arm.OpInfo operands = (Arm.OpInfo) ins.operands;
                              ^
TestArm.java:45: error: package Arm does not exist
        Arm.Operand i = (Arm.Operand) operands.op[c];
           ^
TestArm.java:45: error: package Arm does not exist
        Arm.Operand i = (Arm.Operand) operands.op[c];
                            ^
TestArm.java:47: error: cannot find symbol
        if (i.type == ARM_OP_SYSREG)
                      ^
  symbol:   variable ARM_OP_SYSREG
  location: class TestArm
TestArm.java:49: error: cannot find symbol
        if (i.type == ARM_OP_REG)
                      ^
  symbol:   variable ARM_OP_REG
  location: class TestArm
TestArm.java:51: error: cannot find symbol
        if (i.type == ARM_OP_IMM)
                      ^
  symbol:   variable ARM_OP_IMM
  location: class TestArm
TestArm.java:53: error: cannot find symbol
        if (i.type == ARM_OP_PIMM)
                      ^
  symbol:   variable ARM_OP_PIMM
  location: class TestArm
100 errors
only showing the first 100 errors, of 288 total; use -Xmaxerrs if you would like to see more
make: *** [Makefile:47: tests] Error 1
RPM build errors:
error: Bad exit status from /var/tmp/rpm-tmp.TC422L (%build)
    Bad exit status from /var/tmp/rpm-tmp.TC422L (%build)
Child return code was: 1
EXCEPTION: [Error('Command failed: \n # /usr/bin/systemd-nspawn -q -M 52a8d349ceda4833959015c41fde426c -D /var/lib/mock/dist-ocs23-base-build-287463-27942/root -a -u mockbuild --capability=cap_ipc_lock --bind=/tmp/mock-resolv.07zn85mq:/etc/resolv.conf --bind=/dev/btrfs-control --bind=/dev/mapper/control --bind=/dev/loop-control --bind=/dev/loop0 --bind=/dev/loop1 --bind=/dev/loop2 --bind=/dev/loop3 --bind=/dev/loop4 --bind=/dev/loop5 --bind=/dev/loop6 --bind=/dev/loop7 --bind=/dev/loop8 --bind=/dev/loop9 --bind=/dev/loop10 --bind=/dev/loop11 --console=pipe --setenv=TERM=vt100 --setenv=SHELL=/bin/bash --setenv=HOME=/builddir --setenv=HOSTNAME=mock --setenv=PATH=/usr/bin:/bin:/usr/sbin:/sbin --setenv=PROMPT_COMMAND=printf "\\033]0;<mock-chroot>\\007" --setenv=PS1=<mock-chroot> \\s-\\v\\$  --setenv=LANG=C.UTF-8 --resolv-conf=off bash --login -c /usr/bin/rpmbuild -bb --noclean --target x86_64 --nodeps /builddir/build/SPECS/capstone.spec\n', 1)]
Traceback (most recent call last):
  File "/usr/lib/python3.11/site-packages/mockbuild/trace_decorator.py", line 93, in trace
    result = func(*args, **kw)
             ^^^^^^^^^^^^^^^^^
  File "/usr/lib/python3.11/site-packages/mockbuild/util.py", line 597, in do_with_status
    raise exception.Error("Command failed: \n # %s\n%s" % (command, output), child.returncode)
mockbuild.exception.Error: Command failed: 
 # /usr/bin/systemd-nspawn -q -M 52a8d349ceda4833959015c41fde426c -D /var/lib/mock/dist-ocs23-base-build-287463-27942/root -a -u mockbuild --capability=cap_ipc_lock --bind=/tmp/mock-resolv.07zn85mq:/etc/resolv.conf --bind=/dev/btrfs-control --bind=/dev/mapper/control --bind=/dev/loop-control --bind=/dev/loop0 --bind=/dev/loop1 --bind=/dev/loop2 --bind=/dev/loop3 --bind=/dev/loop4 --bind=/dev/loop5 --bind=/dev/loop6 --bind=/dev/loop7 --bind=/dev/loop8 --bind=/dev/loop9 --bind=/dev/loop10 --bind=/dev/loop11 --console=pipe --setenv=TERM=vt100 --setenv=SHELL=/bin/bash --setenv=HOME=/builddir --setenv=HOSTNAME=mock --setenv=PATH=/usr/bin:/bin:/usr/sbin:/sbin --setenv=PROMPT_COMMAND=printf "\033]0;<mock-chroot>\007" --setenv=PS1=<mock-chroot> \s-\v\$  --setenv=LANG=C.UTF-8 --resolv-conf=off bash --login -c /usr/bin/rpmbuild -bb --noclean --target x86_64 --nodeps /builddir/build/SPECS/capstone.spec