Mock Version: 4.1
Mock Version: 4.1
Mock Version: 4.1
ENTER ['do_with_status'](['bash', '--login', '-c', '/usr/bin/rpmbuild -bs --noclean --target x86_64 --nodeps /builddir/build/SPECS/questdb.spec'], chrootPath='/var/lib/mock/dist-ocs23-build-244905-23262/root'env={'TERM': 'vt100', 'SHELL': '/bin/bash', 'HOME': '/builddir', 'HOSTNAME': 'mock', 'PATH': '/usr/bin:/bin:/usr/sbin:/sbin', 'PROMPT_COMMAND': 'printf "\\033]0;<mock-chroot>\\007"', 'PS1': '<mock-chroot> \\s-\\v\\$ ', 'LANG': 'C.UTF-8'}shell=Falselogger=<mockbuild.trace_decorator.getLog object at 0x7f59e0f02450>timeout=86400uid=982gid=135user='mockbuild'nspawn_args=[]unshare_net=TrueprintOutput=False)
Executing command: ['bash', '--login', '-c', '/usr/bin/rpmbuild -bs --noclean --target x86_64 --nodeps /builddir/build/SPECS/questdb.spec'] with env {'TERM': 'vt100', 'SHELL': '/bin/bash', 'HOME': '/builddir', 'HOSTNAME': 'mock', 'PATH': '/usr/bin:/bin:/usr/sbin:/sbin', 'PROMPT_COMMAND': 'printf "\\033]0;<mock-chroot>\\007"', 'PS1': '<mock-chroot> \\s-\\v\\$ ', 'LANG': 'C.UTF-8'} and shell False
Building target platforms: x86_64
Building for target x86_64
Wrote: /builddir/build/SRPMS/questdb-8.1.0-1.ocs23.src.rpm
Child return code was: 0
ENTER ['do_with_status'](['bash', '--login', '-c', '/usr/bin/rpmbuild -bb --noclean --target x86_64 --nodeps /builddir/build/SPECS/questdb.spec'], chrootPath='/var/lib/mock/dist-ocs23-build-244905-23262/root'env={'TERM': 'vt100', 'SHELL': '/bin/bash', 'HOME': '/builddir', 'HOSTNAME': 'mock', 'PATH': '/usr/bin:/bin:/usr/sbin:/sbin', 'PROMPT_COMMAND': 'printf "\\033]0;<mock-chroot>\\007"', 'PS1': '<mock-chroot> \\s-\\v\\$ ', 'LANG': 'C.UTF-8'}shell=Falselogger=<mockbuild.trace_decorator.getLog object at 0x7f59e0f02450>timeout=86400uid=982gid=135user='mockbuild'nspawn_args=[]unshare_net=TrueprintOutput=False)
Executing command: ['bash', '--login', '-c', '/usr/bin/rpmbuild -bb --noclean --target x86_64 --nodeps /builddir/build/SPECS/questdb.spec'] with env {'TERM': 'vt100', 'SHELL': '/bin/bash', 'HOME': '/builddir', 'HOSTNAME': 'mock', 'PATH': '/usr/bin:/bin:/usr/sbin:/sbin', 'PROMPT_COMMAND': 'printf "\\033]0;<mock-chroot>\\007"', 'PS1': '<mock-chroot> \\s-\\v\\$ ', 'LANG': 'C.UTF-8'} and shell False
Building target platforms: x86_64
Building for target x86_64
Executing(%prep): /bin/sh -e /var/tmp/rpm-tmp.j5CYUd
+ umask 022
+ cd /builddir/build/BUILD
+ cd /builddir/build/BUILD
+ rm -rf questdb-8.1.0
+ /usr/lib/rpm/rpmuncompress -x /builddir/build/SOURCES/8.1.0.tar.gz
+ STATUS=0
+ '[' 0 -ne 0 ']'
+ cd questdb-8.1.0
+ /usr/bin/chmod -Rf a+rX,u+w,g-w,o-w .
+ RPM_EC=0
++ jobs -p
+ exit 0
Executing(%build): /bin/sh -e /var/tmp/rpm-tmp.hBQanT
+ umask 022
+ cd /builddir/build/BUILD
+ CFLAGS='-O2 -flto=auto -ffat-lto-objects -fexceptions -g -grecord-gcc-switches -pipe -Wall -Werror=format-security -Wp,-D_FORTIFY_SOURCE=2 -Wp,-D_GLIBCXX_ASSERTIONS -specs=/usr/lib/rpm/OpenCloudOS/OpenCloudOS-hardened-cc1 -fstack-protector-strong  -m64 -march=x86-64-v2 -mtune=generic -fasynchronous-unwind-tables -fstack-clash-protection -fcf-protection'
+ export CFLAGS
+ CXXFLAGS='-O2 -flto=auto -ffat-lto-objects -fexceptions -g -grecord-gcc-switches -pipe -Wall -Werror=format-security -Wp,-D_FORTIFY_SOURCE=2 -Wp,-D_GLIBCXX_ASSERTIONS -specs=/usr/lib/rpm/OpenCloudOS/OpenCloudOS-hardened-cc1 -fstack-protector-strong  -m64 -march=x86-64-v2 -mtune=generic -fasynchronous-unwind-tables -fstack-clash-protection -fcf-protection'
+ export CXXFLAGS
+ FFLAGS='-O2 -flto=auto -ffat-lto-objects -fexceptions -g -grecord-gcc-switches -pipe -Wall -Werror=format-security -Wp,-D_FORTIFY_SOURCE=2 -Wp,-D_GLIBCXX_ASSERTIONS -specs=/usr/lib/rpm/OpenCloudOS/OpenCloudOS-hardened-cc1 -fstack-protector-strong  -m64 -march=x86-64-v2 -mtune=generic -fasynchronous-unwind-tables -fstack-clash-protection -fcf-protection -I/usr/lib64/gfortran/modules'
+ export FFLAGS
+ FCFLAGS='-O2 -flto=auto -ffat-lto-objects -fexceptions -g -grecord-gcc-switches -pipe -Wall -Werror=format-security -Wp,-D_FORTIFY_SOURCE=2 -Wp,-D_GLIBCXX_ASSERTIONS -specs=/usr/lib/rpm/OpenCloudOS/OpenCloudOS-hardened-cc1 -fstack-protector-strong  -m64 -march=x86-64-v2 -mtune=generic -fasynchronous-unwind-tables -fstack-clash-protection -fcf-protection -I/usr/lib64/gfortran/modules'
+ export FCFLAGS
+ LDFLAGS='-Wl,-z,relro -Wl,--as-needed  -Wl,-z,now -specs=/usr/lib/rpm/OpenCloudOS/OpenCloudOS-hardened-ld  -Wl,--build-id=sha1'
+ export LDFLAGS
+ LT_SYS_LIBRARY_PATH=/usr/lib64:
+ export LT_SYS_LIBRARY_PATH
+ CC=gcc
+ export CC
+ CXX=g++
+ export CXX
+ cd questdb-8.1.0
+ mvn clean package -Dmaven.test.skip=true
[INFO] Scanning for projects...
[INFO] ------------------------------------------------------------------------
[INFO] Reactor Build Order:
[INFO] 
[INFO] QuestDB                                                            [jar]
[INFO] JMH benchmarks for QuestDB                                         [jar]
[INFO] Command line utils for QuestDB                                     [jar]
[INFO] Examples for QuestDB                                               [jar]
[INFO] Compatibility tests for QuestDB                                    [jar]
[INFO] QuestDB                                                            [pom]
[INFO] 
[INFO] ------------------------< org.questdb:questdb >-------------------------
[INFO] Building QuestDB 8.1.0                                             [1/6]
[INFO] --------------------------------[ jar ]---------------------------------
Downloading from central: https://repo.maven.apache.org/maven2/org/apache/maven/plugins/maven-jar-plugin/3.0.1/maven-jar-plugin-3.0.1.pom
[INFO] ------------------------------------------------------------------------
[INFO] Reactor Summary for QuestDB 8.1.0:
[INFO] 
[INFO] QuestDB ............................................ FAILURE [  0.210 s]
[INFO] JMH benchmarks for QuestDB ......................... SKIPPED
[INFO] Command line utils for QuestDB ..................... SKIPPED
[INFO] Examples for QuestDB ............................... SKIPPED
[INFO] Compatibility tests for QuestDB .................... SKIPPED
[INFO] QuestDB ............................................ SKIPPED
[INFO] ------------------------------------------------------------------------
[INFO] BUILD FAILURE
[INFO] ------------------------------------------------------------------------
[INFO] Total time:  0.289 s
[INFO] Finished at: 2024-08-20T14:06:57+08:00
[INFO] ------------------------------------------------------------------------
[ERROR] Plugin org.apache.maven.plugins:maven-jar-plugin:3.0.1 or one of its dependencies could not be resolved: Failed to read artifact descriptor for org.apache.maven.plugins:maven-jar-plugin:jar:3.0.1: Could not transfer artifact org.apache.maven.plugins:maven-jar-plugin:pom:3.0.1 from/to central (https://repo.maven.apache.org/maven2): transfer failed for https://repo.maven.apache.org/maven2/org/apache/maven/plugins/maven-jar-plugin/3.0.1/maven-jar-plugin-3.0.1.pom: Unknown host repo.maven.apache.org: Temporary failure in name resolution -> [Help 1]
[ERROR] 
[ERROR] To see the full stack trace of the errors, re-run Maven with the -e switch.
[ERROR] Re-run Maven using the -X switch to enable full debug logging.
[ERROR] 
[ERROR] For more information about the errors and possible solutions, please read the following articles:
[ERROR] [Help 1] http://cwiki.apache.org/confluence/display/MAVEN/PluginResolutionException
RPM build errors:
error: Bad exit status from /var/tmp/rpm-tmp.hBQanT (%build)
    Bad exit status from /var/tmp/rpm-tmp.hBQanT (%build)
Child return code was: 1
EXCEPTION: [Error('Command failed: \n # bash --login -c /usr/bin/rpmbuild -bb --noclean --target x86_64 --nodeps /builddir/build/SPECS/questdb.spec\n', 1)]
Traceback (most recent call last):
  File "/usr/lib/python3.11/site-packages/mockbuild/trace_decorator.py", line 93, in trace
    result = func(*args, **kw)
             ^^^^^^^^^^^^^^^^^
  File "/usr/lib/python3.11/site-packages/mockbuild/util.py", line 597, in do_with_status
    raise exception.Error("Command failed: \n # %s\n%s" % (command, output), child.returncode)
mockbuild.exception.Error: Command failed: 
 # bash --login -c /usr/bin/rpmbuild -bb --noclean --target x86_64 --nodeps /builddir/build/SPECS/questdb.spec