Mock Version: 4.1
Mock Version: 4.1
Mock Version: 4.1
ENTER ['do_with_status'](['bash', '--login', '-c', '/usr/bin/rpmbuild -bs --noclean --target x86_64 --nodeps /builddir/build/SPECS/lld.spec'], chrootPath='/var/lib/mock/dist-ocs23-build-169525-10415/root'env={'TERM': 'vt100', 'SHELL': '/bin/bash', 'HOME': '/builddir', 'HOSTNAME': 'mock', 'PATH': '/usr/bin:/bin:/usr/sbin:/sbin', 'PROMPT_COMMAND': 'printf "\\033]0;<mock-chroot>\\007"', 'PS1': '<mock-chroot> \\s-\\v\\$ ', 'LANG': 'C.UTF-8'}shell=Falselogger=<mockbuild.trace_decorator.getLog object at 0x7f0a3c498290>timeout=86400uid=982gid=135user='mockbuild'nspawn_args=[]unshare_net=TrueprintOutput=False)
Executing command: ['bash', '--login', '-c', '/usr/bin/rpmbuild -bs --noclean --target x86_64 --nodeps /builddir/build/SPECS/lld.spec'] with env {'TERM': 'vt100', 'SHELL': '/bin/bash', 'HOME': '/builddir', 'HOSTNAME': 'mock', 'PATH': '/usr/bin:/bin:/usr/sbin:/sbin', 'PROMPT_COMMAND': 'printf "\\033]0;<mock-chroot>\\007"', 'PS1': '<mock-chroot> \\s-\\v\\$ ', 'LANG': 'C.UTF-8'} and shell False
Building target platforms: x86_64
Building for target x86_64
Wrote: /builddir/build/SRPMS/lld-17.0.6-2.ocs23.src.rpm
Child return code was: 0
ENTER ['do_with_status'](['bash', '--login', '-c', '/usr/bin/rpmbuild -bb --noclean --target x86_64 --nodeps /builddir/build/SPECS/lld.spec'], chrootPath='/var/lib/mock/dist-ocs23-build-169525-10415/root'env={'TERM': 'vt100', 'SHELL': '/bin/bash', 'HOME': '/builddir', 'HOSTNAME': 'mock', 'PATH': '/usr/bin:/bin:/usr/sbin:/sbin', 'PROMPT_COMMAND': 'printf "\\033]0;<mock-chroot>\\007"', 'PS1': '<mock-chroot> \\s-\\v\\$ ', 'LANG': 'C.UTF-8'}shell=Falselogger=<mockbuild.trace_decorator.getLog object at 0x7f0a3c498290>timeout=86400uid=982gid=135user='mockbuild'nspawn_args=[]unshare_net=TrueprintOutput=False)
Executing command: ['bash', '--login', '-c', '/usr/bin/rpmbuild -bb --noclean --target x86_64 --nodeps /builddir/build/SPECS/lld.spec'] with env {'TERM': 'vt100', 'SHELL': '/bin/bash', 'HOME': '/builddir', 'HOSTNAME': 'mock', 'PATH': '/usr/bin:/bin:/usr/sbin:/sbin', 'PROMPT_COMMAND': 'printf "\\033]0;<mock-chroot>\\007"', 'PS1': '<mock-chroot> \\s-\\v\\$ ', 'LANG': 'C.UTF-8'} and shell False
Building target platforms: x86_64
Building for target x86_64
Executing(%prep): /bin/sh -e /var/tmp/rpm-tmp.4lBBU9
+ umask 022
+ cd /builddir/build/BUILD
+ cd /builddir/build/BUILD
+ rm -rf lld-17.0.6.src
+ /usr/lib/rpm/rpmuncompress -x /builddir/build/SOURCES/lld-17.0.6.src.tar.xz
+ STATUS=0
+ '[' 0 -ne 0 ']'
+ cd lld-17.0.6.src
+ /usr/bin/chmod -Rf a+rX,u+w,g-w,o-w .
+ /usr/lib/rpm/rpmuncompress /builddir/build/SOURCES/0001-Backport-lld-LoongArch-Support-the-R_LARCH_-ADD-SUB-6-relocation-type.patch
+ /usr/bin/patch -p2 -s --fuzz=0 --no-backup-if-mismatch -f
+ /usr/lib/rpm/rpmuncompress /builddir/build/SOURCES/0002-Backport-ELF-RISCV-Implement-emit-relocs-with-relaxation.patch
+ /usr/bin/patch -p2 -s --fuzz=0 --no-backup-if-mismatch -f
+ /usr/lib/rpm/rpmuncompress /builddir/build/SOURCES/0003-Backport-lld-ELF-Support-relax-R_LARCH_ALIGN.patch
+ /usr/bin/patch -p2 -s --fuzz=0 --no-backup-if-mismatch -f
+ /usr/lib/rpm/rpmuncompress /builddir/build/SOURCES/0004-Backport-lld-LoongArch-Support-the-R_LARCH_-ADD-SUB-_ULEB128-relocation-types.patch
+ /usr/bin/patch -p2 -s --fuzz=0 --no-backup-if-mismatch -f
+ /usr/lib/rpm/rpmuncompress /builddir/build/SOURCES/0002-PATCH-lld-Import-compact_unwind_encoding.h-from-libu.patch
+ /usr/bin/patch -p2 -s --fuzz=0 --no-backup-if-mismatch -f
+ RPM_EC=0
++ jobs -p
+ exit 0
Executing(%build): /bin/sh -e /var/tmp/rpm-tmp.0Ej9q1
+ umask 022
+ cd /builddir/build/BUILD
+ CFLAGS='-O2  -fexceptions -g -grecord-gcc-switches -pipe -Wall -Werror=format-security -Wp,-D_FORTIFY_SOURCE=2 -Wp,-D_GLIBCXX_ASSERTIONS -specs=/usr/lib/rpm/OpenCloudOS/OpenCloudOS-hardened-cc1 -fstack-protector-strong  -m64 -march=x86-64-v2 -mtune=generic -fasynchronous-unwind-tables -fstack-clash-protection -fcf-protection'
+ export CFLAGS
+ CXXFLAGS='-O2  -fexceptions -g -grecord-gcc-switches -pipe -Wall -Werror=format-security -Wp,-D_FORTIFY_SOURCE=2 -Wp,-D_GLIBCXX_ASSERTIONS -specs=/usr/lib/rpm/OpenCloudOS/OpenCloudOS-hardened-cc1 -fstack-protector-strong  -m64 -march=x86-64-v2 -mtune=generic -fasynchronous-unwind-tables -fstack-clash-protection -fcf-protection'
+ export CXXFLAGS
+ FFLAGS='-O2  -fexceptions -g -grecord-gcc-switches -pipe -Wall -Werror=format-security -Wp,-D_FORTIFY_SOURCE=2 -Wp,-D_GLIBCXX_ASSERTIONS -specs=/usr/lib/rpm/OpenCloudOS/OpenCloudOS-hardened-cc1 -fstack-protector-strong  -m64 -march=x86-64-v2 -mtune=generic -fasynchronous-unwind-tables -fstack-clash-protection -fcf-protection -I/usr/lib64/gfortran/modules'
+ export FFLAGS
+ FCFLAGS='-O2  -fexceptions -g -grecord-gcc-switches -pipe -Wall -Werror=format-security -Wp,-D_FORTIFY_SOURCE=2 -Wp,-D_GLIBCXX_ASSERTIONS -specs=/usr/lib/rpm/OpenCloudOS/OpenCloudOS-hardened-cc1 -fstack-protector-strong  -m64 -march=x86-64-v2 -mtune=generic -fasynchronous-unwind-tables -fstack-clash-protection -fcf-protection -I/usr/lib64/gfortran/modules'
+ export FCFLAGS
+ LDFLAGS='-Wl,-z,relro -Wl,--as-needed  -Wl,-z,now -specs=/usr/lib/rpm/OpenCloudOS/OpenCloudOS-hardened-ld  -Wl,--build-id=sha1'
+ export LDFLAGS
+ LT_SYS_LIBRARY_PATH=/usr/lib64:
+ export LT_SYS_LIBRARY_PATH
+ CC=gcc
+ export CC
+ CXX=g++
+ export CXX
+ cd lld-17.0.6.src
+ CFLAGS='-O2  -fexceptions -g -grecord-gcc-switches -pipe -Wall -Werror=format-security -Wp,-D_FORTIFY_SOURCE=2 -Wp,-D_GLIBCXX_ASSERTIONS -specs=/usr/lib/rpm/OpenCloudOS/OpenCloudOS-hardened-cc1 -fstack-protector-strong  -m64 -march=x86-64-v2 -mtune=generic -fasynchronous-unwind-tables -fstack-clash-protection -fcf-protection'
+ export CFLAGS
+ CXXFLAGS='-O2  -fexceptions -g -grecord-gcc-switches -pipe -Wall -Werror=format-security -Wp,-D_FORTIFY_SOURCE=2 -Wp,-D_GLIBCXX_ASSERTIONS -specs=/usr/lib/rpm/OpenCloudOS/OpenCloudOS-hardened-cc1 -fstack-protector-strong  -m64 -march=x86-64-v2 -mtune=generic -fasynchronous-unwind-tables -fstack-clash-protection -fcf-protection'
+ export CXXFLAGS
+ FFLAGS='-O2  -fexceptions -g -grecord-gcc-switches -pipe -Wall -Werror=format-security -Wp,-D_FORTIFY_SOURCE=2 -Wp,-D_GLIBCXX_ASSERTIONS -specs=/usr/lib/rpm/OpenCloudOS/OpenCloudOS-hardened-cc1 -fstack-protector-strong  -m64 -march=x86-64-v2 -mtune=generic -fasynchronous-unwind-tables -fstack-clash-protection -fcf-protection -I/usr/lib64/gfortran/modules'
+ export FFLAGS
+ FCFLAGS='-O2  -fexceptions -g -grecord-gcc-switches -pipe -Wall -Werror=format-security -Wp,-D_FORTIFY_SOURCE=2 -Wp,-D_GLIBCXX_ASSERTIONS -specs=/usr/lib/rpm/OpenCloudOS/OpenCloudOS-hardened-cc1 -fstack-protector-strong  -m64 -march=x86-64-v2 -mtune=generic -fasynchronous-unwind-tables -fstack-clash-protection -fcf-protection -I/usr/lib64/gfortran/modules'
+ export FCFLAGS
+ LDFLAGS='-Wl,-z,relro -Wl,--as-needed  -Wl,-z,now -specs=/usr/lib/rpm/OpenCloudOS/OpenCloudOS-hardened-ld  -Wl,--build-id=sha1'
+ export LDFLAGS
+ LT_SYS_LIBRARY_PATH=/usr/lib64:
+ export LT_SYS_LIBRARY_PATH
+ CC=gcc
+ export CC
+ CXX=g++
+ export CXX
+ /usr/bin/cmake -S . -B x86_64-OpenCloudOS-linux-gnu -DCMAKE_C_FLAGS_RELEASE:STRING=-DNDEBUG -DCMAKE_CXX_FLAGS_RELEASE:STRING=-DNDEBUG -DCMAKE_Fortran_FLAGS_RELEASE:STRING=-DNDEBUG -DCMAKE_VERBOSE_MAKEFILE:BOOL=ON -DCMAKE_INSTALL_DO_STRIP:BOOL=OFF -DCMAKE_INSTALL_PREFIX:PATH=/usr -DINCLUDE_INSTALL_DIR:PATH=/usr/include -DLIB_INSTALL_DIR:PATH=/usr/lib64 -DSYSCONF_INSTALL_DIR:PATH=/etc -DSHARE_INSTALL_PREFIX:PATH=/usr/share -DLIB_SUFFIX=64 -DBUILD_SHARED_LIBS:BOOL=ON -GNinja -DCMAKE_BUILD_TYPE=RelWithDebInfo -DLLVM_LINK_LLVM_DYLIB:BOOL=ON -DLLVM_COMMON_CMAKE_UTILS=/usr/share/llvm/cmake -DLLVM_DYLIB_COMPONENTS=all -DCMAKE_SKIP_RPATH:BOOL=ON -DPYTHON_EXECUTABLE=/usr/bin/python3 -DLLVM_INCLUDE_TESTS=ON -DLLVM_MAIN_SRC_DIR=/usr/share/llvm/src -DLLVM_EXTERNAL_LIT=/usr/bin/lit '-DLLVM_LIT_ARGS=-sv 	--path /usr/lib64/llvm' -DLLVM_LIBDIR_SUFFIX=64
-- The C compiler identification is GNU 12.3.1
-- The CXX compiler identification is GNU 12.3.1
-- Detecting C compiler ABI info
-- Detecting C compiler ABI info - done
-- Check for working C compiler: /usr/bin/gcc - skipped
-- Detecting C compile features
-- Detecting C compile features - done
-- Detecting CXX compiler ABI info
-- Detecting CXX compiler ABI info - done
-- Check for working CXX compiler: /usr/bin/g++ - skipped
-- Detecting CXX compile features
-- Detecting CXX compile features - done
-- Could NOT find FFI (missing: FFI_LIBRARIES HAVE_FFI_CALL) 
-- Looking for histedit.h
-- Looking for histedit.h - found
-- Found LibEdit: /usr/include (found version "2.11") 
-- Performing Test Terminfo_LINKABLE
-- Performing Test Terminfo_LINKABLE - Success
-- Found Terminfo: /usr/lib64/libtinfo.so  
-- Found ZLIB: /usr/lib64/libz.so (found version "1.2.13")  
-- Linker detection: GNU ld
-- Performing Test C_SUPPORTS_FPIC
-- Performing Test C_SUPPORTS_FPIC - Success
-- Performing Test CXX_SUPPORTS_FPIC
-- Performing Test CXX_SUPPORTS_FPIC - Success
-- Building with -fPIC
-- Performing Test C_SUPPORTS_FNO_SEMANTIC_INTERPOSITION
-- Performing Test C_SUPPORTS_FNO_SEMANTIC_INTERPOSITION - Success
-- Performing Test CXX_SUPPORTS_FNO_SEMANTIC_INTERPOSITION
-- Performing Test CXX_SUPPORTS_FNO_SEMANTIC_INTERPOSITION - Success
-- Performing Test SUPPORTS_FVISIBILITY_INLINES_HIDDEN_FLAG
-- Performing Test SUPPORTS_FVISIBILITY_INLINES_HIDDEN_FLAG - Success
-- Performing Test C_SUPPORTS_WERROR_DATE_TIME
-- Performing Test C_SUPPORTS_WERROR_DATE_TIME - Success
-- Performing Test CXX_SUPPORTS_WERROR_DATE_TIME
-- Performing Test CXX_SUPPORTS_WERROR_DATE_TIME - Success
-- Performing Test C_SUPPORTS_WERROR_UNGUARDED_AVAILABILITY_NEW
-- Performing Test C_SUPPORTS_WERROR_UNGUARDED_AVAILABILITY_NEW - Failed
-- Performing Test CXX_SUPPORTS_WERROR_UNGUARDED_AVAILABILITY_NEW
-- Performing Test CXX_SUPPORTS_WERROR_UNGUARDED_AVAILABILITY_NEW - Failed
-- Performing Test C_SUPPORTS_CMAKE_CXX_FLAGS
-- Performing Test C_SUPPORTS_CMAKE_CXX_FLAGS - Success
-- Performing Test CXX_SUPPORTS_CMAKE_CXX_FLAGS
-- Performing Test CXX_SUPPORTS_CMAKE_CXX_FLAGS - Success
-- Performing Test CXX_SUPPORTS_MISSING_FIELD_INITIALIZERS_FLAG
-- Performing Test CXX_SUPPORTS_MISSING_FIELD_INITIALIZERS_FLAG - Success
-- Performing Test C_SUPPORTS_IMPLICIT_FALLTHROUGH_FLAG
-- Performing Test C_SUPPORTS_IMPLICIT_FALLTHROUGH_FLAG - Success
-- Performing Test CXX_SUPPORTS_IMPLICIT_FALLTHROUGH_FLAG
-- Performing Test CXX_SUPPORTS_IMPLICIT_FALLTHROUGH_FLAG - Success
-- Performing Test C_SUPPORTS_COVERED_SWITCH_DEFAULT_FLAG
-- Performing Test C_SUPPORTS_COVERED_SWITCH_DEFAULT_FLAG - Failed
-- Performing Test CXX_SUPPORTS_COVERED_SWITCH_DEFAULT_FLAG
-- Performing Test CXX_SUPPORTS_COVERED_SWITCH_DEFAULT_FLAG - Failed
-- Performing Test CXX_SUPPORTS_CLASS_MEMACCESS_FLAG
-- Performing Test CXX_SUPPORTS_CLASS_MEMACCESS_FLAG - Success
-- Performing Test CXX_SUPPORTS_REDUNDANT_MOVE_FLAG
-- Performing Test CXX_SUPPORTS_REDUNDANT_MOVE_FLAG - Success
-- Performing Test CXX_SUPPORTS_PESSIMIZING_MOVE_FLAG
-- Performing Test CXX_SUPPORTS_PESSIMIZING_MOVE_FLAG - Success
-- Performing Test CXX_SUPPORTS_NOEXCEPT_TYPE_FLAG
-- Performing Test CXX_SUPPORTS_NOEXCEPT_TYPE_FLAG - Success
-- Performing Test CXX_WONT_WARN_ON_FINAL_NONVIRTUALDTOR
-- Performing Test CXX_WONT_WARN_ON_FINAL_NONVIRTUALDTOR - Failed
-- Performing Test CXX_SUPPORTS_SUGGEST_OVERRIDE_FLAG
-- Performing Test CXX_SUPPORTS_SUGGEST_OVERRIDE_FLAG - Success
-- Performing Test CXX_WSUGGEST_OVERRIDE_ALLOWS_ONLY_FINAL
-- Performing Test CXX_WSUGGEST_OVERRIDE_ALLOWS_ONLY_FINAL - Success
-- Performing Test C_WCOMMENT_ALLOWS_LINE_WRAP
-- Performing Test C_WCOMMENT_ALLOWS_LINE_WRAP - Failed
-- Performing Test C_SUPPORTS_STRING_CONVERSION_FLAG
-- Performing Test C_SUPPORTS_STRING_CONVERSION_FLAG - Failed
-- Performing Test CXX_SUPPORTS_STRING_CONVERSION_FLAG
-- Performing Test CXX_SUPPORTS_STRING_CONVERSION_FLAG - Failed
-- Performing Test CXX_SUPPORTS_MISLEADING_INDENTATION_FLAG
-- Performing Test CXX_SUPPORTS_MISLEADING_INDENTATION_FLAG - Success
-- Performing Test C_SUPPORTS_CTAD_MAYBE_UNSPPORTED_FLAG
-- Performing Test C_SUPPORTS_CTAD_MAYBE_UNSPPORTED_FLAG - Failed
-- Performing Test CXX_SUPPORTS_CTAD_MAYBE_UNSPPORTED_FLAG
-- Performing Test CXX_SUPPORTS_CTAD_MAYBE_UNSPPORTED_FLAG - Success
-- Performing Test LINKER_SUPPORTS_COLOR_DIAGNOSTICS
-- Performing Test LINKER_SUPPORTS_COLOR_DIAGNOSTICS - Failed
-- Performing Test C_SUPPORTS_FNO_FUNCTION_SECTIONS
-- Performing Test C_SUPPORTS_FNO_FUNCTION_SECTIONS - Success
-- Performing Test C_SUPPORTS_FFUNCTION_SECTIONS
-- Performing Test C_SUPPORTS_FFUNCTION_SECTIONS - Success
-- Performing Test CXX_SUPPORTS_FFUNCTION_SECTIONS
-- Performing Test CXX_SUPPORTS_FFUNCTION_SECTIONS - Success
-- Performing Test C_SUPPORTS_FDATA_SECTIONS
-- Performing Test C_SUPPORTS_FDATA_SECTIONS - Success
-- Performing Test CXX_SUPPORTS_FDATA_SECTIONS
-- Performing Test CXX_SUPPORTS_FDATA_SECTIONS - Success
-- Looking for os_signpost_interval_begin
-- Looking for os_signpost_interval_begin - not found
-- Performing Test HAVE_CXX_ATOMICS_WITHOUT_LIB
-- Performing Test HAVE_CXX_ATOMICS_WITHOUT_LIB - Success
-- Performing Test HAVE_CXX_ATOMICS64_WITHOUT_LIB
-- Performing Test HAVE_CXX_ATOMICS64_WITHOUT_LIB - Success
-- Performing Test LLVM_HAS_ATOMICS
-- Performing Test LLVM_HAS_ATOMICS - Success
-- Found Python3: /usr/bin/python3.11 (found version "3.11.6") found components: Interpreter 
-- LLD version: 17.0.6
-- Could NOT find Git (missing: GIT_EXECUTABLE) 
CMake Warning at /usr/lib64/cmake/llvm/AddLLVM.cmake:2481 (message):
  gtest not found, unittests will not be available
Call Stack (most recent call first):
  CMakeLists.txt:195 (llvm_add_unittests)
-- Configuring done (3.8s)
-- Generating done (0.0s)
CMake Warning:
  Manually-specified variables were not used by the project:
    CMAKE_CXX_FLAGS_RELEASE
    CMAKE_C_FLAGS_RELEASE
    CMAKE_Fortran_FLAGS_RELEASE
    CMAKE_INSTALL_DO_STRIP
    CMAKE_VERBOSE_MAKEFILE
    INCLUDE_INSTALL_DIR
    LIB_INSTALL_DIR
    LIB_SUFFIX
    PYTHON_EXECUTABLE
    SHARE_INSTALL_PREFIX
    SYSCONF_INSTALL_DIR
-- Build files have been written to: /builddir/build/BUILD/lld-17.0.6.src/x86_64-OpenCloudOS-linux-gnu
+ /usr/bin/cmake --build x86_64-OpenCloudOS-linux-gnu -j32 --verbose
[1/132] cd /builddir/build/BUILD/lld-17.0.6.src/x86_64-OpenCloudOS-linux-gnu && /usr/bin/llvm-tblgen -gen-opt-parser-defs -I /builddir/build/BUILD/lld-17.0.6.src/wasm -I/builddir/build/BUILD/lld-17.0.6.src/include -I/builddir/build/BUILD/lld-17.0.6.src/x86_64-OpenCloudOS-linux-gnu/include -I/usr/include /builddir/build/BUILD/lld-17.0.6.src/wasm/Options.td --write-if-changed -o wasm/Options.inc -d wasm/Options.inc.d
[2/132] cd /builddir/build/BUILD/lld-17.0.6.src/x86_64-OpenCloudOS-linux-gnu && /usr/bin/llvm-tblgen -gen-opt-parser-defs -I /builddir/build/BUILD/lld-17.0.6.src/COFF -I/builddir/build/BUILD/lld-17.0.6.src/include -I/builddir/build/BUILD/lld-17.0.6.src/x86_64-OpenCloudOS-linux-gnu/include -I/usr/include /builddir/build/BUILD/lld-17.0.6.src/COFF/Options.td --write-if-changed -o COFF/Options.inc -d COFF/Options.inc.d
[3/132] cd /builddir/build/BUILD/lld-17.0.6.src/x86_64-OpenCloudOS-linux-gnu && /usr/bin/llvm-tblgen -gen-opt-parser-defs -I /builddir/build/BUILD/lld-17.0.6.src/MinGW -I/builddir/build/BUILD/lld-17.0.6.src/include -I/builddir/build/BUILD/lld-17.0.6.src/x86_64-OpenCloudOS-linux-gnu/include -I/usr/include /builddir/build/BUILD/lld-17.0.6.src/MinGW/Options.td --write-if-changed -o MinGW/Options.inc -d MinGW/Options.inc.d
[4/132] cd /builddir/build/BUILD/lld-17.0.6.src/x86_64-OpenCloudOS-linux-gnu && /usr/bin/llvm-tblgen -gen-opt-parser-defs -I /builddir/build/BUILD/lld-17.0.6.src/ELF -I/builddir/build/BUILD/lld-17.0.6.src/include -I/builddir/build/BUILD/lld-17.0.6.src/x86_64-OpenCloudOS-linux-gnu/include -I/usr/include /builddir/build/BUILD/lld-17.0.6.src/ELF/Options.td --write-if-changed -o ELF/Options.inc -d ELF/Options.inc.d
[5/132] cd /builddir/build/BUILD/lld-17.0.6.src/x86_64-OpenCloudOS-linux-gnu && /usr/bin/llvm-tblgen -gen-opt-parser-defs -I /builddir/build/BUILD/lld-17.0.6.src/MachO -I/builddir/build/BUILD/lld-17.0.6.src/include -I/builddir/build/BUILD/lld-17.0.6.src/x86_64-OpenCloudOS-linux-gnu/include -I/usr/include /builddir/build/BUILD/lld-17.0.6.src/MachO/Options.td --write-if-changed -o MachO/Options.inc -d MachO/Options.inc.d
[6/132] cd /builddir/build/BUILD/lld-17.0.6.src/x86_64-OpenCloudOS-linux-gnu/Common && /usr/bin/cmake -DNAMES=LLD -DLLD_SOURCE_DIR= -DHEADER_FILE=/builddir/build/BUILD/lld-17.0.6.src/x86_64-OpenCloudOS-linux-gnu/Common/VCSVersion.inc -P /usr/lib64/cmake/llvm/GenerateVersionFromVCS.cmake
[7/132] /usr/bin/g++ -D__STDC_CONSTANT_MACROS -D__STDC_FORMAT_MACROS -D__STDC_LIMIT_MACROS -I/builddir/build/BUILD/lld-17.0.6.src/x86_64-OpenCloudOS-linux-gnu/Common -I/builddir/build/BUILD/lld-17.0.6.src/Common -I/builddir/build/BUILD/lld-17.0.6.src/include -I/builddir/build/BUILD/lld-17.0.6.src/x86_64-OpenCloudOS-linux-gnu/include -O2  -fexceptions -g -grecord-gcc-switches -pipe -Wall -Werror=format-security -Wp,-D_FORTIFY_SOURCE=2 -Wp,-D_GLIBCXX_ASSERTIONS -specs=/usr/lib/rpm/OpenCloudOS/OpenCloudOS-hardened-cc1 -fstack-protector-strong  -m64 -march=x86-64-v2 -mtune=generic -fasynchronous-unwind-tables -fstack-clash-protection -fcf-protection -fPIC -fno-semantic-interposition -fvisibility-inlines-hidden -Werror=date-time -fno-lifetime-dse -Wall -Wextra -Wno-unused-parameter -Wwrite-strings -Wcast-qual -Wno-missing-field-initializers -Wimplicit-fallthrough -Wno-nonnull -Wno-class-memaccess -Wno-redundant-move -Wno-pessimizing-move -Wno-noexcept-type -Wdelete-non-virtual-dtor -Wsuggest-override -Wno-comment -Wno-misleading-indentation -Wctad-maybe-unsupported -fdiagnostics-color -ffunction-sections -fdata-sections -O2 -g -DNDEBUG -std=c++17 -fPIC  -fno-exceptions -funwind-tables -MD -MT Common/CMakeFiles/lldCommon.dir/Version.cpp.o -MF Common/CMakeFiles/lldCommon.dir/Version.cpp.o.d -o Common/CMakeFiles/lldCommon.dir/Version.cpp.o -c /builddir/build/BUILD/lld-17.0.6.src/Common/Version.cpp
[8/132] /usr/bin/g++ -D__STDC_CONSTANT_MACROS -D__STDC_FORMAT_MACROS -D__STDC_LIMIT_MACROS -I/builddir/build/BUILD/lld-17.0.6.src/x86_64-OpenCloudOS-linux-gnu/tools/lld -I/builddir/build/BUILD/lld-17.0.6.src/tools/lld -I/builddir/build/BUILD/lld-17.0.6.src/include -I/builddir/build/BUILD/lld-17.0.6.src/x86_64-OpenCloudOS-linux-gnu/include -O2  -fexceptions -g -grecord-gcc-switches -pipe -Wall -Werror=format-security -Wp,-D_FORTIFY_SOURCE=2 -Wp,-D_GLIBCXX_ASSERTIONS -specs=/usr/lib/rpm/OpenCloudOS/OpenCloudOS-hardened-cc1 -fstack-protector-strong  -m64 -march=x86-64-v2 -mtune=generic -fasynchronous-unwind-tables -fstack-clash-protection -fcf-protection -fPIC -fno-semantic-interposition -fvisibility-inlines-hidden -Werror=date-time -fno-lifetime-dse -Wall -Wextra -Wno-unused-parameter -Wwrite-strings -Wcast-qual -Wno-missing-field-initializers -Wimplicit-fallthrough -Wno-nonnull -Wno-class-memaccess -Wno-redundant-move -Wno-pessimizing-move -Wno-noexcept-type -Wdelete-non-virtual-dtor -Wsuggest-override -Wno-comment -Wno-misleading-indentation -Wctad-maybe-unsupported -fdiagnostics-color -ffunction-sections -fdata-sections -O2 -g -DNDEBUG -std=c++17  -fno-exceptions -funwind-tables -MD -MT tools/lld/CMakeFiles/lld.dir/lld-driver.cpp.o -MF tools/lld/CMakeFiles/lld.dir/lld-driver.cpp.o.d -o tools/lld/CMakeFiles/lld.dir/lld-driver.cpp.o -c /builddir/build/BUILD/lld-17.0.6.src/x86_64-OpenCloudOS-linux-gnu/tools/lld/lld-driver.cpp
[9/132] /usr/bin/g++ -D__STDC_CONSTANT_MACROS -D__STDC_FORMAT_MACROS -D__STDC_LIMIT_MACROS -I/builddir/build/BUILD/lld-17.0.6.src/x86_64-OpenCloudOS-linux-gnu/Common -I/builddir/build/BUILD/lld-17.0.6.src/Common -I/builddir/build/BUILD/lld-17.0.6.src/include -I/builddir/build/BUILD/lld-17.0.6.src/x86_64-OpenCloudOS-linux-gnu/include -O2  -fexceptions -g -grecord-gcc-switches -pipe -Wall -Werror=format-security -Wp,-D_FORTIFY_SOURCE=2 -Wp,-D_GLIBCXX_ASSERTIONS -specs=/usr/lib/rpm/OpenCloudOS/OpenCloudOS-hardened-cc1 -fstack-protector-strong  -m64 -march=x86-64-v2 -mtune=generic -fasynchronous-unwind-tables -fstack-clash-protection -fcf-protection -fPIC -fno-semantic-interposition -fvisibility-inlines-hidden -Werror=date-time -fno-lifetime-dse -Wall -Wextra -Wno-unused-parameter -Wwrite-strings -Wcast-qual -Wno-missing-field-initializers -Wimplicit-fallthrough -Wno-nonnull -Wno-class-memaccess -Wno-redundant-move -Wno-pessimizing-move -Wno-noexcept-type -Wdelete-non-virtual-dtor -Wsuggest-override -Wno-comment -Wno-misleading-indentation -Wctad-maybe-unsupported -fdiagnostics-color -ffunction-sections -fdata-sections -O2 -g -DNDEBUG -std=c++17 -fPIC  -fno-exceptions -funwind-tables -MD -MT Common/CMakeFiles/lldCommon.dir/TargetOptionsCommandFlags.cpp.o -MF Common/CMakeFiles/lldCommon.dir/TargetOptionsCommandFlags.cpp.o.d -o Common/CMakeFiles/lldCommon.dir/TargetOptionsCommandFlags.cpp.o -c /builddir/build/BUILD/lld-17.0.6.src/Common/TargetOptionsCommandFlags.cpp
[10/132] /usr/bin/g++ -D__STDC_CONSTANT_MACROS -D__STDC_FORMAT_MACROS -D__STDC_LIMIT_MACROS -I/builddir/build/BUILD/lld-17.0.6.src/x86_64-OpenCloudOS-linux-gnu/Common -I/builddir/build/BUILD/lld-17.0.6.src/Common -I/builddir/build/BUILD/lld-17.0.6.src/include -I/builddir/build/BUILD/lld-17.0.6.src/x86_64-OpenCloudOS-linux-gnu/include -O2  -fexceptions -g -grecord-gcc-switches -pipe -Wall -Werror=format-security -Wp,-D_FORTIFY_SOURCE=2 -Wp,-D_GLIBCXX_ASSERTIONS -specs=/usr/lib/rpm/OpenCloudOS/OpenCloudOS-hardened-cc1 -fstack-protector-strong  -m64 -march=x86-64-v2 -mtune=generic -fasynchronous-unwind-tables -fstack-clash-protection -fcf-protection -fPIC -fno-semantic-interposition -fvisibility-inlines-hidden -Werror=date-time -fno-lifetime-dse -Wall -Wextra -Wno-unused-parameter -Wwrite-strings -Wcast-qual -Wno-missing-field-initializers -Wimplicit-fallthrough -Wno-nonnull -Wno-class-memaccess -Wno-redundant-move -Wno-pessimizing-move -Wno-noexcept-type -Wdelete-non-virtual-dtor -Wsuggest-override -Wno-comment -Wno-misleading-indentation -Wctad-maybe-unsupported -fdiagnostics-color -ffunction-sections -fdata-sections -O2 -g -DNDEBUG -std=c++17 -fPIC  -fno-exceptions -funwind-tables -MD -MT Common/CMakeFiles/lldCommon.dir/CommonLinkerContext.cpp.o -MF Common/CMakeFiles/lldCommon.dir/CommonLinkerContext.cpp.o.d -o Common/CMakeFiles/lldCommon.dir/CommonLinkerContext.cpp.o -c /builddir/build/BUILD/lld-17.0.6.src/Common/CommonLinkerContext.cpp
[11/132] /usr/bin/g++ -D__STDC_CONSTANT_MACROS -D__STDC_FORMAT_MACROS -D__STDC_LIMIT_MACROS -I/builddir/build/BUILD/lld-17.0.6.src/x86_64-OpenCloudOS-linux-gnu/Common -I/builddir/build/BUILD/lld-17.0.6.src/Common -I/builddir/build/BUILD/lld-17.0.6.src/include -I/builddir/build/BUILD/lld-17.0.6.src/x86_64-OpenCloudOS-linux-gnu/include -O2  -fexceptions -g -grecord-gcc-switches -pipe -Wall -Werror=format-security -Wp,-D_FORTIFY_SOURCE=2 -Wp,-D_GLIBCXX_ASSERTIONS -specs=/usr/lib/rpm/OpenCloudOS/OpenCloudOS-hardened-cc1 -fstack-protector-strong  -m64 -march=x86-64-v2 -mtune=generic -fasynchronous-unwind-tables -fstack-clash-protection -fcf-protection -fPIC -fno-semantic-interposition -fvisibility-inlines-hidden -Werror=date-time -fno-lifetime-dse -Wall -Wextra -Wno-unused-parameter -Wwrite-strings -Wcast-qual -Wno-missing-field-initializers -Wimplicit-fallthrough -Wno-nonnull -Wno-class-memaccess -Wno-redundant-move -Wno-pessimizing-move -Wno-noexcept-type -Wdelete-non-virtual-dtor -Wsuggest-override -Wno-comment -Wno-misleading-indentation -Wctad-maybe-unsupported -fdiagnostics-color -ffunction-sections -fdata-sections -O2 -g -DNDEBUG -std=c++17 -fPIC  -fno-exceptions -funwind-tables -MD -MT Common/CMakeFiles/lldCommon.dir/Memory.cpp.o -MF Common/CMakeFiles/lldCommon.dir/Memory.cpp.o.d -o Common/CMakeFiles/lldCommon.dir/Memory.cpp.o -c /builddir/build/BUILD/lld-17.0.6.src/Common/Memory.cpp
[12/132] /usr/bin/g++ -D__STDC_CONSTANT_MACROS -D__STDC_FORMAT_MACROS -D__STDC_LIMIT_MACROS -I/builddir/build/BUILD/lld-17.0.6.src/x86_64-OpenCloudOS-linux-gnu/Common -I/builddir/build/BUILD/lld-17.0.6.src/Common -I/builddir/build/BUILD/lld-17.0.6.src/include -I/builddir/build/BUILD/lld-17.0.6.src/x86_64-OpenCloudOS-linux-gnu/include -O2  -fexceptions -g -grecord-gcc-switches -pipe -Wall -Werror=format-security -Wp,-D_FORTIFY_SOURCE=2 -Wp,-D_GLIBCXX_ASSERTIONS -specs=/usr/lib/rpm/OpenCloudOS/OpenCloudOS-hardened-cc1 -fstack-protector-strong  -m64 -march=x86-64-v2 -mtune=generic -fasynchronous-unwind-tables -fstack-clash-protection -fcf-protection -fPIC -fno-semantic-interposition -fvisibility-inlines-hidden -Werror=date-time -fno-lifetime-dse -Wall -Wextra -Wno-unused-parameter -Wwrite-strings -Wcast-qual -Wno-missing-field-initializers -Wimplicit-fallthrough -Wno-nonnull -Wno-class-memaccess -Wno-redundant-move -Wno-pessimizing-move -Wno-noexcept-type -Wdelete-non-virtual-dtor -Wsuggest-override -Wno-comment -Wno-misleading-indentation -Wctad-maybe-unsupported -fdiagnostics-color -ffunction-sections -fdata-sections -O2 -g -DNDEBUG -std=c++17 -fPIC  -fno-exceptions -funwind-tables -MD -MT Common/CMakeFiles/lldCommon.dir/Filesystem.cpp.o -MF Common/CMakeFiles/lldCommon.dir/Filesystem.cpp.o.d -o Common/CMakeFiles/lldCommon.dir/Filesystem.cpp.o -c /builddir/build/BUILD/lld-17.0.6.src/Common/Filesystem.cpp
[13/132] /usr/bin/g++ -D__STDC_CONSTANT_MACROS -D__STDC_FORMAT_MACROS -D__STDC_LIMIT_MACROS -I/builddir/build/BUILD/lld-17.0.6.src/x86_64-OpenCloudOS-linux-gnu/Common -I/builddir/build/BUILD/lld-17.0.6.src/Common -I/builddir/build/BUILD/lld-17.0.6.src/include -I/builddir/build/BUILD/lld-17.0.6.src/x86_64-OpenCloudOS-linux-gnu/include -O2  -fexceptions -g -grecord-gcc-switches -pipe -Wall -Werror=format-security -Wp,-D_FORTIFY_SOURCE=2 -Wp,-D_GLIBCXX_ASSERTIONS -specs=/usr/lib/rpm/OpenCloudOS/OpenCloudOS-hardened-cc1 -fstack-protector-strong  -m64 -march=x86-64-v2 -mtune=generic -fasynchronous-unwind-tables -fstack-clash-protection -fcf-protection -fPIC -fno-semantic-interposition -fvisibility-inlines-hidden -Werror=date-time -fno-lifetime-dse -Wall -Wextra -Wno-unused-parameter -Wwrite-strings -Wcast-qual -Wno-missing-field-initializers -Wimplicit-fallthrough -Wno-nonnull -Wno-class-memaccess -Wno-redundant-move -Wno-pessimizing-move -Wno-noexcept-type -Wdelete-non-virtual-dtor -Wsuggest-override -Wno-comment -Wno-misleading-indentation -Wctad-maybe-unsupported -fdiagnostics-color -ffunction-sections -fdata-sections -O2 -g -DNDEBUG -std=c++17 -fPIC  -fno-exceptions -funwind-tables -MD -MT Common/CMakeFiles/lldCommon.dir/Timer.cpp.o -MF Common/CMakeFiles/lldCommon.dir/Timer.cpp.o.d -o Common/CMakeFiles/lldCommon.dir/Timer.cpp.o -c /builddir/build/BUILD/lld-17.0.6.src/Common/Timer.cpp
[14/132] /usr/bin/g++ -D__STDC_CONSTANT_MACROS -D__STDC_FORMAT_MACROS -D__STDC_LIMIT_MACROS -I/builddir/build/BUILD/lld-17.0.6.src/x86_64-OpenCloudOS-linux-gnu/Common -I/builddir/build/BUILD/lld-17.0.6.src/Common -I/builddir/build/BUILD/lld-17.0.6.src/include -I/builddir/build/BUILD/lld-17.0.6.src/x86_64-OpenCloudOS-linux-gnu/include -O2  -fexceptions -g -grecord-gcc-switches -pipe -Wall -Werror=format-security -Wp,-D_FORTIFY_SOURCE=2 -Wp,-D_GLIBCXX_ASSERTIONS -specs=/usr/lib/rpm/OpenCloudOS/OpenCloudOS-hardened-cc1 -fstack-protector-strong  -m64 -march=x86-64-v2 -mtune=generic -fasynchronous-unwind-tables -fstack-clash-protection -fcf-protection -fPIC -fno-semantic-interposition -fvisibility-inlines-hidden -Werror=date-time -fno-lifetime-dse -Wall -Wextra -Wno-unused-parameter -Wwrite-strings -Wcast-qual -Wno-missing-field-initializers -Wimplicit-fallthrough -Wno-nonnull -Wno-class-memaccess -Wno-redundant-move -Wno-pessimizing-move -Wno-noexcept-type -Wdelete-non-virtual-dtor -Wsuggest-override -Wno-comment -Wno-misleading-indentation -Wctad-maybe-unsupported -fdiagnostics-color -ffunction-sections -fdata-sections -O2 -g -DNDEBUG -std=c++17 -fPIC  -fno-exceptions -funwind-tables -MD -MT Common/CMakeFiles/lldCommon.dir/Reproduce.cpp.o -MF Common/CMakeFiles/lldCommon.dir/Reproduce.cpp.o.d -o Common/CMakeFiles/lldCommon.dir/Reproduce.cpp.o -c /builddir/build/BUILD/lld-17.0.6.src/Common/Reproduce.cpp
[15/132] /usr/bin/g++ -D__STDC_CONSTANT_MACROS -D__STDC_FORMAT_MACROS -D__STDC_LIMIT_MACROS -I/builddir/build/BUILD/lld-17.0.6.src/x86_64-OpenCloudOS-linux-gnu/Common -I/builddir/build/BUILD/lld-17.0.6.src/Common -I/builddir/build/BUILD/lld-17.0.6.src/include -I/builddir/build/BUILD/lld-17.0.6.src/x86_64-OpenCloudOS-linux-gnu/include -O2  -fexceptions -g -grecord-gcc-switches -pipe -Wall -Werror=format-security -Wp,-D_FORTIFY_SOURCE=2 -Wp,-D_GLIBCXX_ASSERTIONS -specs=/usr/lib/rpm/OpenCloudOS/OpenCloudOS-hardened-cc1 -fstack-protector-strong  -m64 -march=x86-64-v2 -mtune=generic -fasynchronous-unwind-tables -fstack-clash-protection -fcf-protection -fPIC -fno-semantic-interposition -fvisibility-inlines-hidden -Werror=date-time -fno-lifetime-dse -Wall -Wextra -Wno-unused-parameter -Wwrite-strings -Wcast-qual -Wno-missing-field-initializers -Wimplicit-fallthrough -Wno-nonnull -Wno-class-memaccess -Wno-redundant-move -Wno-pessimizing-move -Wno-noexcept-type -Wdelete-non-virtual-dtor -Wsuggest-override -Wno-comment -Wno-misleading-indentation -Wctad-maybe-unsupported -fdiagnostics-color -ffunction-sections -fdata-sections -O2 -g -DNDEBUG -std=c++17 -fPIC  -fno-exceptions -funwind-tables -MD -MT Common/CMakeFiles/lldCommon.dir/Args.cpp.o -MF Common/CMakeFiles/lldCommon.dir/Args.cpp.o.d -o Common/CMakeFiles/lldCommon.dir/Args.cpp.o -c /builddir/build/BUILD/lld-17.0.6.src/Common/Args.cpp
[16/132] /usr/bin/g++ -D__STDC_CONSTANT_MACROS -D__STDC_FORMAT_MACROS -D__STDC_LIMIT_MACROS -I/builddir/build/BUILD/lld-17.0.6.src/x86_64-OpenCloudOS-linux-gnu/tools/lld -I/builddir/build/BUILD/lld-17.0.6.src/tools/lld -I/builddir/build/BUILD/lld-17.0.6.src/include -I/builddir/build/BUILD/lld-17.0.6.src/x86_64-OpenCloudOS-linux-gnu/include -O2  -fexceptions -g -grecord-gcc-switches -pipe -Wall -Werror=format-security -Wp,-D_FORTIFY_SOURCE=2 -Wp,-D_GLIBCXX_ASSERTIONS -specs=/usr/lib/rpm/OpenCloudOS/OpenCloudOS-hardened-cc1 -fstack-protector-strong  -m64 -march=x86-64-v2 -mtune=generic -fasynchronous-unwind-tables -fstack-clash-protection -fcf-protection -fPIC -fno-semantic-interposition -fvisibility-inlines-hidden -Werror=date-time -fno-lifetime-dse -Wall -Wextra -Wno-unused-parameter -Wwrite-strings -Wcast-qual -Wno-missing-field-initializers -Wimplicit-fallthrough -Wno-nonnull -Wno-class-memaccess -Wno-redundant-move -Wno-pessimizing-move -Wno-noexcept-type -Wdelete-non-virtual-dtor -Wsuggest-override -Wno-comment -Wno-misleading-indentation -Wctad-maybe-unsupported -fdiagnostics-color -ffunction-sections -fdata-sections -O2 -g -DNDEBUG -std=c++17  -fno-exceptions -funwind-tables -MD -MT tools/lld/CMakeFiles/lld.dir/lld.cpp.o -MF tools/lld/CMakeFiles/lld.dir/lld.cpp.o.d -o tools/lld/CMakeFiles/lld.dir/lld.cpp.o -c /builddir/build/BUILD/lld-17.0.6.src/tools/lld/lld.cpp
[17/132] /usr/bin/g++ -D__STDC_CONSTANT_MACROS -D__STDC_FORMAT_MACROS -D__STDC_LIMIT_MACROS -I/builddir/build/BUILD/lld-17.0.6.src/x86_64-OpenCloudOS-linux-gnu/Common -I/builddir/build/BUILD/lld-17.0.6.src/Common -I/builddir/build/BUILD/lld-17.0.6.src/include -I/builddir/build/BUILD/lld-17.0.6.src/x86_64-OpenCloudOS-linux-gnu/include -O2  -fexceptions -g -grecord-gcc-switches -pipe -Wall -Werror=format-security -Wp,-D_FORTIFY_SOURCE=2 -Wp,-D_GLIBCXX_ASSERTIONS -specs=/usr/lib/rpm/OpenCloudOS/OpenCloudOS-hardened-cc1 -fstack-protector-strong  -m64 -march=x86-64-v2 -mtune=generic -fasynchronous-unwind-tables -fstack-clash-protection -fcf-protection -fPIC -fno-semantic-interposition -fvisibility-inlines-hidden -Werror=date-time -fno-lifetime-dse -Wall -Wextra -Wno-unused-parameter -Wwrite-strings -Wcast-qual -Wno-missing-field-initializers -Wimplicit-fallthrough -Wno-nonnull -Wno-class-memaccess -Wno-redundant-move -Wno-pessimizing-move -Wno-noexcept-type -Wdelete-non-virtual-dtor -Wsuggest-override -Wno-comment -Wno-misleading-indentation -Wctad-maybe-unsupported -fdiagnostics-color -ffunction-sections -fdata-sections -O2 -g -DNDEBUG -std=c++17 -fPIC  -fno-exceptions -funwind-tables -MD -MT Common/CMakeFiles/lldCommon.dir/Strings.cpp.o -MF Common/CMakeFiles/lldCommon.dir/Strings.cpp.o.d -o Common/CMakeFiles/lldCommon.dir/Strings.cpp.o -c /builddir/build/BUILD/lld-17.0.6.src/Common/Strings.cpp
[18/132] /usr/bin/g++ -D__STDC_CONSTANT_MACROS -D__STDC_FORMAT_MACROS -D__STDC_LIMIT_MACROS -I/builddir/build/BUILD/lld-17.0.6.src/x86_64-OpenCloudOS-linux-gnu/Common -I/builddir/build/BUILD/lld-17.0.6.src/Common -I/builddir/build/BUILD/lld-17.0.6.src/include -I/builddir/build/BUILD/lld-17.0.6.src/x86_64-OpenCloudOS-linux-gnu/include -O2  -fexceptions -g -grecord-gcc-switches -pipe -Wall -Werror=format-security -Wp,-D_FORTIFY_SOURCE=2 -Wp,-D_GLIBCXX_ASSERTIONS -specs=/usr/lib/rpm/OpenCloudOS/OpenCloudOS-hardened-cc1 -fstack-protector-strong  -m64 -march=x86-64-v2 -mtune=generic -fasynchronous-unwind-tables -fstack-clash-protection -fcf-protection -fPIC -fno-semantic-interposition -fvisibility-inlines-hidden -Werror=date-time -fno-lifetime-dse -Wall -Wextra -Wno-unused-parameter -Wwrite-strings -Wcast-qual -Wno-missing-field-initializers -Wimplicit-fallthrough -Wno-nonnull -Wno-class-memaccess -Wno-redundant-move -Wno-pessimizing-move -Wno-noexcept-type -Wdelete-non-virtual-dtor -Wsuggest-override -Wno-comment -Wno-misleading-indentation -Wctad-maybe-unsupported -fdiagnostics-color -ffunction-sections -fdata-sections -O2 -g -DNDEBUG -std=c++17 -fPIC  -fno-exceptions -funwind-tables -MD -MT Common/CMakeFiles/lldCommon.dir/DriverDispatcher.cpp.o -MF Common/CMakeFiles/lldCommon.dir/DriverDispatcher.cpp.o.d -o Common/CMakeFiles/lldCommon.dir/DriverDispatcher.cpp.o -c /builddir/build/BUILD/lld-17.0.6.src/Common/DriverDispatcher.cpp
[19/132] /usr/bin/g++ -D__STDC_CONSTANT_MACROS -D__STDC_FORMAT_MACROS -D__STDC_LIMIT_MACROS -I/builddir/build/BUILD/lld-17.0.6.src/x86_64-OpenCloudOS-linux-gnu/COFF -I/builddir/build/BUILD/lld-17.0.6.src/COFF -I/builddir/build/BUILD/lld-17.0.6.src/include -I/builddir/build/BUILD/lld-17.0.6.src/x86_64-OpenCloudOS-linux-gnu/include -O2  -fexceptions -g -grecord-gcc-switches -pipe -Wall -Werror=format-security -Wp,-D_FORTIFY_SOURCE=2 -Wp,-D_GLIBCXX_ASSERTIONS -specs=/usr/lib/rpm/OpenCloudOS/OpenCloudOS-hardened-cc1 -fstack-protector-strong  -m64 -march=x86-64-v2 -mtune=generic -fasynchronous-unwind-tables -fstack-clash-protection -fcf-protection -fPIC -fno-semantic-interposition -fvisibility-inlines-hidden -Werror=date-time -fno-lifetime-dse -Wall -Wextra -Wno-unused-parameter -Wwrite-strings -Wcast-qual -Wno-missing-field-initializers -Wimplicit-fallthrough -Wno-nonnull -Wno-class-memaccess -Wno-redundant-move -Wno-pessimizing-move -Wno-noexcept-type -Wdelete-non-virtual-dtor -Wsuggest-override -Wno-comment -Wno-misleading-indentation -Wctad-maybe-unsupported -fdiagnostics-color -ffunction-sections -fdata-sections -O2 -g -DNDEBUG -std=c++17 -fPIC  -fno-exceptions -funwind-tables -MD -MT COFF/CMakeFiles/lldCOFF.dir/MarkLive.cpp.o -MF COFF/CMakeFiles/lldCOFF.dir/MarkLive.cpp.o.d -o COFF/CMakeFiles/lldCOFF.dir/MarkLive.cpp.o -c /builddir/build/BUILD/lld-17.0.6.src/COFF/MarkLive.cpp
[20/132] /usr/bin/g++ -D__STDC_CONSTANT_MACROS -D__STDC_FORMAT_MACROS -D__STDC_LIMIT_MACROS -I/builddir/build/BUILD/lld-17.0.6.src/x86_64-OpenCloudOS-linux-gnu/Common -I/builddir/build/BUILD/lld-17.0.6.src/Common -I/builddir/build/BUILD/lld-17.0.6.src/include -I/builddir/build/BUILD/lld-17.0.6.src/x86_64-OpenCloudOS-linux-gnu/include -O2  -fexceptions -g -grecord-gcc-switches -pipe -Wall -Werror=format-security -Wp,-D_FORTIFY_SOURCE=2 -Wp,-D_GLIBCXX_ASSERTIONS -specs=/usr/lib/rpm/OpenCloudOS/OpenCloudOS-hardened-cc1 -fstack-protector-strong  -m64 -march=x86-64-v2 -mtune=generic -fasynchronous-unwind-tables -fstack-clash-protection -fcf-protection -fPIC -fno-semantic-interposition -fvisibility-inlines-hidden -Werror=date-time -fno-lifetime-dse -Wall -Wextra -Wno-unused-parameter -Wwrite-strings -Wcast-qual -Wno-missing-field-initializers -Wimplicit-fallthrough -Wno-nonnull -Wno-class-memaccess -Wno-redundant-move -Wno-pessimizing-move -Wno-noexcept-type -Wdelete-non-virtual-dtor -Wsuggest-override -Wno-comment -Wno-misleading-indentation -Wctad-maybe-unsupported -fdiagnostics-color -ffunction-sections -fdata-sections -O2 -g -DNDEBUG -std=c++17 -fPIC  -fno-exceptions -funwind-tables -MD -MT Common/CMakeFiles/lldCommon.dir/DWARF.cpp.o -MF Common/CMakeFiles/lldCommon.dir/DWARF.cpp.o.d -o Common/CMakeFiles/lldCommon.dir/DWARF.cpp.o -c /builddir/build/BUILD/lld-17.0.6.src/Common/DWARF.cpp
[21/132] /usr/bin/g++ -D__STDC_CONSTANT_MACROS -D__STDC_FORMAT_MACROS -D__STDC_LIMIT_MACROS -I/builddir/build/BUILD/lld-17.0.6.src/x86_64-OpenCloudOS-linux-gnu/ELF -I/builddir/build/BUILD/lld-17.0.6.src/ELF -I/builddir/build/BUILD/lld-17.0.6.src/include -I/builddir/build/BUILD/lld-17.0.6.src/x86_64-OpenCloudOS-linux-gnu/include -O2  -fexceptions -g -grecord-gcc-switches -pipe -Wall -Werror=format-security -Wp,-D_FORTIFY_SOURCE=2 -Wp,-D_GLIBCXX_ASSERTIONS -specs=/usr/lib/rpm/OpenCloudOS/OpenCloudOS-hardened-cc1 -fstack-protector-strong  -m64 -march=x86-64-v2 -mtune=generic -fasynchronous-unwind-tables -fstack-clash-protection -fcf-protection -fPIC -fno-semantic-interposition -fvisibility-inlines-hidden -Werror=date-time -fno-lifetime-dse -Wall -Wextra -Wno-unused-parameter -Wwrite-strings -Wcast-qual -Wno-missing-field-initializers -Wimplicit-fallthrough -Wno-nonnull -Wno-class-memaccess -Wno-redundant-move -Wno-pessimizing-move -Wno-noexcept-type -Wdelete-non-virtual-dtor -Wsuggest-override -Wno-comment -Wno-misleading-indentation -Wctad-maybe-unsupported -fdiagnostics-color -ffunction-sections -fdata-sections -O2 -g -DNDEBUG -std=c++17 -fPIC  -fno-exceptions -funwind-tables -MD -MT ELF/CMakeFiles/lldELF.dir/Arch/AMDGPU.cpp.o -MF ELF/CMakeFiles/lldELF.dir/Arch/AMDGPU.cpp.o.d -o ELF/CMakeFiles/lldELF.dir/Arch/AMDGPU.cpp.o -c /builddir/build/BUILD/lld-17.0.6.src/ELF/Arch/AMDGPU.cpp
[22/132] /usr/bin/g++ -D__STDC_CONSTANT_MACROS -D__STDC_FORMAT_MACROS -D__STDC_LIMIT_MACROS -I/builddir/build/BUILD/lld-17.0.6.src/x86_64-OpenCloudOS-linux-gnu/COFF -I/builddir/build/BUILD/lld-17.0.6.src/COFF -I/builddir/build/BUILD/lld-17.0.6.src/include -I/builddir/build/BUILD/lld-17.0.6.src/x86_64-OpenCloudOS-linux-gnu/include -O2  -fexceptions -g -grecord-gcc-switches -pipe -Wall -Werror=format-security -Wp,-D_FORTIFY_SOURCE=2 -Wp,-D_GLIBCXX_ASSERTIONS -specs=/usr/lib/rpm/OpenCloudOS/OpenCloudOS-hardened-cc1 -fstack-protector-strong  -m64 -march=x86-64-v2 -mtune=generic -fasynchronous-unwind-tables -fstack-clash-protection -fcf-protection -fPIC -fno-semantic-interposition -fvisibility-inlines-hidden -Werror=date-time -fno-lifetime-dse -Wall -Wextra -Wno-unused-parameter -Wwrite-strings -Wcast-qual -Wno-missing-field-initializers -Wimplicit-fallthrough -Wno-nonnull -Wno-class-memaccess -Wno-redundant-move -Wno-pessimizing-move -Wno-noexcept-type -Wdelete-non-virtual-dtor -Wsuggest-override -Wno-comment -Wno-misleading-indentation -Wctad-maybe-unsupported -fdiagnostics-color -ffunction-sections -fdata-sections -O2 -g -DNDEBUG -std=c++17 -fPIC  -fno-exceptions -funwind-tables -MD -MT COFF/CMakeFiles/lldCOFF.dir/ICF.cpp.o -MF COFF/CMakeFiles/lldCOFF.dir/ICF.cpp.o.d -o COFF/CMakeFiles/lldCOFF.dir/ICF.cpp.o -c /builddir/build/BUILD/lld-17.0.6.src/COFF/ICF.cpp
[23/132] /usr/bin/g++ -D__STDC_CONSTANT_MACROS -D__STDC_FORMAT_MACROS -D__STDC_LIMIT_MACROS -I/builddir/build/BUILD/lld-17.0.6.src/x86_64-OpenCloudOS-linux-gnu/ELF -I/builddir/build/BUILD/lld-17.0.6.src/ELF -I/builddir/build/BUILD/lld-17.0.6.src/include -I/builddir/build/BUILD/lld-17.0.6.src/x86_64-OpenCloudOS-linux-gnu/include -O2  -fexceptions -g -grecord-gcc-switches -pipe -Wall -Werror=format-security -Wp,-D_FORTIFY_SOURCE=2 -Wp,-D_GLIBCXX_ASSERTIONS -specs=/usr/lib/rpm/OpenCloudOS/OpenCloudOS-hardened-cc1 -fstack-protector-strong  -m64 -march=x86-64-v2 -mtune=generic -fasynchronous-unwind-tables -fstack-clash-protection -fcf-protection -fPIC -fno-semantic-interposition -fvisibility-inlines-hidden -Werror=date-time -fno-lifetime-dse -Wall -Wextra -Wno-unused-parameter -Wwrite-strings -Wcast-qual -Wno-missing-field-initializers -Wimplicit-fallthrough -Wno-nonnull -Wno-class-memaccess -Wno-redundant-move -Wno-pessimizing-move -Wno-noexcept-type -Wdelete-non-virtual-dtor -Wsuggest-override -Wno-comment -Wno-misleading-indentation -Wctad-maybe-unsupported -fdiagnostics-color -ffunction-sections -fdata-sections -O2 -g -DNDEBUG -std=c++17 -fPIC  -fno-exceptions -funwind-tables -MD -MT ELF/CMakeFiles/lldELF.dir/Arch/MSP430.cpp.o -MF ELF/CMakeFiles/lldELF.dir/Arch/MSP430.cpp.o.d -o ELF/CMakeFiles/lldELF.dir/Arch/MSP430.cpp.o -c /builddir/build/BUILD/lld-17.0.6.src/ELF/Arch/MSP430.cpp
[24/132] /usr/bin/g++ -D__STDC_CONSTANT_MACROS -D__STDC_FORMAT_MACROS -D__STDC_LIMIT_MACROS -I/builddir/build/BUILD/lld-17.0.6.src/x86_64-OpenCloudOS-linux-gnu/COFF -I/builddir/build/BUILD/lld-17.0.6.src/COFF -I/builddir/build/BUILD/lld-17.0.6.src/include -I/builddir/build/BUILD/lld-17.0.6.src/x86_64-OpenCloudOS-linux-gnu/include -O2  -fexceptions -g -grecord-gcc-switches -pipe -Wall -Werror=format-security -Wp,-D_FORTIFY_SOURCE=2 -Wp,-D_GLIBCXX_ASSERTIONS -specs=/usr/lib/rpm/OpenCloudOS/OpenCloudOS-hardened-cc1 -fstack-protector-strong  -m64 -march=x86-64-v2 -mtune=generic -fasynchronous-unwind-tables -fstack-clash-protection -fcf-protection -fPIC -fno-semantic-interposition -fvisibility-inlines-hidden -Werror=date-time -fno-lifetime-dse -Wall -Wextra -Wno-unused-parameter -Wwrite-strings -Wcast-qual -Wno-missing-field-initializers -Wimplicit-fallthrough -Wno-nonnull -Wno-class-memaccess -Wno-redundant-move -Wno-pessimizing-move -Wno-noexcept-type -Wdelete-non-virtual-dtor -Wsuggest-override -Wno-comment -Wno-misleading-indentation -Wctad-maybe-unsupported -fdiagnostics-color -ffunction-sections -fdata-sections -O2 -g -DNDEBUG -std=c++17 -fPIC  -fno-exceptions -funwind-tables -MD -MT COFF/CMakeFiles/lldCOFF.dir/Symbols.cpp.o -MF COFF/CMakeFiles/lldCOFF.dir/Symbols.cpp.o.d -o COFF/CMakeFiles/lldCOFF.dir/Symbols.cpp.o -c /builddir/build/BUILD/lld-17.0.6.src/COFF/Symbols.cpp
[25/132] /usr/bin/g++ -D__STDC_CONSTANT_MACROS -D__STDC_FORMAT_MACROS -D__STDC_LIMIT_MACROS -I/builddir/build/BUILD/lld-17.0.6.src/x86_64-OpenCloudOS-linux-gnu/COFF -I/builddir/build/BUILD/lld-17.0.6.src/COFF -I/builddir/build/BUILD/lld-17.0.6.src/include -I/builddir/build/BUILD/lld-17.0.6.src/x86_64-OpenCloudOS-linux-gnu/include -O2  -fexceptions -g -grecord-gcc-switches -pipe -Wall -Werror=format-security -Wp,-D_FORTIFY_SOURCE=2 -Wp,-D_GLIBCXX_ASSERTIONS -specs=/usr/lib/rpm/OpenCloudOS/OpenCloudOS-hardened-cc1 -fstack-protector-strong  -m64 -march=x86-64-v2 -mtune=generic -fasynchronous-unwind-tables -fstack-clash-protection -fcf-protection -fPIC -fno-semantic-interposition -fvisibility-inlines-hidden -Werror=date-time -fno-lifetime-dse -Wall -Wextra -Wno-unused-parameter -Wwrite-strings -Wcast-qual -Wno-missing-field-initializers -Wimplicit-fallthrough -Wno-nonnull -Wno-class-memaccess -Wno-redundant-move -Wno-pessimizing-move -Wno-noexcept-type -Wdelete-non-virtual-dtor -Wsuggest-override -Wno-comment -Wno-misleading-indentation -Wctad-maybe-unsupported -fdiagnostics-color -ffunction-sections -fdata-sections -O2 -g -DNDEBUG -std=c++17 -fPIC  -fno-exceptions -funwind-tables -MD -MT COFF/CMakeFiles/lldCOFF.dir/COFFLinkerContext.cpp.o -MF COFF/CMakeFiles/lldCOFF.dir/COFFLinkerContext.cpp.o.d -o COFF/CMakeFiles/lldCOFF.dir/COFFLinkerContext.cpp.o -c /builddir/build/BUILD/lld-17.0.6.src/COFF/COFFLinkerContext.cpp
[26/132] /usr/bin/g++ -D__STDC_CONSTANT_MACROS -D__STDC_FORMAT_MACROS -D__STDC_LIMIT_MACROS -I/builddir/build/BUILD/lld-17.0.6.src/x86_64-OpenCloudOS-linux-gnu/ELF -I/builddir/build/BUILD/lld-17.0.6.src/ELF -I/builddir/build/BUILD/lld-17.0.6.src/include -I/builddir/build/BUILD/lld-17.0.6.src/x86_64-OpenCloudOS-linux-gnu/include -O2  -fexceptions -g -grecord-gcc-switches -pipe -Wall -Werror=format-security -Wp,-D_FORTIFY_SOURCE=2 -Wp,-D_GLIBCXX_ASSERTIONS -specs=/usr/lib/rpm/OpenCloudOS/OpenCloudOS-hardened-cc1 -fstack-protector-strong  -m64 -march=x86-64-v2 -mtune=generic -fasynchronous-unwind-tables -fstack-clash-protection -fcf-protection -fPIC -fno-semantic-interposition -fvisibility-inlines-hidden -Werror=date-time -fno-lifetime-dse -Wall -Wextra -Wno-unused-parameter -Wwrite-strings -Wcast-qual -Wno-missing-field-initializers -Wimplicit-fallthrough -Wno-nonnull -Wno-class-memaccess -Wno-redundant-move -Wno-pessimizing-move -Wno-noexcept-type -Wdelete-non-virtual-dtor -Wsuggest-override -Wno-comment -Wno-misleading-indentation -Wctad-maybe-unsupported -fdiagnostics-color -ffunction-sections -fdata-sections -O2 -g -DNDEBUG -std=c++17 -fPIC  -fno-exceptions -funwind-tables -MD -MT ELF/CMakeFiles/lldELF.dir/Arch/AVR.cpp.o -MF ELF/CMakeFiles/lldELF.dir/Arch/AVR.cpp.o.d -o ELF/CMakeFiles/lldELF.dir/Arch/AVR.cpp.o -c /builddir/build/BUILD/lld-17.0.6.src/ELF/Arch/AVR.cpp
[27/132] /usr/bin/g++ -D__STDC_CONSTANT_MACROS -D__STDC_FORMAT_MACROS -D__STDC_LIMIT_MACROS -I/builddir/build/BUILD/lld-17.0.6.src/x86_64-OpenCloudOS-linux-gnu/COFF -I/builddir/build/BUILD/lld-17.0.6.src/COFF -I/builddir/build/BUILD/lld-17.0.6.src/include -I/builddir/build/BUILD/lld-17.0.6.src/x86_64-OpenCloudOS-linux-gnu/include -O2  -fexceptions -g -grecord-gcc-switches -pipe -Wall -Werror=format-security -Wp,-D_FORTIFY_SOURCE=2 -Wp,-D_GLIBCXX_ASSERTIONS -specs=/usr/lib/rpm/OpenCloudOS/OpenCloudOS-hardened-cc1 -fstack-protector-strong  -m64 -march=x86-64-v2 -mtune=generic -fasynchronous-unwind-tables -fstack-clash-protection -fcf-protection -fPIC -fno-semantic-interposition -fvisibility-inlines-hidden -Werror=date-time -fno-lifetime-dse -Wall -Wextra -Wno-unused-parameter -Wwrite-strings -Wcast-qual -Wno-missing-field-initializers -Wimplicit-fallthrough -Wno-nonnull -Wno-class-memaccess -Wno-redundant-move -Wno-pessimizing-move -Wno-noexcept-type -Wdelete-non-virtual-dtor -Wsuggest-override -Wno-comment -Wno-misleading-indentation -Wctad-maybe-unsupported -fdiagnostics-color -ffunction-sections -fdata-sections -O2 -g -DNDEBUG -std=c++17 -fPIC  -fno-exceptions -funwind-tables -MD -MT COFF/CMakeFiles/lldCOFF.dir/CallGraphSort.cpp.o -MF COFF/CMakeFiles/lldCOFF.dir/CallGraphSort.cpp.o.d -o COFF/CMakeFiles/lldCOFF.dir/CallGraphSort.cpp.o -c /builddir/build/BUILD/lld-17.0.6.src/COFF/CallGraphSort.cpp
[28/132] /usr/bin/g++ -D__STDC_CONSTANT_MACROS -D__STDC_FORMAT_MACROS -D__STDC_LIMIT_MACROS -I/builddir/build/BUILD/lld-17.0.6.src/x86_64-OpenCloudOS-linux-gnu/COFF -I/builddir/build/BUILD/lld-17.0.6.src/COFF -I/builddir/build/BUILD/lld-17.0.6.src/include -I/builddir/build/BUILD/lld-17.0.6.src/x86_64-OpenCloudOS-linux-gnu/include -O2  -fexceptions -g -grecord-gcc-switches -pipe -Wall -Werror=format-security -Wp,-D_FORTIFY_SOURCE=2 -Wp,-D_GLIBCXX_ASSERTIONS -specs=/usr/lib/rpm/OpenCloudOS/OpenCloudOS-hardened-cc1 -fstack-protector-strong  -m64 -march=x86-64-v2 -mtune=generic -fasynchronous-unwind-tables -fstack-clash-protection -fcf-protection -fPIC -fno-semantic-interposition -fvisibility-inlines-hidden -Werror=date-time -fno-lifetime-dse -Wall -Wextra -Wno-unused-parameter -Wwrite-strings -Wcast-qual -Wno-missing-field-initializers -Wimplicit-fallthrough -Wno-nonnull -Wno-class-memaccess -Wno-redundant-move -Wno-pessimizing-move -Wno-noexcept-type -Wdelete-non-virtual-dtor -Wsuggest-override -Wno-comment -Wno-misleading-indentation -Wctad-maybe-unsupported -fdiagnostics-color -ffunction-sections -fdata-sections -O2 -g -DNDEBUG -std=c++17 -fPIC  -fno-exceptions -funwind-tables -MD -MT COFF/CMakeFiles/lldCOFF.dir/MinGW.cpp.o -MF COFF/CMakeFiles/lldCOFF.dir/MinGW.cpp.o.d -o COFF/CMakeFiles/lldCOFF.dir/MinGW.cpp.o -c /builddir/build/BUILD/lld-17.0.6.src/COFF/MinGW.cpp
[29/132] /usr/bin/g++ -D__STDC_CONSTANT_MACROS -D__STDC_FORMAT_MACROS -D__STDC_LIMIT_MACROS -I/builddir/build/BUILD/lld-17.0.6.src/x86_64-OpenCloudOS-linux-gnu/COFF -I/builddir/build/BUILD/lld-17.0.6.src/COFF -I/builddir/build/BUILD/lld-17.0.6.src/include -I/builddir/build/BUILD/lld-17.0.6.src/x86_64-OpenCloudOS-linux-gnu/include -O2  -fexceptions -g -grecord-gcc-switches -pipe -Wall -Werror=format-security -Wp,-D_FORTIFY_SOURCE=2 -Wp,-D_GLIBCXX_ASSERTIONS -specs=/usr/lib/rpm/OpenCloudOS/OpenCloudOS-hardened-cc1 -fstack-protector-strong  -m64 -march=x86-64-v2 -mtune=generic -fasynchronous-unwind-tables -fstack-clash-protection -fcf-protection -fPIC -fno-semantic-interposition -fvisibility-inlines-hidden -Werror=date-time -fno-lifetime-dse -Wall -Wextra -Wno-unused-parameter -Wwrite-strings -Wcast-qual -Wno-missing-field-initializers -Wimplicit-fallthrough -Wno-nonnull -Wno-class-memaccess -Wno-redundant-move -Wno-pessimizing-move -Wno-noexcept-type -Wdelete-non-virtual-dtor -Wsuggest-override -Wno-comment -Wno-misleading-indentation -Wctad-maybe-unsupported -fdiagnostics-color -ffunction-sections -fdata-sections -O2 -g -DNDEBUG -std=c++17 -fPIC  -fno-exceptions -funwind-tables -MD -MT COFF/CMakeFiles/lldCOFF.dir/LLDMapFile.cpp.o -MF COFF/CMakeFiles/lldCOFF.dir/LLDMapFile.cpp.o.d -o COFF/CMakeFiles/lldCOFF.dir/LLDMapFile.cpp.o -c /builddir/build/BUILD/lld-17.0.6.src/COFF/LLDMapFile.cpp
[30/132] /usr/bin/g++ -D__STDC_CONSTANT_MACROS -D__STDC_FORMAT_MACROS -D__STDC_LIMIT_MACROS -I/builddir/build/BUILD/lld-17.0.6.src/x86_64-OpenCloudOS-linux-gnu/ELF -I/builddir/build/BUILD/lld-17.0.6.src/ELF -I/builddir/build/BUILD/lld-17.0.6.src/include -I/builddir/build/BUILD/lld-17.0.6.src/x86_64-OpenCloudOS-linux-gnu/include -O2  -fexceptions -g -grecord-gcc-switches -pipe -Wall -Werror=format-security -Wp,-D_FORTIFY_SOURCE=2 -Wp,-D_GLIBCXX_ASSERTIONS -specs=/usr/lib/rpm/OpenCloudOS/OpenCloudOS-hardened-cc1 -fstack-protector-strong  -m64 -march=x86-64-v2 -mtune=generic -fasynchronous-unwind-tables -fstack-clash-protection -fcf-protection -fPIC -fno-semantic-interposition -fvisibility-inlines-hidden -Werror=date-time -fno-lifetime-dse -Wall -Wextra -Wno-unused-parameter -Wwrite-strings -Wcast-qual -Wno-missing-field-initializers -Wimplicit-fallthrough -Wno-nonnull -Wno-class-memaccess -Wno-redundant-move -Wno-pessimizing-move -Wno-noexcept-type -Wdelete-non-virtual-dtor -Wsuggest-override -Wno-comment -Wno-misleading-indentation -Wctad-maybe-unsupported -fdiagnostics-color -ffunction-sections -fdata-sections -O2 -g -DNDEBUG -std=c++17 -fPIC  -fno-exceptions -funwind-tables -MD -MT ELF/CMakeFiles/lldELF.dir/Arch/AArch64.cpp.o -MF ELF/CMakeFiles/lldELF.dir/Arch/AArch64.cpp.o.d -o ELF/CMakeFiles/lldELF.dir/Arch/AArch64.cpp.o -c /builddir/build/BUILD/lld-17.0.6.src/ELF/Arch/AArch64.cpp
[31/132] /usr/bin/g++ -D__STDC_CONSTANT_MACROS -D__STDC_FORMAT_MACROS -D__STDC_LIMIT_MACROS -I/builddir/build/BUILD/lld-17.0.6.src/x86_64-OpenCloudOS-linux-gnu/ELF -I/builddir/build/BUILD/lld-17.0.6.src/ELF -I/builddir/build/BUILD/lld-17.0.6.src/include -I/builddir/build/BUILD/lld-17.0.6.src/x86_64-OpenCloudOS-linux-gnu/include -O2  -fexceptions -g -grecord-gcc-switches -pipe -Wall -Werror=format-security -Wp,-D_FORTIFY_SOURCE=2 -Wp,-D_GLIBCXX_ASSERTIONS -specs=/usr/lib/rpm/OpenCloudOS/OpenCloudOS-hardened-cc1 -fstack-protector-strong  -m64 -march=x86-64-v2 -mtune=generic -fasynchronous-unwind-tables -fstack-clash-protection -fcf-protection -fPIC -fno-semantic-interposition -fvisibility-inlines-hidden -Werror=date-time -fno-lifetime-dse -Wall -Wextra -Wno-unused-parameter -Wwrite-strings -Wcast-qual -Wno-missing-field-initializers -Wimplicit-fallthrough -Wno-nonnull -Wno-class-memaccess -Wno-redundant-move -Wno-pessimizing-move -Wno-noexcept-type -Wdelete-non-virtual-dtor -Wsuggest-override -Wno-comment -Wno-misleading-indentation -Wctad-maybe-unsupported -fdiagnostics-color -ffunction-sections -fdata-sections -O2 -g -DNDEBUG -std=c++17 -fPIC  -fno-exceptions -funwind-tables -MD -MT ELF/CMakeFiles/lldELF.dir/Arch/MipsArchTree.cpp.o -MF ELF/CMakeFiles/lldELF.dir/Arch/MipsArchTree.cpp.o.d -o ELF/CMakeFiles/lldELF.dir/Arch/MipsArchTree.cpp.o -c /builddir/build/BUILD/lld-17.0.6.src/ELF/Arch/MipsArchTree.cpp
[32/132] /usr/bin/g++ -D__STDC_CONSTANT_MACROS -D__STDC_FORMAT_MACROS -D__STDC_LIMIT_MACROS -I/builddir/build/BUILD/lld-17.0.6.src/x86_64-OpenCloudOS-linux-gnu/ELF -I/builddir/build/BUILD/lld-17.0.6.src/ELF -I/builddir/build/BUILD/lld-17.0.6.src/include -I/builddir/build/BUILD/lld-17.0.6.src/x86_64-OpenCloudOS-linux-gnu/include -O2  -fexceptions -g -grecord-gcc-switches -pipe -Wall -Werror=format-security -Wp,-D_FORTIFY_SOURCE=2 -Wp,-D_GLIBCXX_ASSERTIONS -specs=/usr/lib/rpm/OpenCloudOS/OpenCloudOS-hardened-cc1 -fstack-protector-strong  -m64 -march=x86-64-v2 -mtune=generic -fasynchronous-unwind-tables -fstack-clash-protection -fcf-protection -fPIC -fno-semantic-interposition -fvisibility-inlines-hidden -Werror=date-time -fno-lifetime-dse -Wall -Wextra -Wno-unused-parameter -Wwrite-strings -Wcast-qual -Wno-missing-field-initializers -Wimplicit-fallthrough -Wno-nonnull -Wno-class-memaccess -Wno-redundant-move -Wno-pessimizing-move -Wno-noexcept-type -Wdelete-non-virtual-dtor -Wsuggest-override -Wno-comment -Wno-misleading-indentation -Wctad-maybe-unsupported -fdiagnostics-color -ffunction-sections -fdata-sections -O2 -g -DNDEBUG -std=c++17 -fPIC  -fno-exceptions -funwind-tables -MD -MT ELF/CMakeFiles/lldELF.dir/Arch/Hexagon.cpp.o -MF ELF/CMakeFiles/lldELF.dir/Arch/Hexagon.cpp.o.d -o ELF/CMakeFiles/lldELF.dir/Arch/Hexagon.cpp.o -c /builddir/build/BUILD/lld-17.0.6.src/ELF/Arch/Hexagon.cpp
[33/132] /usr/bin/g++ -D__STDC_CONSTANT_MACROS -D__STDC_FORMAT_MACROS -D__STDC_LIMIT_MACROS -I/builddir/build/BUILD/lld-17.0.6.src/x86_64-OpenCloudOS-linux-gnu/COFF -I/builddir/build/BUILD/lld-17.0.6.src/COFF -I/builddir/build/BUILD/lld-17.0.6.src/include -I/builddir/build/BUILD/lld-17.0.6.src/x86_64-OpenCloudOS-linux-gnu/include -O2  -fexceptions -g -grecord-gcc-switches -pipe -Wall -Werror=format-security -Wp,-D_FORTIFY_SOURCE=2 -Wp,-D_GLIBCXX_ASSERTIONS -specs=/usr/lib/rpm/OpenCloudOS/OpenCloudOS-hardened-cc1 -fstack-protector-strong  -m64 -march=x86-64-v2 -mtune=generic -fasynchronous-unwind-tables -fstack-clash-protection -fcf-protection -fPIC -fno-semantic-interposition -fvisibility-inlines-hidden -Werror=date-time -fno-lifetime-dse -Wall -Wextra -Wno-unused-parameter -Wwrite-strings -Wcast-qual -Wno-missing-field-initializers -Wimplicit-fallthrough -Wno-nonnull -Wno-class-memaccess -Wno-redundant-move -Wno-pessimizing-move -Wno-noexcept-type -Wdelete-non-virtual-dtor -Wsuggest-override -Wno-comment -Wno-misleading-indentation -Wctad-maybe-unsupported -fdiagnostics-color -ffunction-sections -fdata-sections -O2 -g -DNDEBUG -std=c++17 -fPIC  -fno-exceptions -funwind-tables -MD -MT COFF/CMakeFiles/lldCOFF.dir/Chunks.cpp.o -MF COFF/CMakeFiles/lldCOFF.dir/Chunks.cpp.o.d -o COFF/CMakeFiles/lldCOFF.dir/Chunks.cpp.o -c /builddir/build/BUILD/lld-17.0.6.src/COFF/Chunks.cpp
[34/132] /usr/bin/g++ -D__STDC_CONSTANT_MACROS -D__STDC_FORMAT_MACROS -D__STDC_LIMIT_MACROS -I/builddir/build/BUILD/lld-17.0.6.src/x86_64-OpenCloudOS-linux-gnu/ELF -I/builddir/build/BUILD/lld-17.0.6.src/ELF -I/builddir/build/BUILD/lld-17.0.6.src/include -I/builddir/build/BUILD/lld-17.0.6.src/x86_64-OpenCloudOS-linux-gnu/include -O2  -fexceptions -g -grecord-gcc-switches -pipe -Wall -Werror=format-security -Wp,-D_FORTIFY_SOURCE=2 -Wp,-D_GLIBCXX_ASSERTIONS -specs=/usr/lib/rpm/OpenCloudOS/OpenCloudOS-hardened-cc1 -fstack-protector-strong  -m64 -march=x86-64-v2 -mtune=generic -fasynchronous-unwind-tables -fstack-clash-protection -fcf-protection -fPIC -fno-semantic-interposition -fvisibility-inlines-hidden -Werror=date-time -fno-lifetime-dse -Wall -Wextra -Wno-unused-parameter -Wwrite-strings -Wcast-qual -Wno-missing-field-initializers -Wimplicit-fallthrough -Wno-nonnull -Wno-class-memaccess -Wno-redundant-move -Wno-pessimizing-move -Wno-noexcept-type -Wdelete-non-virtual-dtor -Wsuggest-override -Wno-comment -Wno-misleading-indentation -Wctad-maybe-unsupported -fdiagnostics-color -ffunction-sections -fdata-sections -O2 -g -DNDEBUG -std=c++17 -fPIC  -fno-exceptions -funwind-tables -MD -MT ELF/CMakeFiles/lldELF.dir/AArch64ErrataFix.cpp.o -MF ELF/CMakeFiles/lldELF.dir/AArch64ErrataFix.cpp.o.d -o ELF/CMakeFiles/lldELF.dir/AArch64ErrataFix.cpp.o -c /builddir/build/BUILD/lld-17.0.6.src/ELF/AArch64ErrataFix.cpp
/builddir/build/BUILD/lld-17.0.6.src/ELF/AArch64ErrataFix.cpp: In member function 'void lld::elf::AArch64Err843419Patcher::insertPatches(lld::elf::InputSectionDescription&, std::vector<lld::elf::Patch843419Section*>&)':
/builddir/build/BUILD/lld-17.0.6.src/ELF/AArch64ErrataFix.cpp:508:27: warning: 'isecLimit' may be used uninitialized [-Wmaybe-uninitialized]
  508 |     (*patchIt)->outSecOff = isecLimit;
      |     ~~~~~~~~~~~~~~~~~~~~~~^~~~~~~~~~~
/builddir/build/BUILD/lld-17.0.6.src/ELF/AArch64ErrataFix.cpp:484:12: note: 'isecLimit' was declared here
  484 |   uint64_t isecLimit;
      |            ^~~~~~~~~
[35/132] /usr/bin/g++ -D__STDC_CONSTANT_MACROS -D__STDC_FORMAT_MACROS -D__STDC_LIMIT_MACROS -I/builddir/build/BUILD/lld-17.0.6.src/x86_64-OpenCloudOS-linux-gnu/ELF -I/builddir/build/BUILD/lld-17.0.6.src/ELF -I/builddir/build/BUILD/lld-17.0.6.src/include -I/builddir/build/BUILD/lld-17.0.6.src/x86_64-OpenCloudOS-linux-gnu/include -O2  -fexceptions -g -grecord-gcc-switches -pipe -Wall -Werror=format-security -Wp,-D_FORTIFY_SOURCE=2 -Wp,-D_GLIBCXX_ASSERTIONS -specs=/usr/lib/rpm/OpenCloudOS/OpenCloudOS-hardened-cc1 -fstack-protector-strong  -m64 -march=x86-64-v2 -mtune=generic -fasynchronous-unwind-tables -fstack-clash-protection -fcf-protection -fPIC -fno-semantic-interposition -fvisibility-inlines-hidden -Werror=date-time -fno-lifetime-dse -Wall -Wextra -Wno-unused-parameter -Wwrite-strings -Wcast-qual -Wno-missing-field-initializers -Wimplicit-fallthrough -Wno-nonnull -Wno-class-memaccess -Wno-redundant-move -Wno-pessimizing-move -Wno-noexcept-type -Wdelete-non-virtual-dtor -Wsuggest-override -Wno-comment -Wno-misleading-indentation -Wctad-maybe-unsupported -fdiagnostics-color -ffunction-sections -fdata-sections -O2 -g -DNDEBUG -std=c++17 -fPIC  -fno-exceptions -funwind-tables -MD -MT ELF/CMakeFiles/lldELF.dir/Arch/PPC.cpp.o -MF ELF/CMakeFiles/lldELF.dir/Arch/PPC.cpp.o.d -o ELF/CMakeFiles/lldELF.dir/Arch/PPC.cpp.o -c /builddir/build/BUILD/lld-17.0.6.src/ELF/Arch/PPC.cpp
[36/132] /usr/bin/g++ -D__STDC_CONSTANT_MACROS -D__STDC_FORMAT_MACROS -D__STDC_LIMIT_MACROS -I/builddir/build/BUILD/lld-17.0.6.src/x86_64-OpenCloudOS-linux-gnu/COFF -I/builddir/build/BUILD/lld-17.0.6.src/COFF -I/builddir/build/BUILD/lld-17.0.6.src/include -I/builddir/build/BUILD/lld-17.0.6.src/x86_64-OpenCloudOS-linux-gnu/include -O2  -fexceptions -g -grecord-gcc-switches -pipe -Wall -Werror=format-security -Wp,-D_FORTIFY_SOURCE=2 -Wp,-D_GLIBCXX_ASSERTIONS -specs=/usr/lib/rpm/OpenCloudOS/OpenCloudOS-hardened-cc1 -fstack-protector-strong  -m64 -march=x86-64-v2 -mtune=generic -fasynchronous-unwind-tables -fstack-clash-protection -fcf-protection -fPIC -fno-semantic-interposition -fvisibility-inlines-hidden -Werror=date-time -fno-lifetime-dse -Wall -Wextra -Wno-unused-parameter -Wwrite-strings -Wcast-qual -Wno-missing-field-initializers -Wimplicit-fallthrough -Wno-nonnull -Wno-class-memaccess -Wno-redundant-move -Wno-pessimizing-move -Wno-noexcept-type -Wdelete-non-virtual-dtor -Wsuggest-override -Wno-comment -Wno-misleading-indentation -Wctad-maybe-unsupported -fdiagnostics-color -ffunction-sections -fdata-sections -O2 -g -DNDEBUG -std=c++17 -fPIC  -fno-exceptions -funwind-tables -MD -MT COFF/CMakeFiles/lldCOFF.dir/MapFile.cpp.o -MF COFF/CMakeFiles/lldCOFF.dir/MapFile.cpp.o.d -o COFF/CMakeFiles/lldCOFF.dir/MapFile.cpp.o -c /builddir/build/BUILD/lld-17.0.6.src/COFF/MapFile.cpp
[37/132] /usr/bin/g++ -D__STDC_CONSTANT_MACROS -D__STDC_FORMAT_MACROS -D__STDC_LIMIT_MACROS -I/builddir/build/BUILD/lld-17.0.6.src/x86_64-OpenCloudOS-linux-gnu/ELF -I/builddir/build/BUILD/lld-17.0.6.src/ELF -I/builddir/build/BUILD/lld-17.0.6.src/include -I/builddir/build/BUILD/lld-17.0.6.src/x86_64-OpenCloudOS-linux-gnu/include -O2  -fexceptions -g -grecord-gcc-switches -pipe -Wall -Werror=format-security -Wp,-D_FORTIFY_SOURCE=2 -Wp,-D_GLIBCXX_ASSERTIONS -specs=/usr/lib/rpm/OpenCloudOS/OpenCloudOS-hardened-cc1 -fstack-protector-strong  -m64 -march=x86-64-v2 -mtune=generic -fasynchronous-unwind-tables -fstack-clash-protection -fcf-protection -fPIC -fno-semantic-interposition -fvisibility-inlines-hidden -Werror=date-time -fno-lifetime-dse -Wall -Wextra -Wno-unused-parameter -Wwrite-strings -Wcast-qual -Wno-missing-field-initializers -Wimplicit-fallthrough -Wno-nonnull -Wno-class-memaccess -Wno-redundant-move -Wno-pessimizing-move -Wno-noexcept-type -Wdelete-non-virtual-dtor -Wsuggest-override -Wno-comment -Wno-misleading-indentation -Wctad-maybe-unsupported -fdiagnostics-color -ffunction-sections -fdata-sections -O2 -g -DNDEBUG -std=c++17 -fPIC  -fno-exceptions -funwind-tables -MD -MT ELF/CMakeFiles/lldELF.dir/Arch/LoongArch.cpp.o -MF ELF/CMakeFiles/lldELF.dir/Arch/LoongArch.cpp.o.d -o ELF/CMakeFiles/lldELF.dir/Arch/LoongArch.cpp.o -c /builddir/build/BUILD/lld-17.0.6.src/ELF/Arch/LoongArch.cpp
/builddir/build/BUILD/lld-17.0.6.src/ELF/Arch/LoongArch.cpp: In member function 'virtual uint32_t {anonymous}::LoongArch::calcEFlags() const':
/builddir/build/BUILD/lld-17.0.6.src/ELF/Arch/LoongArch.cpp:304:21: warning: 'targetFile' may be used uninitialized [-Wmaybe-uninitialized]
  304 |             toString(targetFile));
      |             ~~~~~~~~^~~~~~~~~~~~
/builddir/build/BUILD/lld-17.0.6.src/ELF/Arch/LoongArch.cpp:285:20: note: 'targetFile' was declared here
  285 |   const InputFile *targetFile;
      |                    ^~~~~~~~~~
[38/132] /usr/bin/g++ -D__STDC_CONSTANT_MACROS -D__STDC_FORMAT_MACROS -D__STDC_LIMIT_MACROS -I/builddir/build/BUILD/lld-17.0.6.src/x86_64-OpenCloudOS-linux-gnu/ELF -I/builddir/build/BUILD/lld-17.0.6.src/ELF -I/builddir/build/BUILD/lld-17.0.6.src/include -I/builddir/build/BUILD/lld-17.0.6.src/x86_64-OpenCloudOS-linux-gnu/include -O2  -fexceptions -g -grecord-gcc-switches -pipe -Wall -Werror=format-security -Wp,-D_FORTIFY_SOURCE=2 -Wp,-D_GLIBCXX_ASSERTIONS -specs=/usr/lib/rpm/OpenCloudOS/OpenCloudOS-hardened-cc1 -fstack-protector-strong  -m64 -march=x86-64-v2 -mtune=generic -fasynchronous-unwind-tables -fstack-clash-protection -fcf-protection -fPIC -fno-semantic-interposition -fvisibility-inlines-hidden -Werror=date-time -fno-lifetime-dse -Wall -Wextra -Wno-unused-parameter -Wwrite-strings -Wcast-qual -Wno-missing-field-initializers -Wimplicit-fallthrough -Wno-nonnull -Wno-class-memaccess -Wno-redundant-move -Wno-pessimizing-move -Wno-noexcept-type -Wdelete-non-virtual-dtor -Wsuggest-override -Wno-comment -Wno-misleading-indentation -Wctad-maybe-unsupported -fdiagnostics-color -ffunction-sections -fdata-sections -O2 -g -DNDEBUG -std=c++17 -fPIC  -fno-exceptions -funwind-tables -MD -MT ELF/CMakeFiles/lldELF.dir/Arch/SPARCV9.cpp.o -MF ELF/CMakeFiles/lldELF.dir/Arch/SPARCV9.cpp.o.d -o ELF/CMakeFiles/lldELF.dir/Arch/SPARCV9.cpp.o -c /builddir/build/BUILD/lld-17.0.6.src/ELF/Arch/SPARCV9.cpp
[39/132] /usr/bin/g++ -D__STDC_CONSTANT_MACROS -D__STDC_FORMAT_MACROS -D__STDC_LIMIT_MACROS -I/builddir/build/BUILD/lld-17.0.6.src/x86_64-OpenCloudOS-linux-gnu/ELF -I/builddir/build/BUILD/lld-17.0.6.src/ELF -I/builddir/build/BUILD/lld-17.0.6.src/include -I/builddir/build/BUILD/lld-17.0.6.src/x86_64-OpenCloudOS-linux-gnu/include -O2  -fexceptions -g -grecord-gcc-switches -pipe -Wall -Werror=format-security -Wp,-D_FORTIFY_SOURCE=2 -Wp,-D_GLIBCXX_ASSERTIONS -specs=/usr/lib/rpm/OpenCloudOS/OpenCloudOS-hardened-cc1 -fstack-protector-strong  -m64 -march=x86-64-v2 -mtune=generic -fasynchronous-unwind-tables -fstack-clash-protection -fcf-protection -fPIC -fno-semantic-interposition -fvisibility-inlines-hidden -Werror=date-time -fno-lifetime-dse -Wall -Wextra -Wno-unused-parameter -Wwrite-strings -Wcast-qual -Wno-missing-field-initializers -Wimplicit-fallthrough -Wno-nonnull -Wno-class-memaccess -Wno-redundant-move -Wno-pessimizing-move -Wno-noexcept-type -Wdelete-non-virtual-dtor -Wsuggest-override -Wno-comment -Wno-misleading-indentation -Wctad-maybe-unsupported -fdiagnostics-color -ffunction-sections -fdata-sections -O2 -g -DNDEBUG -std=c++17 -fPIC  -fno-exceptions -funwind-tables -MD -MT ELF/CMakeFiles/lldELF.dir/EhFrame.cpp.o -MF ELF/CMakeFiles/lldELF.dir/EhFrame.cpp.o.d -o ELF/CMakeFiles/lldELF.dir/EhFrame.cpp.o -c /builddir/build/BUILD/lld-17.0.6.src/ELF/EhFrame.cpp
[40/132] /usr/bin/g++ -D__STDC_CONSTANT_MACROS -D__STDC_FORMAT_MACROS -D__STDC_LIMIT_MACROS -I/builddir/build/BUILD/lld-17.0.6.src/x86_64-OpenCloudOS-linux-gnu/ELF -I/builddir/build/BUILD/lld-17.0.6.src/ELF -I/builddir/build/BUILD/lld-17.0.6.src/include -I/builddir/build/BUILD/lld-17.0.6.src/x86_64-OpenCloudOS-linux-gnu/include -O2  -fexceptions -g -grecord-gcc-switches -pipe -Wall -Werror=format-security -Wp,-D_FORTIFY_SOURCE=2 -Wp,-D_GLIBCXX_ASSERTIONS -specs=/usr/lib/rpm/OpenCloudOS/OpenCloudOS-hardened-cc1 -fstack-protector-strong  -m64 -march=x86-64-v2 -mtune=generic -fasynchronous-unwind-tables -fstack-clash-protection -fcf-protection -fPIC -fno-semantic-interposition -fvisibility-inlines-hidden -Werror=date-time -fno-lifetime-dse -Wall -Wextra -Wno-unused-parameter -Wwrite-strings -Wcast-qual -Wno-missing-field-initializers -Wimplicit-fallthrough -Wno-nonnull -Wno-class-memaccess -Wno-redundant-move -Wno-pessimizing-move -Wno-noexcept-type -Wdelete-non-virtual-dtor -Wsuggest-override -Wno-comment -Wno-misleading-indentation -Wctad-maybe-unsupported -fdiagnostics-color -ffunction-sections -fdata-sections -O2 -g -DNDEBUG -std=c++17 -fPIC  -fno-exceptions -funwind-tables -MD -MT ELF/CMakeFiles/lldELF.dir/DriverUtils.cpp.o -MF ELF/CMakeFiles/lldELF.dir/DriverUtils.cpp.o.d -o ELF/CMakeFiles/lldELF.dir/DriverUtils.cpp.o -c /builddir/build/BUILD/lld-17.0.6.src/ELF/DriverUtils.cpp
[41/132] /usr/bin/g++ -D__STDC_CONSTANT_MACROS -D__STDC_FORMAT_MACROS -D__STDC_LIMIT_MACROS -I/builddir/build/BUILD/lld-17.0.6.src/x86_64-OpenCloudOS-linux-gnu/COFF -I/builddir/build/BUILD/lld-17.0.6.src/COFF -I/builddir/build/BUILD/lld-17.0.6.src/include -I/builddir/build/BUILD/lld-17.0.6.src/x86_64-OpenCloudOS-linux-gnu/include -O2  -fexceptions -g -grecord-gcc-switches -pipe -Wall -Werror=format-security -Wp,-D_FORTIFY_SOURCE=2 -Wp,-D_GLIBCXX_ASSERTIONS -specs=/usr/lib/rpm/OpenCloudOS/OpenCloudOS-hardened-cc1 -fstack-protector-strong  -m64 -march=x86-64-v2 -mtune=generic -fasynchronous-unwind-tables -fstack-clash-protection -fcf-protection -fPIC -fno-semantic-interposition -fvisibility-inlines-hidden -Werror=date-time -fno-lifetime-dse -Wall -Wextra -Wno-unused-parameter -Wwrite-strings -Wcast-qual -Wno-missing-field-initializers -Wimplicit-fallthrough -Wno-nonnull -Wno-class-memaccess -Wno-redundant-move -Wno-pessimizing-move -Wno-noexcept-type -Wdelete-non-virtual-dtor -Wsuggest-override -Wno-comment -Wno-misleading-indentation -Wctad-maybe-unsupported -fdiagnostics-color -ffunction-sections -fdata-sections -O2 -g -DNDEBUG -std=c++17 -fPIC  -fno-exceptions -funwind-tables -MD -MT COFF/CMakeFiles/lldCOFF.dir/DLL.cpp.o -MF COFF/CMakeFiles/lldCOFF.dir/DLL.cpp.o.d -o COFF/CMakeFiles/lldCOFF.dir/DLL.cpp.o -c /builddir/build/BUILD/lld-17.0.6.src/COFF/DLL.cpp
[42/132] /usr/bin/g++ -D__STDC_CONSTANT_MACROS -D__STDC_FORMAT_MACROS -D__STDC_LIMIT_MACROS -I/builddir/build/BUILD/lld-17.0.6.src/x86_64-OpenCloudOS-linux-gnu/ELF -I/builddir/build/BUILD/lld-17.0.6.src/ELF -I/builddir/build/BUILD/lld-17.0.6.src/include -I/builddir/build/BUILD/lld-17.0.6.src/x86_64-OpenCloudOS-linux-gnu/include -O2  -fexceptions -g -grecord-gcc-switches -pipe -Wall -Werror=format-security -Wp,-D_FORTIFY_SOURCE=2 -Wp,-D_GLIBCXX_ASSERTIONS -specs=/usr/lib/rpm/OpenCloudOS/OpenCloudOS-hardened-cc1 -fstack-protector-strong  -m64 -march=x86-64-v2 -mtune=generic -fasynchronous-unwind-tables -fstack-clash-protection -fcf-protection -fPIC -fno-semantic-interposition -fvisibility-inlines-hidden -Werror=date-time -fno-lifetime-dse -Wall -Wextra -Wno-unused-parameter -Wwrite-strings -Wcast-qual -Wno-missing-field-initializers -Wimplicit-fallthrough -Wno-nonnull -Wno-class-memaccess -Wno-redundant-move -Wno-pessimizing-move -Wno-noexcept-type -Wdelete-non-virtual-dtor -Wsuggest-override -Wno-comment -Wno-misleading-indentation -Wctad-maybe-unsupported -fdiagnostics-color -ffunction-sections -fdata-sections -O2 -g -DNDEBUG -std=c++17 -fPIC  -fno-exceptions -funwind-tables -MD -MT ELF/CMakeFiles/lldELF.dir/Arch/Mips.cpp.o -MF ELF/CMakeFiles/lldELF.dir/Arch/Mips.cpp.o.d -o ELF/CMakeFiles/lldELF.dir/Arch/Mips.cpp.o -c /builddir/build/BUILD/lld-17.0.6.src/ELF/Arch/Mips.cpp
[43/132] /usr/bin/g++ -D__STDC_CONSTANT_MACROS -D__STDC_FORMAT_MACROS -D__STDC_LIMIT_MACROS -I/builddir/build/BUILD/lld-17.0.6.src/x86_64-OpenCloudOS-linux-gnu/ELF -I/builddir/build/BUILD/lld-17.0.6.src/ELF -I/builddir/build/BUILD/lld-17.0.6.src/include -I/builddir/build/BUILD/lld-17.0.6.src/x86_64-OpenCloudOS-linux-gnu/include -O2  -fexceptions -g -grecord-gcc-switches -pipe -Wall -Werror=format-security -Wp,-D_FORTIFY_SOURCE=2 -Wp,-D_GLIBCXX_ASSERTIONS -specs=/usr/lib/rpm/OpenCloudOS/OpenCloudOS-hardened-cc1 -fstack-protector-strong  -m64 -march=x86-64-v2 -mtune=generic -fasynchronous-unwind-tables -fstack-clash-protection -fcf-protection -fPIC -fno-semantic-interposition -fvisibility-inlines-hidden -Werror=date-time -fno-lifetime-dse -Wall -Wextra -Wno-unused-parameter -Wwrite-strings -Wcast-qual -Wno-missing-field-initializers -Wimplicit-fallthrough -Wno-nonnull -Wno-class-memaccess -Wno-redundant-move -Wno-pessimizing-move -Wno-noexcept-type -Wdelete-non-virtual-dtor -Wsuggest-override -Wno-comment -Wno-misleading-indentation -Wctad-maybe-unsupported -fdiagnostics-color -ffunction-sections -fdata-sections -O2 -g -DNDEBUG -std=c++17 -fPIC  -fno-exceptions -funwind-tables -MD -MT ELF/CMakeFiles/lldELF.dir/CallGraphSort.cpp.o -MF ELF/CMakeFiles/lldELF.dir/CallGraphSort.cpp.o.d -o ELF/CMakeFiles/lldELF.dir/CallGraphSort.cpp.o -c /builddir/build/BUILD/lld-17.0.6.src/ELF/CallGraphSort.cpp
[44/132] /usr/bin/g++ -D__STDC_CONSTANT_MACROS -D__STDC_FORMAT_MACROS -D__STDC_LIMIT_MACROS -I/builddir/build/BUILD/lld-17.0.6.src/x86_64-OpenCloudOS-linux-gnu/ELF -I/builddir/build/BUILD/lld-17.0.6.src/ELF -I/builddir/build/BUILD/lld-17.0.6.src/include -I/builddir/build/BUILD/lld-17.0.6.src/x86_64-OpenCloudOS-linux-gnu/include -O2  -fexceptions -g -grecord-gcc-switches -pipe -Wall -Werror=format-security -Wp,-D_FORTIFY_SOURCE=2 -Wp,-D_GLIBCXX_ASSERTIONS -specs=/usr/lib/rpm/OpenCloudOS/OpenCloudOS-hardened-cc1 -fstack-protector-strong  -m64 -march=x86-64-v2 -mtune=generic -fasynchronous-unwind-tables -fstack-clash-protection -fcf-protection -fPIC -fno-semantic-interposition -fvisibility-inlines-hidden -Werror=date-time -fno-lifetime-dse -Wall -Wextra -Wno-unused-parameter -Wwrite-strings -Wcast-qual -Wno-missing-field-initializers -Wimplicit-fallthrough -Wno-nonnull -Wno-class-memaccess -Wno-redundant-move -Wno-pessimizing-move -Wno-noexcept-type -Wdelete-non-virtual-dtor -Wsuggest-override -Wno-comment -Wno-misleading-indentation -Wctad-maybe-unsupported -fdiagnostics-color -ffunction-sections -fdata-sections -O2 -g -DNDEBUG -std=c++17 -fPIC  -fno-exceptions -funwind-tables -MD -MT ELF/CMakeFiles/lldELF.dir/Arch/X86.cpp.o -MF ELF/CMakeFiles/lldELF.dir/Arch/X86.cpp.o.d -o ELF/CMakeFiles/lldELF.dir/Arch/X86.cpp.o -c /builddir/build/BUILD/lld-17.0.6.src/ELF/Arch/X86.cpp
[45/132] /usr/bin/g++ -D__STDC_CONSTANT_MACROS -D__STDC_FORMAT_MACROS -D__STDC_LIMIT_MACROS -I/builddir/build/BUILD/lld-17.0.6.src/x86_64-OpenCloudOS-linux-gnu/ELF -I/builddir/build/BUILD/lld-17.0.6.src/ELF -I/builddir/build/BUILD/lld-17.0.6.src/include -I/builddir/build/BUILD/lld-17.0.6.src/x86_64-OpenCloudOS-linux-gnu/include -O2  -fexceptions -g -grecord-gcc-switches -pipe -Wall -Werror=format-security -Wp,-D_FORTIFY_SOURCE=2 -Wp,-D_GLIBCXX_ASSERTIONS -specs=/usr/lib/rpm/OpenCloudOS/OpenCloudOS-hardened-cc1 -fstack-protector-strong  -m64 -march=x86-64-v2 -mtune=generic -fasynchronous-unwind-tables -fstack-clash-protection -fcf-protection -fPIC -fno-semantic-interposition -fvisibility-inlines-hidden -Werror=date-time -fno-lifetime-dse -Wall -Wextra -Wno-unused-parameter -Wwrite-strings -Wcast-qual -Wno-missing-field-initializers -Wimplicit-fallthrough -Wno-nonnull -Wno-class-memaccess -Wno-redundant-move -Wno-pessimizing-move -Wno-noexcept-type -Wdelete-non-virtual-dtor -Wsuggest-override -Wno-comment -Wno-misleading-indentation -Wctad-maybe-unsupported -fdiagnostics-color -ffunction-sections -fdata-sections -O2 -g -DNDEBUG -std=c++17 -fPIC  -fno-exceptions -funwind-tables -MD -MT ELF/CMakeFiles/lldELF.dir/Arch/PPC64.cpp.o -MF ELF/CMakeFiles/lldELF.dir/Arch/PPC64.cpp.o.d -o ELF/CMakeFiles/lldELF.dir/Arch/PPC64.cpp.o -c /builddir/build/BUILD/lld-17.0.6.src/ELF/Arch/PPC64.cpp
/builddir/build/BUILD/lld-17.0.6.src/ELF/Arch/PPC64.cpp: In function 'void writeSequence(llvm::MutableArrayRef<unsigned int>, const char*, int, uint32_t, llvm::ArrayRef<unsigned int>)':
/builddir/build/BUILD/lld-17.0.6.src/ELF/Arch/PPC64.cpp:290:34: warning: 'first' may be used uninitialized [-Wmaybe-uninitialized]
  290 |                4 * (buf.size() - first)),
      |                                  ^~~~~
/builddir/build/BUILD/lld-17.0.6.src/ELF/Arch/PPC64.cpp:271:7: note: 'first' was declared here
  271 |   int first;
      |       ^~~~~
[46/132] /usr/bin/g++ -D__STDC_CONSTANT_MACROS -D__STDC_FORMAT_MACROS -D__STDC_LIMIT_MACROS -I/builddir/build/BUILD/lld-17.0.6.src/x86_64-OpenCloudOS-linux-gnu/ELF -I/builddir/build/BUILD/lld-17.0.6.src/ELF -I/builddir/build/BUILD/lld-17.0.6.src/include -I/builddir/build/BUILD/lld-17.0.6.src/x86_64-OpenCloudOS-linux-gnu/include -O2  -fexceptions -g -grecord-gcc-switches -pipe -Wall -Werror=format-security -Wp,-D_FORTIFY_SOURCE=2 -Wp,-D_GLIBCXX_ASSERTIONS -specs=/usr/lib/rpm/OpenCloudOS/OpenCloudOS-hardened-cc1 -fstack-protector-strong  -m64 -march=x86-64-v2 -mtune=generic -fasynchronous-unwind-tables -fstack-clash-protection -fcf-protection -fPIC -fno-semantic-interposition -fvisibility-inlines-hidden -Werror=date-time -fno-lifetime-dse -Wall -Wextra -Wno-unused-parameter -Wwrite-strings -Wcast-qual -Wno-missing-field-initializers -Wimplicit-fallthrough -Wno-nonnull -Wno-class-memaccess -Wno-redundant-move -Wno-pessimizing-move -Wno-noexcept-type -Wdelete-non-virtual-dtor -Wsuggest-override -Wno-comment -Wno-misleading-indentation -Wctad-maybe-unsupported -fdiagnostics-color -ffunction-sections -fdata-sections -O2 -g -DNDEBUG -std=c++17 -fPIC  -fno-exceptions -funwind-tables -MD -MT ELF/CMakeFiles/lldELF.dir/Arch/X86_64.cpp.o -MF ELF/CMakeFiles/lldELF.dir/Arch/X86_64.cpp.o.d -o ELF/CMakeFiles/lldELF.dir/Arch/X86_64.cpp.o -c /builddir/build/BUILD/lld-17.0.6.src/ELF/Arch/X86_64.cpp
[47/132] /usr/bin/g++ -D__STDC_CONSTANT_MACROS -D__STDC_FORMAT_MACROS -D__STDC_LIMIT_MACROS -I/builddir/build/BUILD/lld-17.0.6.src/x86_64-OpenCloudOS-linux-gnu/COFF -I/builddir/build/BUILD/lld-17.0.6.src/COFF -I/builddir/build/BUILD/lld-17.0.6.src/include -I/builddir/build/BUILD/lld-17.0.6.src/x86_64-OpenCloudOS-linux-gnu/include -O2  -fexceptions -g -grecord-gcc-switches -pipe -Wall -Werror=format-security -Wp,-D_FORTIFY_SOURCE=2 -Wp,-D_GLIBCXX_ASSERTIONS -specs=/usr/lib/rpm/OpenCloudOS/OpenCloudOS-hardened-cc1 -fstack-protector-strong  -m64 -march=x86-64-v2 -mtune=generic -fasynchronous-unwind-tables -fstack-clash-protection -fcf-protection -fPIC -fno-semantic-interposition -fvisibility-inlines-hidden -Werror=date-time -fno-lifetime-dse -Wall -Wextra -Wno-unused-parameter -Wwrite-strings -Wcast-qual -Wno-missing-field-initializers -Wimplicit-fallthrough -Wno-nonnull -Wno-class-memaccess -Wno-redundant-move -Wno-pessimizing-move -Wno-noexcept-type -Wdelete-non-virtual-dtor -Wsuggest-override -Wno-comment -Wno-misleading-indentation -Wctad-maybe-unsupported -fdiagnostics-color -ffunction-sections -fdata-sections -O2 -g -DNDEBUG -std=c++17 -fPIC  -fno-exceptions -funwind-tables -MD -MT COFF/CMakeFiles/lldCOFF.dir/DriverUtils.cpp.o -MF COFF/CMakeFiles/lldCOFF.dir/DriverUtils.cpp.o.d -o COFF/CMakeFiles/lldCOFF.dir/DriverUtils.cpp.o -c /builddir/build/BUILD/lld-17.0.6.src/COFF/DriverUtils.cpp
[48/132] /usr/bin/g++ -D__STDC_CONSTANT_MACROS -D__STDC_FORMAT_MACROS -D__STDC_LIMIT_MACROS -I/builddir/build/BUILD/lld-17.0.6.src/x86_64-OpenCloudOS-linux-gnu/ELF -I/builddir/build/BUILD/lld-17.0.6.src/ELF -I/builddir/build/BUILD/lld-17.0.6.src/include -I/builddir/build/BUILD/lld-17.0.6.src/x86_64-OpenCloudOS-linux-gnu/include -O2  -fexceptions -g -grecord-gcc-switches -pipe -Wall -Werror=format-security -Wp,-D_FORTIFY_SOURCE=2 -Wp,-D_GLIBCXX_ASSERTIONS -specs=/usr/lib/rpm/OpenCloudOS/OpenCloudOS-hardened-cc1 -fstack-protector-strong  -m64 -march=x86-64-v2 -mtune=generic -fasynchronous-unwind-tables -fstack-clash-protection -fcf-protection -fPIC -fno-semantic-interposition -fvisibility-inlines-hidden -Werror=date-time -fno-lifetime-dse -Wall -Wextra -Wno-unused-parameter -Wwrite-strings -Wcast-qual -Wno-missing-field-initializers -Wimplicit-fallthrough -Wno-nonnull -Wno-class-memaccess -Wno-redundant-move -Wno-pessimizing-move -Wno-noexcept-type -Wdelete-non-virtual-dtor -Wsuggest-override -Wno-comment -Wno-misleading-indentation -Wctad-maybe-unsupported -fdiagnostics-color -ffunction-sections -fdata-sections -O2 -g -DNDEBUG -std=c++17 -fPIC  -fno-exceptions -funwind-tables -MD -MT ELF/CMakeFiles/lldELF.dir/ScriptLexer.cpp.o -MF ELF/CMakeFiles/lldELF.dir/ScriptLexer.cpp.o.d -o ELF/CMakeFiles/lldELF.dir/ScriptLexer.cpp.o -c /builddir/build/BUILD/lld-17.0.6.src/ELF/ScriptLexer.cpp
[49/132] /usr/bin/g++ -D__STDC_CONSTANT_MACROS -D__STDC_FORMAT_MACROS -D__STDC_LIMIT_MACROS -I/builddir/build/BUILD/lld-17.0.6.src/x86_64-OpenCloudOS-linux-gnu/Common -I/builddir/build/BUILD/lld-17.0.6.src/Common -I/builddir/build/BUILD/lld-17.0.6.src/include -I/builddir/build/BUILD/lld-17.0.6.src/x86_64-OpenCloudOS-linux-gnu/include -O2  -fexceptions -g -grecord-gcc-switches -pipe -Wall -Werror=format-security -Wp,-D_FORTIFY_SOURCE=2 -Wp,-D_GLIBCXX_ASSERTIONS -specs=/usr/lib/rpm/OpenCloudOS/OpenCloudOS-hardened-cc1 -fstack-protector-strong  -m64 -march=x86-64-v2 -mtune=generic -fasynchronous-unwind-tables -fstack-clash-protection -fcf-protection -fPIC -fno-semantic-interposition -fvisibility-inlines-hidden -Werror=date-time -fno-lifetime-dse -Wall -Wextra -Wno-unused-parameter -Wwrite-strings -Wcast-qual -Wno-missing-field-initializers -Wimplicit-fallthrough -Wno-nonnull -Wno-class-memaccess -Wno-redundant-move -Wno-pessimizing-move -Wno-noexcept-type -Wdelete-non-virtual-dtor -Wsuggest-override -Wno-comment -Wno-misleading-indentation -Wctad-maybe-unsupported -fdiagnostics-color -ffunction-sections -fdata-sections -O2 -g -DNDEBUG -std=c++17 -fPIC  -fno-exceptions -funwind-tables -MD -MT Common/CMakeFiles/lldCommon.dir/ErrorHandler.cpp.o -MF Common/CMakeFiles/lldCommon.dir/ErrorHandler.cpp.o.d -o Common/CMakeFiles/lldCommon.dir/ErrorHandler.cpp.o -c /builddir/build/BUILD/lld-17.0.6.src/Common/ErrorHandler.cpp
[50/132] /usr/bin/g++ -D__STDC_CONSTANT_MACROS -D__STDC_FORMAT_MACROS -D__STDC_LIMIT_MACROS -I/builddir/build/BUILD/lld-17.0.6.src/x86_64-OpenCloudOS-linux-gnu/ELF -I/builddir/build/BUILD/lld-17.0.6.src/ELF -I/builddir/build/BUILD/lld-17.0.6.src/include -I/builddir/build/BUILD/lld-17.0.6.src/x86_64-OpenCloudOS-linux-gnu/include -O2  -fexceptions -g -grecord-gcc-switches -pipe -Wall -Werror=format-security -Wp,-D_FORTIFY_SOURCE=2 -Wp,-D_GLIBCXX_ASSERTIONS -specs=/usr/lib/rpm/OpenCloudOS/OpenCloudOS-hardened-cc1 -fstack-protector-strong  -m64 -march=x86-64-v2 -mtune=generic -fasynchronous-unwind-tables -fstack-clash-protection -fcf-protection -fPIC -fno-semantic-interposition -fvisibility-inlines-hidden -Werror=date-time -fno-lifetime-dse -Wall -Wextra -Wno-unused-parameter -Wwrite-strings -Wcast-qual -Wno-missing-field-initializers -Wimplicit-fallthrough -Wno-nonnull -Wno-class-memaccess -Wno-redundant-move -Wno-pessimizing-move -Wno-noexcept-type -Wdelete-non-virtual-dtor -Wsuggest-override -Wno-comment -Wno-misleading-indentation -Wctad-maybe-unsupported -fdiagnostics-color -ffunction-sections -fdata-sections -O2 -g -DNDEBUG -std=c++17 -fPIC  -fno-exceptions -funwind-tables -MD -MT ELF/CMakeFiles/lldELF.dir/ARMErrataFix.cpp.o -MF ELF/CMakeFiles/lldELF.dir/ARMErrataFix.cpp.o.d -o ELF/CMakeFiles/lldELF.dir/ARMErrataFix.cpp.o -c /builddir/build/BUILD/lld-17.0.6.src/ELF/ARMErrataFix.cpp
/builddir/build/BUILD/lld-17.0.6.src/ELF/ARMErrataFix.cpp: In member function 'void lld::elf::ARMErr657417Patcher::insertPatches(lld::elf::InputSectionDescription&, std::vector<lld::elf::Patch657417Section*>&)':
/builddir/build/BUILD/lld-17.0.6.src/ELF/ARMErrataFix.cpp:390:27: warning: 'isecLimit' may be used uninitialized [-Wmaybe-uninitialized]
  390 |     (*patchIt)->outSecOff = isecLimit;
      |     ~~~~~~~~~~~~~~~~~~~~~~^~~~~~~~~~~
/builddir/build/BUILD/lld-17.0.6.src/ELF/ARMErrataFix.cpp:366:12: note: 'isecLimit' was declared here
  366 |   uint64_t isecLimit;
      |            ^~~~~~~~~
[51/132] /usr/bin/g++ -D__STDC_CONSTANT_MACROS -D__STDC_FORMAT_MACROS -D__STDC_LIMIT_MACROS -I/builddir/build/BUILD/lld-17.0.6.src/x86_64-OpenCloudOS-linux-gnu/ELF -I/builddir/build/BUILD/lld-17.0.6.src/ELF -I/builddir/build/BUILD/lld-17.0.6.src/include -I/builddir/build/BUILD/lld-17.0.6.src/x86_64-OpenCloudOS-linux-gnu/include -O2  -fexceptions -g -grecord-gcc-switches -pipe -Wall -Werror=format-security -Wp,-D_FORTIFY_SOURCE=2 -Wp,-D_GLIBCXX_ASSERTIONS -specs=/usr/lib/rpm/OpenCloudOS/OpenCloudOS-hardened-cc1 -fstack-protector-strong  -m64 -march=x86-64-v2 -mtune=generic -fasynchronous-unwind-tables -fstack-clash-protection -fcf-protection -fPIC -fno-semantic-interposition -fvisibility-inlines-hidden -Werror=date-time -fno-lifetime-dse -Wall -Wextra -Wno-unused-parameter -Wwrite-strings -Wcast-qual -Wno-missing-field-initializers -Wimplicit-fallthrough -Wno-nonnull -Wno-class-memaccess -Wno-redundant-move -Wno-pessimizing-move -Wno-noexcept-type -Wdelete-non-virtual-dtor -Wsuggest-override -Wno-comment -Wno-misleading-indentation -Wctad-maybe-unsupported -fdiagnostics-color -ffunction-sections -fdata-sections -O2 -g -DNDEBUG -std=c++17 -fPIC  -fno-exceptions -funwind-tables -MD -MT ELF/CMakeFiles/lldELF.dir/DWARF.cpp.o -MF ELF/CMakeFiles/lldELF.dir/DWARF.cpp.o.d -o ELF/CMakeFiles/lldELF.dir/DWARF.cpp.o -c /builddir/build/BUILD/lld-17.0.6.src/ELF/DWARF.cpp
[52/132] /usr/bin/g++ -D__STDC_CONSTANT_MACROS -D__STDC_FORMAT_MACROS -D__STDC_LIMIT_MACROS -I/builddir/build/BUILD/lld-17.0.6.src/x86_64-OpenCloudOS-linux-gnu/COFF -I/builddir/build/BUILD/lld-17.0.6.src/COFF -I/builddir/build/BUILD/lld-17.0.6.src/include -I/builddir/build/BUILD/lld-17.0.6.src/x86_64-OpenCloudOS-linux-gnu/include -O2  -fexceptions -g -grecord-gcc-switches -pipe -Wall -Werror=format-security -Wp,-D_FORTIFY_SOURCE=2 -Wp,-D_GLIBCXX_ASSERTIONS -specs=/usr/lib/rpm/OpenCloudOS/OpenCloudOS-hardened-cc1 -fstack-protector-strong  -m64 -march=x86-64-v2 -mtune=generic -fasynchronous-unwind-tables -fstack-clash-protection -fcf-protection -fPIC -fno-semantic-interposition -fvisibility-inlines-hidden -Werror=date-time -fno-lifetime-dse -Wall -Wextra -Wno-unused-parameter -Wwrite-strings -Wcast-qual -Wno-missing-field-initializers -Wimplicit-fallthrough -Wno-nonnull -Wno-class-memaccess -Wno-redundant-move -Wno-pessimizing-move -Wno-noexcept-type -Wdelete-non-virtual-dtor -Wsuggest-override -Wno-comment -Wno-misleading-indentation -Wctad-maybe-unsupported -fdiagnostics-color -ffunction-sections -fdata-sections -O2 -g -DNDEBUG -std=c++17 -fPIC  -fno-exceptions -funwind-tables -MD -MT COFF/CMakeFiles/lldCOFF.dir/DebugTypes.cpp.o -MF COFF/CMakeFiles/lldCOFF.dir/DebugTypes.cpp.o.d -o COFF/CMakeFiles/lldCOFF.dir/DebugTypes.cpp.o -c /builddir/build/BUILD/lld-17.0.6.src/COFF/DebugTypes.cpp
In file included from /usr/include/llvm/Support/Chrono.h:13,
                 from /usr/include/llvm/Support/VirtualFileSystem.h:21,
                 from /builddir/build/BUILD/lld-17.0.6.src/COFF/Config.h:19,
                 from /builddir/build/BUILD/lld-17.0.6.src/COFF/Chunks.h:12,
                 from /builddir/build/BUILD/lld-17.0.6.src/COFF/COFFLinkerContext.h:12,
                 from /builddir/build/BUILD/lld-17.0.6.src/COFF/DebugTypes.cpp:10:
In static member function 'static size_t llvm::detail::HelperFunctions::consumeNumHexDigits(llvm::StringRef&, llvm::HexPrintStyle, size_t)',
    inlined from 'static void llvm::format_provider<T, typename std::enable_if<llvm::detail::use_integral_formatter<T>::value, void>::type>::format(const T&, llvm::raw_ostream&, llvm::StringRef) [with T = long unsigned int]' at /usr/include/llvm/Support/FormatProviders.h:136:35:
/usr/include/llvm/Support/FormatProviders.h:96:27: warning: 'HS' may be used uninitialized [-Wmaybe-uninitialized]
   96 |     if (isPrefixedHexStyle(Style))
      |         ~~~~~~~~~~~~~~~~~~^~~~~~~
/usr/include/llvm/Support/FormatProviders.h: In static member function 'static void llvm::format_provider<T, typename std::enable_if<llvm::detail::use_integral_formatter<T>::value, void>::type>::format(const T&, llvm::raw_ostream&, llvm::StringRef) [with T = long unsigned int]':
/usr/include/llvm/Support/FormatProviders.h:133:19: note: 'HS' was declared here
  133 |     HexPrintStyle HS;
      |                   ^~
[53/132] : && /usr/bin/g++ -fPIC -O2  -fexceptions -g -grecord-gcc-switches -pipe -Wall -Werror=format-security -Wp,-D_FORTIFY_SOURCE=2 -Wp,-D_GLIBCXX_ASSERTIONS -specs=/usr/lib/rpm/OpenCloudOS/OpenCloudOS-hardened-cc1 -fstack-protector-strong  -m64 -march=x86-64-v2 -mtune=generic -fasynchronous-unwind-tables -fstack-clash-protection -fcf-protection -fPIC -fno-semantic-interposition -fvisibility-inlines-hidden -Werror=date-time -fno-lifetime-dse -Wall -Wextra -Wno-unused-parameter -Wwrite-strings -Wcast-qual -Wno-missing-field-initializers -Wimplicit-fallthrough -Wno-nonnull -Wno-class-memaccess -Wno-redundant-move -Wno-pessimizing-move -Wno-noexcept-type -Wdelete-non-virtual-dtor -Wsuggest-override -Wno-comment -Wno-misleading-indentation -Wctad-maybe-unsupported -fdiagnostics-color -ffunction-sections -fdata-sections -O2 -g -DNDEBUG  -Wl,-z,relro -Wl,--as-needed  -Wl,-z,now -specs=/usr/lib/rpm/OpenCloudOS/OpenCloudOS-hardened-ld  -Wl,--build-id=sha1 -Wl,-z,defs -Wl,-z,nodelete   -Wl,-rpath-link,/builddir/build/BUILD/lld-17.0.6.src/x86_64-OpenCloudOS-linux-gnu/./lib64  -Wl,--gc-sections -shared -Wl,-soname,liblldCommon.so.17 -o lib64/liblldCommon.so.17 Common/CMakeFiles/lldCommon.dir/Args.cpp.o Common/CMakeFiles/lldCommon.dir/CommonLinkerContext.cpp.o Common/CMakeFiles/lldCommon.dir/DriverDispatcher.cpp.o Common/CMakeFiles/lldCommon.dir/DWARF.cpp.o Common/CMakeFiles/lldCommon.dir/ErrorHandler.cpp.o Common/CMakeFiles/lldCommon.dir/Filesystem.cpp.o Common/CMakeFiles/lldCommon.dir/Memory.cpp.o Common/CMakeFiles/lldCommon.dir/Reproduce.cpp.o Common/CMakeFiles/lldCommon.dir/Strings.cpp.o Common/CMakeFiles/lldCommon.dir/TargetOptionsCommandFlags.cpp.o Common/CMakeFiles/lldCommon.dir/Timer.cpp.o Common/CMakeFiles/lldCommon.dir/Version.cpp.o  /usr/lib64/libLLVM-17.so && :
[54/132] /usr/bin/cmake -E cmake_symlink_library lib64/liblldCommon.so.17 lib64/liblldCommon.so.17 lib64/liblldCommon.so && :
[55/132] /usr/bin/g++ -D__STDC_CONSTANT_MACROS -D__STDC_FORMAT_MACROS -D__STDC_LIMIT_MACROS -I/builddir/build/BUILD/lld-17.0.6.src/x86_64-OpenCloudOS-linux-gnu/ELF -I/builddir/build/BUILD/lld-17.0.6.src/ELF -I/builddir/build/BUILD/lld-17.0.6.src/include -I/builddir/build/BUILD/lld-17.0.6.src/x86_64-OpenCloudOS-linux-gnu/include -O2  -fexceptions -g -grecord-gcc-switches -pipe -Wall -Werror=format-security -Wp,-D_FORTIFY_SOURCE=2 -Wp,-D_GLIBCXX_ASSERTIONS -specs=/usr/lib/rpm/OpenCloudOS/OpenCloudOS-hardened-cc1 -fstack-protector-strong  -m64 -march=x86-64-v2 -mtune=generic -fasynchronous-unwind-tables -fstack-clash-protection -fcf-protection -fPIC -fno-semantic-interposition -fvisibility-inlines-hidden -Werror=date-time -fno-lifetime-dse -Wall -Wextra -Wno-unused-parameter -Wwrite-strings -Wcast-qual -Wno-missing-field-initializers -Wimplicit-fallthrough -Wno-nonnull -Wno-class-memaccess -Wno-redundant-move -Wno-pessimizing-move -Wno-noexcept-type -Wdelete-non-virtual-dtor -Wsuggest-override -Wno-comment -Wno-misleading-indentation -Wctad-maybe-unsupported -fdiagnostics-color -ffunction-sections -fdata-sections -O2 -g -DNDEBUG -std=c++17 -fPIC  -fno-exceptions -funwind-tables -MD -MT ELF/CMakeFiles/lldELF.dir/Arch/RISCV.cpp.o -MF ELF/CMakeFiles/lldELF.dir/Arch/RISCV.cpp.o.d -o ELF/CMakeFiles/lldELF.dir/Arch/RISCV.cpp.o -c /builddir/build/BUILD/lld-17.0.6.src/ELF/Arch/RISCV.cpp
[56/132] /usr/bin/g++ -D__STDC_CONSTANT_MACROS -D__STDC_FORMAT_MACROS -D__STDC_LIMIT_MACROS -I/builddir/build/BUILD/lld-17.0.6.src/x86_64-OpenCloudOS-linux-gnu/ELF -I/builddir/build/BUILD/lld-17.0.6.src/ELF -I/builddir/build/BUILD/lld-17.0.6.src/include -I/builddir/build/BUILD/lld-17.0.6.src/x86_64-OpenCloudOS-linux-gnu/include -O2  -fexceptions -g -grecord-gcc-switches -pipe -Wall -Werror=format-security -Wp,-D_FORTIFY_SOURCE=2 -Wp,-D_GLIBCXX_ASSERTIONS -specs=/usr/lib/rpm/OpenCloudOS/OpenCloudOS-hardened-cc1 -fstack-protector-strong  -m64 -march=x86-64-v2 -mtune=generic -fasynchronous-unwind-tables -fstack-clash-protection -fcf-protection -fPIC -fno-semantic-interposition -fvisibility-inlines-hidden -Werror=date-time -fno-lifetime-dse -Wall -Wextra -Wno-unused-parameter -Wwrite-strings -Wcast-qual -Wno-missing-field-initializers -Wimplicit-fallthrough -Wno-nonnull -Wno-class-memaccess -Wno-redundant-move -Wno-pessimizing-move -Wno-noexcept-type -Wdelete-non-virtual-dtor -Wsuggest-override -Wno-comment -Wno-misleading-indentation -Wctad-maybe-unsupported -fdiagnostics-color -ffunction-sections -fdata-sections -O2 -g -DNDEBUG -std=c++17 -fPIC  -fno-exceptions -funwind-tables -MD -MT ELF/CMakeFiles/lldELF.dir/Arch/ARM.cpp.o -MF ELF/CMakeFiles/lldELF.dir/Arch/ARM.cpp.o.d -o ELF/CMakeFiles/lldELF.dir/Arch/ARM.cpp.o -c /builddir/build/BUILD/lld-17.0.6.src/ELF/Arch/ARM.cpp
[57/132] /usr/bin/g++ -D__STDC_CONSTANT_MACROS -D__STDC_FORMAT_MACROS -D__STDC_LIMIT_MACROS -I/builddir/build/BUILD/lld-17.0.6.src/x86_64-OpenCloudOS-linux-gnu/ELF -I/builddir/build/BUILD/lld-17.0.6.src/ELF -I/builddir/build/BUILD/lld-17.0.6.src/include -I/builddir/build/BUILD/lld-17.0.6.src/x86_64-OpenCloudOS-linux-gnu/include -O2  -fexceptions -g -grecord-gcc-switches -pipe -Wall -Werror=format-security -Wp,-D_FORTIFY_SOURCE=2 -Wp,-D_GLIBCXX_ASSERTIONS -specs=/usr/lib/rpm/OpenCloudOS/OpenCloudOS-hardened-cc1 -fstack-protector-strong  -m64 -march=x86-64-v2 -mtune=generic -fasynchronous-unwind-tables -fstack-clash-protection -fcf-protection -fPIC -fno-semantic-interposition -fvisibility-inlines-hidden -Werror=date-time -fno-lifetime-dse -Wall -Wextra -Wno-unused-parameter -Wwrite-strings -Wcast-qual -Wno-missing-field-initializers -Wimplicit-fallthrough -Wno-nonnull -Wno-class-memaccess -Wno-redundant-move -Wno-pessimizing-move -Wno-noexcept-type -Wdelete-non-virtual-dtor -Wsuggest-override -Wno-comment -Wno-misleading-indentation -Wctad-maybe-unsupported -fdiagnostics-color -ffunction-sections -fdata-sections -O2 -g -DNDEBUG -std=c++17 -fPIC  -fno-exceptions -funwind-tables -MD -MT ELF/CMakeFiles/lldELF.dir/SymbolTable.cpp.o -MF ELF/CMakeFiles/lldELF.dir/SymbolTable.cpp.o.d -o ELF/CMakeFiles/lldELF.dir/SymbolTable.cpp.o -c /builddir/build/BUILD/lld-17.0.6.src/ELF/SymbolTable.cpp
[58/132] /usr/bin/g++ -D__STDC_CONSTANT_MACROS -D__STDC_FORMAT_MACROS -D__STDC_LIMIT_MACROS -I/builddir/build/BUILD/lld-17.0.6.src/x86_64-OpenCloudOS-linux-gnu/ELF -I/builddir/build/BUILD/lld-17.0.6.src/ELF -I/builddir/build/BUILD/lld-17.0.6.src/include -I/builddir/build/BUILD/lld-17.0.6.src/x86_64-OpenCloudOS-linux-gnu/include -O2  -fexceptions -g -grecord-gcc-switches -pipe -Wall -Werror=format-security -Wp,-D_FORTIFY_SOURCE=2 -Wp,-D_GLIBCXX_ASSERTIONS -specs=/usr/lib/rpm/OpenCloudOS/OpenCloudOS-hardened-cc1 -fstack-protector-strong  -m64 -march=x86-64-v2 -mtune=generic -fasynchronous-unwind-tables -fstack-clash-protection -fcf-protection -fPIC -fno-semantic-interposition -fvisibility-inlines-hidden -Werror=date-time -fno-lifetime-dse -Wall -Wextra -Wno-unused-parameter -Wwrite-strings -Wcast-qual -Wno-missing-field-initializers -Wimplicit-fallthrough -Wno-nonnull -Wno-class-memaccess -Wno-redundant-move -Wno-pessimizing-move -Wno-noexcept-type -Wdelete-non-virtual-dtor -Wsuggest-override -Wno-comment -Wno-misleading-indentation -Wctad-maybe-unsupported -fdiagnostics-color -ffunction-sections -fdata-sections -O2 -g -DNDEBUG -std=c++17 -fPIC  -fno-exceptions -funwind-tables -MD -MT ELF/CMakeFiles/lldELF.dir/MapFile.cpp.o -MF ELF/CMakeFiles/lldELF.dir/MapFile.cpp.o.d -o ELF/CMakeFiles/lldELF.dir/MapFile.cpp.o -c /builddir/build/BUILD/lld-17.0.6.src/ELF/MapFile.cpp
[59/132] /usr/bin/g++ -D__STDC_CONSTANT_MACROS -D__STDC_FORMAT_MACROS -D__STDC_LIMIT_MACROS -I/builddir/build/BUILD/lld-17.0.6.src/x86_64-OpenCloudOS-linux-gnu/ELF -I/builddir/build/BUILD/lld-17.0.6.src/ELF -I/builddir/build/BUILD/lld-17.0.6.src/include -I/builddir/build/BUILD/lld-17.0.6.src/x86_64-OpenCloudOS-linux-gnu/include -O2  -fexceptions -g -grecord-gcc-switches -pipe -Wall -Werror=format-security -Wp,-D_FORTIFY_SOURCE=2 -Wp,-D_GLIBCXX_ASSERTIONS -specs=/usr/lib/rpm/OpenCloudOS/OpenCloudOS-hardened-cc1 -fstack-protector-strong  -m64 -march=x86-64-v2 -mtune=generic -fasynchronous-unwind-tables -fstack-clash-protection -fcf-protection -fPIC -fno-semantic-interposition -fvisibility-inlines-hidden -Werror=date-time -fno-lifetime-dse -Wall -Wextra -Wno-unused-parameter -Wwrite-strings -Wcast-qual -Wno-missing-field-initializers -Wimplicit-fallthrough -Wno-nonnull -Wno-class-memaccess -Wno-redundant-move -Wno-pessimizing-move -Wno-noexcept-type -Wdelete-non-virtual-dtor -Wsuggest-override -Wno-comment -Wno-misleading-indentation -Wctad-maybe-unsupported -fdiagnostics-color -ffunction-sections -fdata-sections -O2 -g -DNDEBUG -std=c++17 -fPIC  -fno-exceptions -funwind-tables -MD -MT ELF/CMakeFiles/lldELF.dir/Target.cpp.o -MF ELF/CMakeFiles/lldELF.dir/Target.cpp.o.d -o ELF/CMakeFiles/lldELF.dir/Target.cpp.o -c /builddir/build/BUILD/lld-17.0.6.src/ELF/Target.cpp
[60/132] /usr/bin/g++ -D__STDC_CONSTANT_MACROS -D__STDC_FORMAT_MACROS -D__STDC_LIMIT_MACROS -I/builddir/build/BUILD/lld-17.0.6.src/x86_64-OpenCloudOS-linux-gnu/ELF -I/builddir/build/BUILD/lld-17.0.6.src/ELF -I/builddir/build/BUILD/lld-17.0.6.src/include -I/builddir/build/BUILD/lld-17.0.6.src/x86_64-OpenCloudOS-linux-gnu/include -O2  -fexceptions -g -grecord-gcc-switches -pipe -Wall -Werror=format-security -Wp,-D_FORTIFY_SOURCE=2 -Wp,-D_GLIBCXX_ASSERTIONS -specs=/usr/lib/rpm/OpenCloudOS/OpenCloudOS-hardened-cc1 -fstack-protector-strong  -m64 -march=x86-64-v2 -mtune=generic -fasynchronous-unwind-tables -fstack-clash-protection -fcf-protection -fPIC -fno-semantic-interposition -fvisibility-inlines-hidden -Werror=date-time -fno-lifetime-dse -Wall -Wextra -Wno-unused-parameter -Wwrite-strings -Wcast-qual -Wno-missing-field-initializers -Wimplicit-fallthrough -Wno-nonnull -Wno-class-memaccess -Wno-redundant-move -Wno-pessimizing-move -Wno-noexcept-type -Wdelete-non-virtual-dtor -Wsuggest-override -Wno-comment -Wno-misleading-indentation -Wctad-maybe-unsupported -fdiagnostics-color -ffunction-sections -fdata-sections -O2 -g -DNDEBUG -std=c++17 -fPIC  -fno-exceptions -funwind-tables -MD -MT ELF/CMakeFiles/lldELF.dir/MarkLive.cpp.o -MF ELF/CMakeFiles/lldELF.dir/MarkLive.cpp.o.d -o ELF/CMakeFiles/lldELF.dir/MarkLive.cpp.o -c /builddir/build/BUILD/lld-17.0.6.src/ELF/MarkLive.cpp
[61/132] /usr/bin/g++ -D__STDC_CONSTANT_MACROS -D__STDC_FORMAT_MACROS -D__STDC_LIMIT_MACROS -I/builddir/build/BUILD/lld-17.0.6.src/x86_64-OpenCloudOS-linux-gnu/ELF -I/builddir/build/BUILD/lld-17.0.6.src/ELF -I/builddir/build/BUILD/lld-17.0.6.src/include -I/builddir/build/BUILD/lld-17.0.6.src/x86_64-OpenCloudOS-linux-gnu/include -O2  -fexceptions -g -grecord-gcc-switches -pipe -Wall -Werror=format-security -Wp,-D_FORTIFY_SOURCE=2 -Wp,-D_GLIBCXX_ASSERTIONS -specs=/usr/lib/rpm/OpenCloudOS/OpenCloudOS-hardened-cc1 -fstack-protector-strong  -m64 -march=x86-64-v2 -mtune=generic -fasynchronous-unwind-tables -fstack-clash-protection -fcf-protection -fPIC -fno-semantic-interposition -fvisibility-inlines-hidden -Werror=date-time -fno-lifetime-dse -Wall -Wextra -Wno-unused-parameter -Wwrite-strings -Wcast-qual -Wno-missing-field-initializers -Wimplicit-fallthrough -Wno-nonnull -Wno-class-memaccess -Wno-redundant-move -Wno-pessimizing-move -Wno-noexcept-type -Wdelete-non-virtual-dtor -Wsuggest-override -Wno-comment -Wno-misleading-indentation -Wctad-maybe-unsupported -fdiagnostics-color -ffunction-sections -fdata-sections -O2 -g -DNDEBUG -std=c++17 -fPIC  -fno-exceptions -funwind-tables -MD -MT ELF/CMakeFiles/lldELF.dir/ICF.cpp.o -MF ELF/CMakeFiles/lldELF.dir/ICF.cpp.o.d -o ELF/CMakeFiles/lldELF.dir/ICF.cpp.o -c /builddir/build/BUILD/lld-17.0.6.src/ELF/ICF.cpp
[62/132] /usr/bin/g++ -D__STDC_CONSTANT_MACROS -D__STDC_FORMAT_MACROS -D__STDC_LIMIT_MACROS -I/builddir/build/BUILD/lld-17.0.6.src/x86_64-OpenCloudOS-linux-gnu/COFF -I/builddir/build/BUILD/lld-17.0.6.src/COFF -I/builddir/build/BUILD/lld-17.0.6.src/include -I/builddir/build/BUILD/lld-17.0.6.src/x86_64-OpenCloudOS-linux-gnu/include -O2  -fexceptions -g -grecord-gcc-switches -pipe -Wall -Werror=format-security -Wp,-D_FORTIFY_SOURCE=2 -Wp,-D_GLIBCXX_ASSERTIONS -specs=/usr/lib/rpm/OpenCloudOS/OpenCloudOS-hardened-cc1 -fstack-protector-strong  -m64 -march=x86-64-v2 -mtune=generic -fasynchronous-unwind-tables -fstack-clash-protection -fcf-protection -fPIC -fno-semantic-interposition -fvisibility-inlines-hidden -Werror=date-time -fno-lifetime-dse -Wall -Wextra -Wno-unused-parameter -Wwrite-strings -Wcast-qual -Wno-missing-field-initializers -Wimplicit-fallthrough -Wno-nonnull -Wno-class-memaccess -Wno-redundant-move -Wno-pessimizing-move -Wno-noexcept-type -Wdelete-non-virtual-dtor -Wsuggest-override -Wno-comment -Wno-misleading-indentation -Wctad-maybe-unsupported -fdiagnostics-color -ffunction-sections -fdata-sections -O2 -g -DNDEBUG -std=c++17 -fPIC  -fno-exceptions -funwind-tables -MD -MT COFF/CMakeFiles/lldCOFF.dir/PDB.cpp.o -MF COFF/CMakeFiles/lldCOFF.dir/PDB.cpp.o.d -o COFF/CMakeFiles/lldCOFF.dir/PDB.cpp.o -c /builddir/build/BUILD/lld-17.0.6.src/COFF/PDB.cpp
/builddir/build/BUILD/lld-17.0.6.src/COFF/PDB.cpp: In function 'std::optional<std::pair<llvm::StringRef, unsigned int> > lld::coff::getFileLineCodeView(const SectionChunk*, uint32_t)':
/builddir/build/BUILD/lld-17.0.6.src/COFF/PDB.cpp:1822:7: warning: 'offsetInLinetable' may be used uninitialized [-Wmaybe-uninitialized]
 1822 |       if (ln.Offset > offsetInLinetable) {
      |       ^~
/builddir/build/BUILD/lld-17.0.6.src/COFF/PDB.cpp:1812:12: note: 'offsetInLinetable' was declared here
 1812 |   uint32_t offsetInLinetable;
      |            ^~~~~~~~~~~~~~~~~
[63/132] /usr/bin/g++ -D__STDC_CONSTANT_MACROS -D__STDC_FORMAT_MACROS -D__STDC_LIMIT_MACROS -I/builddir/build/BUILD/lld-17.0.6.src/x86_64-OpenCloudOS-linux-gnu/MachO -I/builddir/build/BUILD/lld-17.0.6.src/MachO -I/builddir/build/BUILD/lld-17.0.6.src/include -I/builddir/build/BUILD/lld-17.0.6.src/x86_64-OpenCloudOS-linux-gnu/include -I/usr/share/llvm/src/../libunwind/include -O2  -fexceptions -g -grecord-gcc-switches -pipe -Wall -Werror=format-security -Wp,-D_FORTIFY_SOURCE=2 -Wp,-D_GLIBCXX_ASSERTIONS -specs=/usr/lib/rpm/OpenCloudOS/OpenCloudOS-hardened-cc1 -fstack-protector-strong  -m64 -march=x86-64-v2 -mtune=generic -fasynchronous-unwind-tables -fstack-clash-protection -fcf-protection -fPIC -fno-semantic-interposition -fvisibility-inlines-hidden -Werror=date-time -fno-lifetime-dse -Wall -Wextra -Wno-unused-parameter -Wwrite-strings -Wcast-qual -Wno-missing-field-initializers -Wimplicit-fallthrough -Wno-nonnull -Wno-class-memaccess -Wno-redundant-move -Wno-pessimizing-move -Wno-noexcept-type -Wdelete-non-virtual-dtor -Wsuggest-override -Wno-comment -Wno-misleading-indentation -Wctad-maybe-unsupported -fdiagnostics-color -ffunction-sections -fdata-sections -O2 -g -DNDEBUG -std=c++17 -fPIC  -fno-exceptions -funwind-tables -MD -MT MachO/CMakeFiles/lldMachO.dir/Arch/ARM64_32.cpp.o -MF MachO/CMakeFiles/lldMachO.dir/Arch/ARM64_32.cpp.o.d -o MachO/CMakeFiles/lldMachO.dir/Arch/ARM64_32.cpp.o -c /builddir/build/BUILD/lld-17.0.6.src/MachO/Arch/ARM64_32.cpp
[64/132] /usr/bin/g++ -D__STDC_CONSTANT_MACROS -D__STDC_FORMAT_MACROS -D__STDC_LIMIT_MACROS -I/builddir/build/BUILD/lld-17.0.6.src/x86_64-OpenCloudOS-linux-gnu/MachO -I/builddir/build/BUILD/lld-17.0.6.src/MachO -I/builddir/build/BUILD/lld-17.0.6.src/include -I/builddir/build/BUILD/lld-17.0.6.src/x86_64-OpenCloudOS-linux-gnu/include -I/usr/share/llvm/src/../libunwind/include -O2  -fexceptions -g -grecord-gcc-switches -pipe -Wall -Werror=format-security -Wp,-D_FORTIFY_SOURCE=2 -Wp,-D_GLIBCXX_ASSERTIONS -specs=/usr/lib/rpm/OpenCloudOS/OpenCloudOS-hardened-cc1 -fstack-protector-strong  -m64 -march=x86-64-v2 -mtune=generic -fasynchronous-unwind-tables -fstack-clash-protection -fcf-protection -fPIC -fno-semantic-interposition -fvisibility-inlines-hidden -Werror=date-time -fno-lifetime-dse -Wall -Wextra -Wno-unused-parameter -Wwrite-strings -Wcast-qual -Wno-missing-field-initializers -Wimplicit-fallthrough -Wno-nonnull -Wno-class-memaccess -Wno-redundant-move -Wno-pessimizing-move -Wno-noexcept-type -Wdelete-non-virtual-dtor -Wsuggest-override -Wno-comment -Wno-misleading-indentation -Wctad-maybe-unsupported -fdiagnostics-color -ffunction-sections -fdata-sections -O2 -g -DNDEBUG -std=c++17 -fPIC  -fno-exceptions -funwind-tables -MD -MT MachO/CMakeFiles/lldMachO.dir/Arch/ARM64.cpp.o -MF MachO/CMakeFiles/lldMachO.dir/Arch/ARM64.cpp.o.d -o MachO/CMakeFiles/lldMachO.dir/Arch/ARM64.cpp.o -c /builddir/build/BUILD/lld-17.0.6.src/MachO/Arch/ARM64.cpp
[65/132] /usr/bin/g++ -D__STDC_CONSTANT_MACROS -D__STDC_FORMAT_MACROS -D__STDC_LIMIT_MACROS -I/builddir/build/BUILD/lld-17.0.6.src/x86_64-OpenCloudOS-linux-gnu/ELF -I/builddir/build/BUILD/lld-17.0.6.src/ELF -I/builddir/build/BUILD/lld-17.0.6.src/include -I/builddir/build/BUILD/lld-17.0.6.src/x86_64-OpenCloudOS-linux-gnu/include -O2  -fexceptions -g -grecord-gcc-switches -pipe -Wall -Werror=format-security -Wp,-D_FORTIFY_SOURCE=2 -Wp,-D_GLIBCXX_ASSERTIONS -specs=/usr/lib/rpm/OpenCloudOS/OpenCloudOS-hardened-cc1 -fstack-protector-strong  -m64 -march=x86-64-v2 -mtune=generic -fasynchronous-unwind-tables -fstack-clash-protection -fcf-protection -fPIC -fno-semantic-interposition -fvisibility-inlines-hidden -Werror=date-time -fno-lifetime-dse -Wall -Wextra -Wno-unused-parameter -Wwrite-strings -Wcast-qual -Wno-missing-field-initializers -Wimplicit-fallthrough -Wno-nonnull -Wno-class-memaccess -Wno-redundant-move -Wno-pessimizing-move -Wno-noexcept-type -Wdelete-non-virtual-dtor -Wsuggest-override -Wno-comment -Wno-misleading-indentation -Wctad-maybe-unsupported -fdiagnostics-color -ffunction-sections -fdata-sections -O2 -g -DNDEBUG -std=c++17 -fPIC  -fno-exceptions -funwind-tables -MD -MT ELF/CMakeFiles/lldELF.dir/Symbols.cpp.o -MF ELF/CMakeFiles/lldELF.dir/Symbols.cpp.o.d -o ELF/CMakeFiles/lldELF.dir/Symbols.cpp.o -c /builddir/build/BUILD/lld-17.0.6.src/ELF/Symbols.cpp
[66/132] /usr/bin/g++ -D__STDC_CONSTANT_MACROS -D__STDC_FORMAT_MACROS -D__STDC_LIMIT_MACROS -I/builddir/build/BUILD/lld-17.0.6.src/x86_64-OpenCloudOS-linux-gnu/MachO -I/builddir/build/BUILD/lld-17.0.6.src/MachO -I/builddir/build/BUILD/lld-17.0.6.src/include -I/builddir/build/BUILD/lld-17.0.6.src/x86_64-OpenCloudOS-linux-gnu/include -I/usr/share/llvm/src/../libunwind/include -O2  -fexceptions -g -grecord-gcc-switches -pipe -Wall -Werror=format-security -Wp,-D_FORTIFY_SOURCE=2 -Wp,-D_GLIBCXX_ASSERTIONS -specs=/usr/lib/rpm/OpenCloudOS/OpenCloudOS-hardened-cc1 -fstack-protector-strong  -m64 -march=x86-64-v2 -mtune=generic -fasynchronous-unwind-tables -fstack-clash-protection -fcf-protection -fPIC -fno-semantic-interposition -fvisibility-inlines-hidden -Werror=date-time -fno-lifetime-dse -Wall -Wextra -Wno-unused-parameter -Wwrite-strings -Wcast-qual -Wno-missing-field-initializers -Wimplicit-fallthrough -Wno-nonnull -Wno-class-memaccess -Wno-redundant-move -Wno-pessimizing-move -Wno-noexcept-type -Wdelete-non-virtual-dtor -Wsuggest-override -Wno-comment -Wno-misleading-indentation -Wctad-maybe-unsupported -fdiagnostics-color -ffunction-sections -fdata-sections -O2 -g -DNDEBUG -std=c++17 -fPIC  -fno-exceptions -funwind-tables -MD -MT MachO/CMakeFiles/lldMachO.dir/Arch/ARM64Common.cpp.o -MF MachO/CMakeFiles/lldMachO.dir/Arch/ARM64Common.cpp.o.d -o MachO/CMakeFiles/lldMachO.dir/Arch/ARM64Common.cpp.o -c /builddir/build/BUILD/lld-17.0.6.src/MachO/Arch/ARM64Common.cpp
[67/132] /usr/bin/g++ -D__STDC_CONSTANT_MACROS -D__STDC_FORMAT_MACROS -D__STDC_LIMIT_MACROS -I/builddir/build/BUILD/lld-17.0.6.src/x86_64-OpenCloudOS-linux-gnu/MachO -I/builddir/build/BUILD/lld-17.0.6.src/MachO -I/builddir/build/BUILD/lld-17.0.6.src/include -I/builddir/build/BUILD/lld-17.0.6.src/x86_64-OpenCloudOS-linux-gnu/include -I/usr/share/llvm/src/../libunwind/include -O2  -fexceptions -g -grecord-gcc-switches -pipe -Wall -Werror=format-security -Wp,-D_FORTIFY_SOURCE=2 -Wp,-D_GLIBCXX_ASSERTIONS -specs=/usr/lib/rpm/OpenCloudOS/OpenCloudOS-hardened-cc1 -fstack-protector-strong  -m64 -march=x86-64-v2 -mtune=generic -fasynchronous-unwind-tables -fstack-clash-protection -fcf-protection -fPIC -fno-semantic-interposition -fvisibility-inlines-hidden -Werror=date-time -fno-lifetime-dse -Wall -Wextra -Wno-unused-parameter -Wwrite-strings -Wcast-qual -Wno-missing-field-initializers -Wimplicit-fallthrough -Wno-nonnull -Wno-class-memaccess -Wno-redundant-move -Wno-pessimizing-move -Wno-noexcept-type -Wdelete-non-virtual-dtor -Wsuggest-override -Wno-comment -Wno-misleading-indentation -Wctad-maybe-unsupported -fdiagnostics-color -ffunction-sections -fdata-sections -O2 -g -DNDEBUG -std=c++17 -fPIC  -fno-exceptions -funwind-tables -MD -MT MachO/CMakeFiles/lldMachO.dir/Arch/X86_64.cpp.o -MF MachO/CMakeFiles/lldMachO.dir/Arch/X86_64.cpp.o.d -o MachO/CMakeFiles/lldMachO.dir/Arch/X86_64.cpp.o -c /builddir/build/BUILD/lld-17.0.6.src/MachO/Arch/X86_64.cpp
[68/132] /usr/bin/g++ -D__STDC_CONSTANT_MACROS -D__STDC_FORMAT_MACROS -D__STDC_LIMIT_MACROS -I/builddir/build/BUILD/lld-17.0.6.src/x86_64-OpenCloudOS-linux-gnu/COFF -I/builddir/build/BUILD/lld-17.0.6.src/COFF -I/builddir/build/BUILD/lld-17.0.6.src/include -I/builddir/build/BUILD/lld-17.0.6.src/x86_64-OpenCloudOS-linux-gnu/include -O2  -fexceptions -g -grecord-gcc-switches -pipe -Wall -Werror=format-security -Wp,-D_FORTIFY_SOURCE=2 -Wp,-D_GLIBCXX_ASSERTIONS -specs=/usr/lib/rpm/OpenCloudOS/OpenCloudOS-hardened-cc1 -fstack-protector-strong  -m64 -march=x86-64-v2 -mtune=generic -fasynchronous-unwind-tables -fstack-clash-protection -fcf-protection -fPIC -fno-semantic-interposition -fvisibility-inlines-hidden -Werror=date-time -fno-lifetime-dse -Wall -Wextra -Wno-unused-parameter -Wwrite-strings -Wcast-qual -Wno-missing-field-initializers -Wimplicit-fallthrough -Wno-nonnull -Wno-class-memaccess -Wno-redundant-move -Wno-pessimizing-move -Wno-noexcept-type -Wdelete-non-virtual-dtor -Wsuggest-override -Wno-comment -Wno-misleading-indentation -Wctad-maybe-unsupported -fdiagnostics-color -ffunction-sections -fdata-sections -O2 -g -DNDEBUG -std=c++17 -fPIC  -fno-exceptions -funwind-tables -MD -MT COFF/CMakeFiles/lldCOFF.dir/Writer.cpp.o -MF COFF/CMakeFiles/lldCOFF.dir/Writer.cpp.o.d -o COFF/CMakeFiles/lldCOFF.dir/Writer.cpp.o -c /builddir/build/BUILD/lld-17.0.6.src/COFF/Writer.cpp
[69/132] /usr/bin/g++ -D__STDC_CONSTANT_MACROS -D__STDC_FORMAT_MACROS -D__STDC_LIMIT_MACROS -I/builddir/build/BUILD/lld-17.0.6.src/x86_64-OpenCloudOS-linux-gnu/ELF -I/builddir/build/BUILD/lld-17.0.6.src/ELF -I/builddir/build/BUILD/lld-17.0.6.src/include -I/builddir/build/BUILD/lld-17.0.6.src/x86_64-OpenCloudOS-linux-gnu/include -O2  -fexceptions -g -grecord-gcc-switches -pipe -Wall -Werror=format-security -Wp,-D_FORTIFY_SOURCE=2 -Wp,-D_GLIBCXX_ASSERTIONS -specs=/usr/lib/rpm/OpenCloudOS/OpenCloudOS-hardened-cc1 -fstack-protector-strong  -m64 -march=x86-64-v2 -mtune=generic -fasynchronous-unwind-tables -fstack-clash-protection -fcf-protection -fPIC -fno-semantic-interposition -fvisibility-inlines-hidden -Werror=date-time -fno-lifetime-dse -Wall -Wextra -Wno-unused-parameter -Wwrite-strings -Wcast-qual -Wno-missing-field-initializers -Wimplicit-fallthrough -Wno-nonnull -Wno-class-memaccess -Wno-redundant-move -Wno-pessimizing-move -Wno-noexcept-type -Wdelete-non-virtual-dtor -Wsuggest-override -Wno-comment -Wno-misleading-indentation -Wctad-maybe-unsupported -fdiagnostics-color -ffunction-sections -fdata-sections -O2 -g -DNDEBUG -std=c++17 -fPIC  -fno-exceptions -funwind-tables -MD -MT ELF/CMakeFiles/lldELF.dir/OutputSections.cpp.o -MF ELF/CMakeFiles/lldELF.dir/OutputSections.cpp.o.d -o ELF/CMakeFiles/lldELF.dir/OutputSections.cpp.o -c /builddir/build/BUILD/lld-17.0.6.src/ELF/OutputSections.cpp
[70/132] /usr/bin/g++ -D__STDC_CONSTANT_MACROS -D__STDC_FORMAT_MACROS -D__STDC_LIMIT_MACROS -I/builddir/build/BUILD/lld-17.0.6.src/x86_64-OpenCloudOS-linux-gnu/ELF -I/builddir/build/BUILD/lld-17.0.6.src/ELF -I/builddir/build/BUILD/lld-17.0.6.src/include -I/builddir/build/BUILD/lld-17.0.6.src/x86_64-OpenCloudOS-linux-gnu/include -O2  -fexceptions -g -grecord-gcc-switches -pipe -Wall -Werror=format-security -Wp,-D_FORTIFY_SOURCE=2 -Wp,-D_GLIBCXX_ASSERTIONS -specs=/usr/lib/rpm/OpenCloudOS/OpenCloudOS-hardened-cc1 -fstack-protector-strong  -m64 -march=x86-64-v2 -mtune=generic -fasynchronous-unwind-tables -fstack-clash-protection -fcf-protection -fPIC -fno-semantic-interposition -fvisibility-inlines-hidden -Werror=date-time -fno-lifetime-dse -Wall -Wextra -Wno-unused-parameter -Wwrite-strings -Wcast-qual -Wno-missing-field-initializers -Wimplicit-fallthrough -Wno-nonnull -Wno-class-memaccess -Wno-redundant-move -Wno-pessimizing-move -Wno-noexcept-type -Wdelete-non-virtual-dtor -Wsuggest-override -Wno-comment -Wno-misleading-indentation -Wctad-maybe-unsupported -fdiagnostics-color -ffunction-sections -fdata-sections -O2 -g -DNDEBUG -std=c++17 -fPIC  -fno-exceptions -funwind-tables -MD -MT ELF/CMakeFiles/lldELF.dir/LinkerScript.cpp.o -MF ELF/CMakeFiles/lldELF.dir/LinkerScript.cpp.o.d -o ELF/CMakeFiles/lldELF.dir/LinkerScript.cpp.o -c /builddir/build/BUILD/lld-17.0.6.src/ELF/LinkerScript.cpp
[71/132] /usr/bin/g++ -D__STDC_CONSTANT_MACROS -D__STDC_FORMAT_MACROS -D__STDC_LIMIT_MACROS -I/builddir/build/BUILD/lld-17.0.6.src/x86_64-OpenCloudOS-linux-gnu/COFF -I/builddir/build/BUILD/lld-17.0.6.src/COFF -I/builddir/build/BUILD/lld-17.0.6.src/include -I/builddir/build/BUILD/lld-17.0.6.src/x86_64-OpenCloudOS-linux-gnu/include -O2  -fexceptions -g -grecord-gcc-switches -pipe -Wall -Werror=format-security -Wp,-D_FORTIFY_SOURCE=2 -Wp,-D_GLIBCXX_ASSERTIONS -specs=/usr/lib/rpm/OpenCloudOS/OpenCloudOS-hardened-cc1 -fstack-protector-strong  -m64 -march=x86-64-v2 -mtune=generic -fasynchronous-unwind-tables -fstack-clash-protection -fcf-protection -fPIC -fno-semantic-interposition -fvisibility-inlines-hidden -Werror=date-time -fno-lifetime-dse -Wall -Wextra -Wno-unused-parameter -Wwrite-strings -Wcast-qual -Wno-missing-field-initializers -Wimplicit-fallthrough -Wno-nonnull -Wno-class-memaccess -Wno-redundant-move -Wno-pessimizing-move -Wno-noexcept-type -Wdelete-non-virtual-dtor -Wsuggest-override -Wno-comment -Wno-misleading-indentation -Wctad-maybe-unsupported -fdiagnostics-color -ffunction-sections -fdata-sections -O2 -g -DNDEBUG -std=c++17 -fPIC  -fno-exceptions -funwind-tables -MD -MT COFF/CMakeFiles/lldCOFF.dir/LTO.cpp.o -MF COFF/CMakeFiles/lldCOFF.dir/LTO.cpp.o.d -o COFF/CMakeFiles/lldCOFF.dir/LTO.cpp.o -c /builddir/build/BUILD/lld-17.0.6.src/COFF/LTO.cpp
[72/132] /usr/bin/g++ -D__STDC_CONSTANT_MACROS -D__STDC_FORMAT_MACROS -D__STDC_LIMIT_MACROS -I/builddir/build/BUILD/lld-17.0.6.src/x86_64-OpenCloudOS-linux-gnu/MachO -I/builddir/build/BUILD/lld-17.0.6.src/MachO -I/builddir/build/BUILD/lld-17.0.6.src/include -I/builddir/build/BUILD/lld-17.0.6.src/x86_64-OpenCloudOS-linux-gnu/include -I/usr/share/llvm/src/../libunwind/include -O2  -fexceptions -g -grecord-gcc-switches -pipe -Wall -Werror=format-security -Wp,-D_FORTIFY_SOURCE=2 -Wp,-D_GLIBCXX_ASSERTIONS -specs=/usr/lib/rpm/OpenCloudOS/OpenCloudOS-hardened-cc1 -fstack-protector-strong  -m64 -march=x86-64-v2 -mtune=generic -fasynchronous-unwind-tables -fstack-clash-protection -fcf-protection -fPIC -fno-semantic-interposition -fvisibility-inlines-hidden -Werror=date-time -fno-lifetime-dse -Wall -Wextra -Wno-unused-parameter -Wwrite-strings -Wcast-qual -Wno-missing-field-initializers -Wimplicit-fallthrough -Wno-nonnull -Wno-class-memaccess -Wno-redundant-move -Wno-pessimizing-move -Wno-noexcept-type -Wdelete-non-virtual-dtor -Wsuggest-override -Wno-comment -Wno-misleading-indentation -Wctad-maybe-unsupported -fdiagnostics-color -ffunction-sections -fdata-sections -O2 -g -DNDEBUG -std=c++17 -fPIC  -fno-exceptions -funwind-tables -MD -MT MachO/CMakeFiles/lldMachO.dir/Dwarf.cpp.o -MF MachO/CMakeFiles/lldMachO.dir/Dwarf.cpp.o.d -o MachO/CMakeFiles/lldMachO.dir/Dwarf.cpp.o -c /builddir/build/BUILD/lld-17.0.6.src/MachO/Dwarf.cpp
[73/132] /usr/bin/g++ -D__STDC_CONSTANT_MACROS -D__STDC_FORMAT_MACROS -D__STDC_LIMIT_MACROS -I/builddir/build/BUILD/lld-17.0.6.src/x86_64-OpenCloudOS-linux-gnu/MachO -I/builddir/build/BUILD/lld-17.0.6.src/MachO -I/builddir/build/BUILD/lld-17.0.6.src/include -I/builddir/build/BUILD/lld-17.0.6.src/x86_64-OpenCloudOS-linux-gnu/include -I/usr/share/llvm/src/../libunwind/include -O2  -fexceptions -g -grecord-gcc-switches -pipe -Wall -Werror=format-security -Wp,-D_FORTIFY_SOURCE=2 -Wp,-D_GLIBCXX_ASSERTIONS -specs=/usr/lib/rpm/OpenCloudOS/OpenCloudOS-hardened-cc1 -fstack-protector-strong  -m64 -march=x86-64-v2 -mtune=generic -fasynchronous-unwind-tables -fstack-clash-protection -fcf-protection -fPIC -fno-semantic-interposition -fvisibility-inlines-hidden -Werror=date-time -fno-lifetime-dse -Wall -Wextra -Wno-unused-parameter -Wwrite-strings -Wcast-qual -Wno-missing-field-initializers -Wimplicit-fallthrough -Wno-nonnull -Wno-class-memaccess -Wno-redundant-move -Wno-pessimizing-move -Wno-noexcept-type -Wdelete-non-virtual-dtor -Wsuggest-override -Wno-comment -Wno-misleading-indentation -Wctad-maybe-unsupported -fdiagnostics-color -ffunction-sections -fdata-sections -O2 -g -DNDEBUG -std=c++17 -fPIC  -fno-exceptions -funwind-tables -MD -MT MachO/CMakeFiles/lldMachO.dir/EhFrame.cpp.o -MF MachO/CMakeFiles/lldMachO.dir/EhFrame.cpp.o.d -o MachO/CMakeFiles/lldMachO.dir/EhFrame.cpp.o -c /builddir/build/BUILD/lld-17.0.6.src/MachO/EhFrame.cpp
[74/132] /usr/bin/g++ -D__STDC_CONSTANT_MACROS -D__STDC_FORMAT_MACROS -D__STDC_LIMIT_MACROS -I/builddir/build/BUILD/lld-17.0.6.src/x86_64-OpenCloudOS-linux-gnu/MachO -I/builddir/build/BUILD/lld-17.0.6.src/MachO -I/builddir/build/BUILD/lld-17.0.6.src/include -I/builddir/build/BUILD/lld-17.0.6.src/x86_64-OpenCloudOS-linux-gnu/include -I/usr/share/llvm/src/../libunwind/include -O2  -fexceptions -g -grecord-gcc-switches -pipe -Wall -Werror=format-security -Wp,-D_FORTIFY_SOURCE=2 -Wp,-D_GLIBCXX_ASSERTIONS -specs=/usr/lib/rpm/OpenCloudOS/OpenCloudOS-hardened-cc1 -fstack-protector-strong  -m64 -march=x86-64-v2 -mtune=generic -fasynchronous-unwind-tables -fstack-clash-protection -fcf-protection -fPIC -fno-semantic-interposition -fvisibility-inlines-hidden -Werror=date-time -fno-lifetime-dse -Wall -Wextra -Wno-unused-parameter -Wwrite-strings -Wcast-qual -Wno-missing-field-initializers -Wimplicit-fallthrough -Wno-nonnull -Wno-class-memaccess -Wno-redundant-move -Wno-pessimizing-move -Wno-noexcept-type -Wdelete-non-virtual-dtor -Wsuggest-override -Wno-comment -Wno-misleading-indentation -Wctad-maybe-unsupported -fdiagnostics-color -ffunction-sections -fdata-sections -O2 -g -DNDEBUG -std=c++17 -fPIC  -fno-exceptions -funwind-tables -MD -MT MachO/CMakeFiles/lldMachO.dir/ExportTrie.cpp.o -MF MachO/CMakeFiles/lldMachO.dir/ExportTrie.cpp.o.d -o MachO/CMakeFiles/lldMachO.dir/ExportTrie.cpp.o -c /builddir/build/BUILD/lld-17.0.6.src/MachO/ExportTrie.cpp
[75/132] /usr/bin/g++ -D__STDC_CONSTANT_MACROS -D__STDC_FORMAT_MACROS -D__STDC_LIMIT_MACROS -I/builddir/build/BUILD/lld-17.0.6.src/x86_64-OpenCloudOS-linux-gnu/COFF -I/builddir/build/BUILD/lld-17.0.6.src/COFF -I/builddir/build/BUILD/lld-17.0.6.src/include -I/builddir/build/BUILD/lld-17.0.6.src/x86_64-OpenCloudOS-linux-gnu/include -O2  -fexceptions -g -grecord-gcc-switches -pipe -Wall -Werror=format-security -Wp,-D_FORTIFY_SOURCE=2 -Wp,-D_GLIBCXX_ASSERTIONS -specs=/usr/lib/rpm/OpenCloudOS/OpenCloudOS-hardened-cc1 -fstack-protector-strong  -m64 -march=x86-64-v2 -mtune=generic -fasynchronous-unwind-tables -fstack-clash-protection -fcf-protection -fPIC -fno-semantic-interposition -fvisibility-inlines-hidden -Werror=date-time -fno-lifetime-dse -Wall -Wextra -Wno-unused-parameter -Wwrite-strings -Wcast-qual -Wno-missing-field-initializers -Wimplicit-fallthrough -Wno-nonnull -Wno-class-memaccess -Wno-redundant-move -Wno-pessimizing-move -Wno-noexcept-type -Wdelete-non-virtual-dtor -Wsuggest-override -Wno-comment -Wno-misleading-indentation -Wctad-maybe-unsupported -fdiagnostics-color -ffunction-sections -fdata-sections -O2 -g -DNDEBUG -std=c++17 -fPIC  -fno-exceptions -funwind-tables -MD -MT COFF/CMakeFiles/lldCOFF.dir/SymbolTable.cpp.o -MF COFF/CMakeFiles/lldCOFF.dir/SymbolTable.cpp.o.d -o COFF/CMakeFiles/lldCOFF.dir/SymbolTable.cpp.o -c /builddir/build/BUILD/lld-17.0.6.src/COFF/SymbolTable.cpp
[76/132] /usr/bin/g++ -D__STDC_CONSTANT_MACROS -D__STDC_FORMAT_MACROS -D__STDC_LIMIT_MACROS -I/builddir/build/BUILD/lld-17.0.6.src/x86_64-OpenCloudOS-linux-gnu/MachO -I/builddir/build/BUILD/lld-17.0.6.src/MachO -I/builddir/build/BUILD/lld-17.0.6.src/include -I/builddir/build/BUILD/lld-17.0.6.src/x86_64-OpenCloudOS-linux-gnu/include -I/usr/share/llvm/src/../libunwind/include -O2  -fexceptions -g -grecord-gcc-switches -pipe -Wall -Werror=format-security -Wp,-D_FORTIFY_SOURCE=2 -Wp,-D_GLIBCXX_ASSERTIONS -specs=/usr/lib/rpm/OpenCloudOS/OpenCloudOS-hardened-cc1 -fstack-protector-strong  -m64 -march=x86-64-v2 -mtune=generic -fasynchronous-unwind-tables -fstack-clash-protection -fcf-protection -fPIC -fno-semantic-interposition -fvisibility-inlines-hidden -Werror=date-time -fno-lifetime-dse -Wall -Wextra -Wno-unused-parameter -Wwrite-strings -Wcast-qual -Wno-missing-field-initializers -Wimplicit-fallthrough -Wno-nonnull -Wno-class-memaccess -Wno-redundant-move -Wno-pessimizing-move -Wno-noexcept-type -Wdelete-non-virtual-dtor -Wsuggest-override -Wno-comment -Wno-misleading-indentation -Wctad-maybe-unsupported -fdiagnostics-color -ffunction-sections -fdata-sections -O2 -g -DNDEBUG -std=c++17 -fPIC  -fno-exceptions -funwind-tables -MD -MT MachO/CMakeFiles/lldMachO.dir/Target.cpp.o -MF MachO/CMakeFiles/lldMachO.dir/Target.cpp.o.d -o MachO/CMakeFiles/lldMachO.dir/Target.cpp.o -c /builddir/build/BUILD/lld-17.0.6.src/MachO/Target.cpp
[77/132] /usr/bin/g++ -D__STDC_CONSTANT_MACROS -D__STDC_FORMAT_MACROS -D__STDC_LIMIT_MACROS -I/builddir/build/BUILD/lld-17.0.6.src/x86_64-OpenCloudOS-linux-gnu/MachO -I/builddir/build/BUILD/lld-17.0.6.src/MachO -I/builddir/build/BUILD/lld-17.0.6.src/include -I/builddir/build/BUILD/lld-17.0.6.src/x86_64-OpenCloudOS-linux-gnu/include -I/usr/share/llvm/src/../libunwind/include -O2  -fexceptions -g -grecord-gcc-switches -pipe -Wall -Werror=format-security -Wp,-D_FORTIFY_SOURCE=2 -Wp,-D_GLIBCXX_ASSERTIONS -specs=/usr/lib/rpm/OpenCloudOS/OpenCloudOS-hardened-cc1 -fstack-protector-strong  -m64 -march=x86-64-v2 -mtune=generic -fasynchronous-unwind-tables -fstack-clash-protection -fcf-protection -fPIC -fno-semantic-interposition -fvisibility-inlines-hidden -Werror=date-time -fno-lifetime-dse -Wall -Wextra -Wno-unused-parameter -Wwrite-strings -Wcast-qual -Wno-missing-field-initializers -Wimplicit-fallthrough -Wno-nonnull -Wno-class-memaccess -Wno-redundant-move -Wno-pessimizing-move -Wno-noexcept-type -Wdelete-non-virtual-dtor -Wsuggest-override -Wno-comment -Wno-misleading-indentation -Wctad-maybe-unsupported -fdiagnostics-color -ffunction-sections -fdata-sections -O2 -g -DNDEBUG -std=c++17 -fPIC  -fno-exceptions -funwind-tables -MD -MT MachO/CMakeFiles/lldMachO.dir/ICF.cpp.o -MF MachO/CMakeFiles/lldMachO.dir/ICF.cpp.o.d -o MachO/CMakeFiles/lldMachO.dir/ICF.cpp.o -c /builddir/build/BUILD/lld-17.0.6.src/MachO/ICF.cpp
[78/132] /usr/bin/g++ -D__STDC_CONSTANT_MACROS -D__STDC_FORMAT_MACROS -D__STDC_LIMIT_MACROS -I/builddir/build/BUILD/lld-17.0.6.src/x86_64-OpenCloudOS-linux-gnu/MachO -I/builddir/build/BUILD/lld-17.0.6.src/MachO -I/builddir/build/BUILD/lld-17.0.6.src/include -I/builddir/build/BUILD/lld-17.0.6.src/x86_64-OpenCloudOS-linux-gnu/include -I/usr/share/llvm/src/../libunwind/include -O2  -fexceptions -g -grecord-gcc-switches -pipe -Wall -Werror=format-security -Wp,-D_FORTIFY_SOURCE=2 -Wp,-D_GLIBCXX_ASSERTIONS -specs=/usr/lib/rpm/OpenCloudOS/OpenCloudOS-hardened-cc1 -fstack-protector-strong  -m64 -march=x86-64-v2 -mtune=generic -fasynchronous-unwind-tables -fstack-clash-protection -fcf-protection -fPIC -fno-semantic-interposition -fvisibility-inlines-hidden -Werror=date-time -fno-lifetime-dse -Wall -Wextra -Wno-unused-parameter -Wwrite-strings -Wcast-qual -Wno-missing-field-initializers -Wimplicit-fallthrough -Wno-nonnull -Wno-class-memaccess -Wno-redundant-move -Wno-pessimizing-move -Wno-noexcept-type -Wdelete-non-virtual-dtor -Wsuggest-override -Wno-comment -Wno-misleading-indentation -Wctad-maybe-unsupported -fdiagnostics-color -ffunction-sections -fdata-sections -O2 -g -DNDEBUG -std=c++17 -fPIC  -fno-exceptions -funwind-tables -MD -MT MachO/CMakeFiles/lldMachO.dir/OutputSection.cpp.o -MF MachO/CMakeFiles/lldMachO.dir/OutputSection.cpp.o.d -o MachO/CMakeFiles/lldMachO.dir/OutputSection.cpp.o -c /builddir/build/BUILD/lld-17.0.6.src/MachO/OutputSection.cpp
[79/132] /usr/bin/g++ -D__STDC_CONSTANT_MACROS -D__STDC_FORMAT_MACROS -D__STDC_LIMIT_MACROS -I/builddir/build/BUILD/lld-17.0.6.src/x86_64-OpenCloudOS-linux-gnu/ELF -I/builddir/build/BUILD/lld-17.0.6.src/ELF -I/builddir/build/BUILD/lld-17.0.6.src/include -I/builddir/build/BUILD/lld-17.0.6.src/x86_64-OpenCloudOS-linux-gnu/include -O2  -fexceptions -g -grecord-gcc-switches -pipe -Wall -Werror=format-security -Wp,-D_FORTIFY_SOURCE=2 -Wp,-D_GLIBCXX_ASSERTIONS -specs=/usr/lib/rpm/OpenCloudOS/OpenCloudOS-hardened-cc1 -fstack-protector-strong  -m64 -march=x86-64-v2 -mtune=generic -fasynchronous-unwind-tables -fstack-clash-protection -fcf-protection -fPIC -fno-semantic-interposition -fvisibility-inlines-hidden -Werror=date-time -fno-lifetime-dse -Wall -Wextra -Wno-unused-parameter -Wwrite-strings -Wcast-qual -Wno-missing-field-initializers -Wimplicit-fallthrough -Wno-nonnull -Wno-class-memaccess -Wno-redundant-move -Wno-pessimizing-move -Wno-noexcept-type -Wdelete-non-virtual-dtor -Wsuggest-override -Wno-comment -Wno-misleading-indentation -Wctad-maybe-unsupported -fdiagnostics-color -ffunction-sections -fdata-sections -O2 -g -DNDEBUG -std=c++17 -fPIC  -fno-exceptions -funwind-tables -MD -MT ELF/CMakeFiles/lldELF.dir/Thunks.cpp.o -MF ELF/CMakeFiles/lldELF.dir/Thunks.cpp.o.d -o ELF/CMakeFiles/lldELF.dir/Thunks.cpp.o -c /builddir/build/BUILD/lld-17.0.6.src/ELF/Thunks.cpp
[80/132] /usr/bin/g++ -D__STDC_CONSTANT_MACROS -D__STDC_FORMAT_MACROS -D__STDC_LIMIT_MACROS -I/builddir/build/BUILD/lld-17.0.6.src/x86_64-OpenCloudOS-linux-gnu/MachO -I/builddir/build/BUILD/lld-17.0.6.src/MachO -I/builddir/build/BUILD/lld-17.0.6.src/include -I/builddir/build/BUILD/lld-17.0.6.src/x86_64-OpenCloudOS-linux-gnu/include -I/usr/share/llvm/src/../libunwind/include -O2  -fexceptions -g -grecord-gcc-switches -pipe -Wall -Werror=format-security -Wp,-D_FORTIFY_SOURCE=2 -Wp,-D_GLIBCXX_ASSERTIONS -specs=/usr/lib/rpm/OpenCloudOS/OpenCloudOS-hardened-cc1 -fstack-protector-strong  -m64 -march=x86-64-v2 -mtune=generic -fasynchronous-unwind-tables -fstack-clash-protection -fcf-protection -fPIC -fno-semantic-interposition -fvisibility-inlines-hidden -Werror=date-time -fno-lifetime-dse -Wall -Wextra -Wno-unused-parameter -Wwrite-strings -Wcast-qual -Wno-missing-field-initializers -Wimplicit-fallthrough -Wno-nonnull -Wno-class-memaccess -Wno-redundant-move -Wno-pessimizing-move -Wno-noexcept-type -Wdelete-non-virtual-dtor -Wsuggest-override -Wno-comment -Wno-misleading-indentation -Wctad-maybe-unsupported -fdiagnostics-color -ffunction-sections -fdata-sections -O2 -g -DNDEBUG -std=c++17 -fPIC  -fno-exceptions -funwind-tables -MD -MT MachO/CMakeFiles/lldMachO.dir/ObjC.cpp.o -MF MachO/CMakeFiles/lldMachO.dir/ObjC.cpp.o.d -o MachO/CMakeFiles/lldMachO.dir/ObjC.cpp.o -c /builddir/build/BUILD/lld-17.0.6.src/MachO/ObjC.cpp
[81/132] /usr/bin/g++ -D__STDC_CONSTANT_MACROS -D__STDC_FORMAT_MACROS -D__STDC_LIMIT_MACROS -I/builddir/build/BUILD/lld-17.0.6.src/x86_64-OpenCloudOS-linux-gnu/MachO -I/builddir/build/BUILD/lld-17.0.6.src/MachO -I/builddir/build/BUILD/lld-17.0.6.src/include -I/builddir/build/BUILD/lld-17.0.6.src/x86_64-OpenCloudOS-linux-gnu/include -I/usr/share/llvm/src/../libunwind/include -O2  -fexceptions -g -grecord-gcc-switches -pipe -Wall -Werror=format-security -Wp,-D_FORTIFY_SOURCE=2 -Wp,-D_GLIBCXX_ASSERTIONS -specs=/usr/lib/rpm/OpenCloudOS/OpenCloudOS-hardened-cc1 -fstack-protector-strong  -m64 -march=x86-64-v2 -mtune=generic -fasynchronous-unwind-tables -fstack-clash-protection -fcf-protection -fPIC -fno-semantic-interposition -fvisibility-inlines-hidden -Werror=date-time -fno-lifetime-dse -Wall -Wextra -Wno-unused-parameter -Wwrite-strings -Wcast-qual -Wno-missing-field-initializers -Wimplicit-fallthrough -Wno-nonnull -Wno-class-memaccess -Wno-redundant-move -Wno-pessimizing-move -Wno-noexcept-type -Wdelete-non-virtual-dtor -Wsuggest-override -Wno-comment -Wno-misleading-indentation -Wctad-maybe-unsupported -fdiagnostics-color -ffunction-sections -fdata-sections -O2 -g -DNDEBUG -std=c++17 -fPIC  -fno-exceptions -funwind-tables -MD -MT MachO/CMakeFiles/lldMachO.dir/ConcatOutputSection.cpp.o -MF MachO/CMakeFiles/lldMachO.dir/ConcatOutputSection.cpp.o.d -o MachO/CMakeFiles/lldMachO.dir/ConcatOutputSection.cpp.o -c /builddir/build/BUILD/lld-17.0.6.src/MachO/ConcatOutputSection.cpp
[82/132] /usr/bin/g++ -D__STDC_CONSTANT_MACROS -D__STDC_FORMAT_MACROS -D__STDC_LIMIT_MACROS -I/builddir/build/BUILD/lld-17.0.6.src/x86_64-OpenCloudOS-linux-gnu/MachO -I/builddir/build/BUILD/lld-17.0.6.src/MachO -I/builddir/build/BUILD/lld-17.0.6.src/include -I/builddir/build/BUILD/lld-17.0.6.src/x86_64-OpenCloudOS-linux-gnu/include -I/usr/share/llvm/src/../libunwind/include -O2  -fexceptions -g -grecord-gcc-switches -pipe -Wall -Werror=format-security -Wp,-D_FORTIFY_SOURCE=2 -Wp,-D_GLIBCXX_ASSERTIONS -specs=/usr/lib/rpm/OpenCloudOS/OpenCloudOS-hardened-cc1 -fstack-protector-strong  -m64 -march=x86-64-v2 -mtune=generic -fasynchronous-unwind-tables -fstack-clash-protection -fcf-protection -fPIC -fno-semantic-interposition -fvisibility-inlines-hidden -Werror=date-time -fno-lifetime-dse -Wall -Wextra -Wno-unused-parameter -Wwrite-strings -Wcast-qual -Wno-missing-field-initializers -Wimplicit-fallthrough -Wno-nonnull -Wno-class-memaccess -Wno-redundant-move -Wno-pessimizing-move -Wno-noexcept-type -Wdelete-non-virtual-dtor -Wsuggest-override -Wno-comment -Wno-misleading-indentation -Wctad-maybe-unsupported -fdiagnostics-color -ffunction-sections -fdata-sections -O2 -g -DNDEBUG -std=c++17 -fPIC  -fno-exceptions -funwind-tables -MD -MT MachO/CMakeFiles/lldMachO.dir/MarkLive.cpp.o -MF MachO/CMakeFiles/lldMachO.dir/MarkLive.cpp.o.d -o MachO/CMakeFiles/lldMachO.dir/MarkLive.cpp.o -c /builddir/build/BUILD/lld-17.0.6.src/MachO/MarkLive.cpp
[83/132] /usr/bin/g++ -D__STDC_CONSTANT_MACROS -D__STDC_FORMAT_MACROS -D__STDC_LIMIT_MACROS -I/builddir/build/BUILD/lld-17.0.6.src/x86_64-OpenCloudOS-linux-gnu/MachO -I/builddir/build/BUILD/lld-17.0.6.src/MachO -I/builddir/build/BUILD/lld-17.0.6.src/include -I/builddir/build/BUILD/lld-17.0.6.src/x86_64-OpenCloudOS-linux-gnu/include -I/usr/share/llvm/src/../libunwind/include -O2  -fexceptions -g -grecord-gcc-switches -pipe -Wall -Werror=format-security -Wp,-D_FORTIFY_SOURCE=2 -Wp,-D_GLIBCXX_ASSERTIONS -specs=/usr/lib/rpm/OpenCloudOS/OpenCloudOS-hardened-cc1 -fstack-protector-strong  -m64 -march=x86-64-v2 -mtune=generic -fasynchronous-unwind-tables -fstack-clash-protection -fcf-protection -fPIC -fno-semantic-interposition -fvisibility-inlines-hidden -Werror=date-time -fno-lifetime-dse -Wall -Wextra -Wno-unused-parameter -Wwrite-strings -Wcast-qual -Wno-missing-field-initializers -Wimplicit-fallthrough -Wno-nonnull -Wno-class-memaccess -Wno-redundant-move -Wno-pessimizing-move -Wno-noexcept-type -Wdelete-non-virtual-dtor -Wsuggest-override -Wno-comment -Wno-misleading-indentation -Wctad-maybe-unsupported -fdiagnostics-color -ffunction-sections -fdata-sections -O2 -g -DNDEBUG -std=c++17 -fPIC  -fno-exceptions -funwind-tables -MD -MT MachO/CMakeFiles/lldMachO.dir/Relocations.cpp.o -MF MachO/CMakeFiles/lldMachO.dir/Relocations.cpp.o.d -o MachO/CMakeFiles/lldMachO.dir/Relocations.cpp.o -c /builddir/build/BUILD/lld-17.0.6.src/MachO/Relocations.cpp
[84/132] /usr/bin/g++ -D__STDC_CONSTANT_MACROS -D__STDC_FORMAT_MACROS -D__STDC_LIMIT_MACROS -I/builddir/build/BUILD/lld-17.0.6.src/x86_64-OpenCloudOS-linux-gnu/MachO -I/builddir/build/BUILD/lld-17.0.6.src/MachO -I/builddir/build/BUILD/lld-17.0.6.src/include -I/builddir/build/BUILD/lld-17.0.6.src/x86_64-OpenCloudOS-linux-gnu/include -I/usr/share/llvm/src/../libunwind/include -O2  -fexceptions -g -grecord-gcc-switches -pipe -Wall -Werror=format-security -Wp,-D_FORTIFY_SOURCE=2 -Wp,-D_GLIBCXX_ASSERTIONS -specs=/usr/lib/rpm/OpenCloudOS/OpenCloudOS-hardened-cc1 -fstack-protector-strong  -m64 -march=x86-64-v2 -mtune=generic -fasynchronous-unwind-tables -fstack-clash-protection -fcf-protection -fPIC -fno-semantic-interposition -fvisibility-inlines-hidden -Werror=date-time -fno-lifetime-dse -Wall -Wextra -Wno-unused-parameter -Wwrite-strings -Wcast-qual -Wno-missing-field-initializers -Wimplicit-fallthrough -Wno-nonnull -Wno-class-memaccess -Wno-redundant-move -Wno-pessimizing-move -Wno-noexcept-type -Wdelete-non-virtual-dtor -Wsuggest-override -Wno-comment -Wno-misleading-indentation -Wctad-maybe-unsupported -fdiagnostics-color -ffunction-sections -fdata-sections -O2 -g -DNDEBUG -std=c++17 -fPIC  -fno-exceptions -funwind-tables -MD -MT MachO/CMakeFiles/lldMachO.dir/InputSection.cpp.o -MF MachO/CMakeFiles/lldMachO.dir/InputSection.cpp.o.d -o MachO/CMakeFiles/lldMachO.dir/InputSection.cpp.o -c /builddir/build/BUILD/lld-17.0.6.src/MachO/InputSection.cpp
[85/132] /usr/bin/g++ -D__STDC_CONSTANT_MACROS -D__STDC_FORMAT_MACROS -D__STDC_LIMIT_MACROS -I/builddir/build/BUILD/lld-17.0.6.src/x86_64-OpenCloudOS-linux-gnu/MachO -I/builddir/build/BUILD/lld-17.0.6.src/MachO -I/builddir/build/BUILD/lld-17.0.6.src/include -I/builddir/build/BUILD/lld-17.0.6.src/x86_64-OpenCloudOS-linux-gnu/include -I/usr/share/llvm/src/../libunwind/include -O2  -fexceptions -g -grecord-gcc-switches -pipe -Wall -Werror=format-security -Wp,-D_FORTIFY_SOURCE=2 -Wp,-D_GLIBCXX_ASSERTIONS -specs=/usr/lib/rpm/OpenCloudOS/OpenCloudOS-hardened-cc1 -fstack-protector-strong  -m64 -march=x86-64-v2 -mtune=generic -fasynchronous-unwind-tables -fstack-clash-protection -fcf-protection -fPIC -fno-semantic-interposition -fvisibility-inlines-hidden -Werror=date-time -fno-lifetime-dse -Wall -Wextra -Wno-unused-parameter -Wwrite-strings -Wcast-qual -Wno-missing-field-initializers -Wimplicit-fallthrough -Wno-nonnull -Wno-class-memaccess -Wno-redundant-move -Wno-pessimizing-move -Wno-noexcept-type -Wdelete-non-virtual-dtor -Wsuggest-override -Wno-comment -Wno-misleading-indentation -Wctad-maybe-unsupported -fdiagnostics-color -ffunction-sections -fdata-sections -O2 -g -DNDEBUG -std=c++17 -fPIC  -fno-exceptions -funwind-tables -MD -MT MachO/CMakeFiles/lldMachO.dir/Symbols.cpp.o -MF MachO/CMakeFiles/lldMachO.dir/Symbols.cpp.o.d -o MachO/CMakeFiles/lldMachO.dir/Symbols.cpp.o -c /builddir/build/BUILD/lld-17.0.6.src/MachO/Symbols.cpp
[86/132] /usr/bin/g++ -D__STDC_CONSTANT_MACROS -D__STDC_FORMAT_MACROS -D__STDC_LIMIT_MACROS -I/builddir/build/BUILD/lld-17.0.6.src/x86_64-OpenCloudOS-linux-gnu/MachO -I/builddir/build/BUILD/lld-17.0.6.src/MachO -I/builddir/build/BUILD/lld-17.0.6.src/include -I/builddir/build/BUILD/lld-17.0.6.src/x86_64-OpenCloudOS-linux-gnu/include -I/usr/share/llvm/src/../libunwind/include -O2  -fexceptions -g -grecord-gcc-switches -pipe -Wall -Werror=format-security -Wp,-D_FORTIFY_SOURCE=2 -Wp,-D_GLIBCXX_ASSERTIONS -specs=/usr/lib/rpm/OpenCloudOS/OpenCloudOS-hardened-cc1 -fstack-protector-strong  -m64 -march=x86-64-v2 -mtune=generic -fasynchronous-unwind-tables -fstack-clash-protection -fcf-protection -fPIC -fno-semantic-interposition -fvisibility-inlines-hidden -Werror=date-time -fno-lifetime-dse -Wall -Wextra -Wno-unused-parameter -Wwrite-strings -Wcast-qual -Wno-missing-field-initializers -Wimplicit-fallthrough -Wno-nonnull -Wno-class-memaccess -Wno-redundant-move -Wno-pessimizing-move -Wno-noexcept-type -Wdelete-non-virtual-dtor -Wsuggest-override -Wno-comment -Wno-misleading-indentation -Wctad-maybe-unsupported -fdiagnostics-color -ffunction-sections -fdata-sections -O2 -g -DNDEBUG -std=c++17 -fPIC  -fno-exceptions -funwind-tables -MD -MT MachO/CMakeFiles/lldMachO.dir/MapFile.cpp.o -MF MachO/CMakeFiles/lldMachO.dir/MapFile.cpp.o.d -o MachO/CMakeFiles/lldMachO.dir/MapFile.cpp.o -c /builddir/build/BUILD/lld-17.0.6.src/MachO/MapFile.cpp
[87/132] /usr/bin/g++ -D__STDC_CONSTANT_MACROS -D__STDC_FORMAT_MACROS -D__STDC_LIMIT_MACROS -I/builddir/build/BUILD/lld-17.0.6.src/x86_64-OpenCloudOS-linux-gnu/ELF -I/builddir/build/BUILD/lld-17.0.6.src/ELF -I/builddir/build/BUILD/lld-17.0.6.src/include -I/builddir/build/BUILD/lld-17.0.6.src/x86_64-OpenCloudOS-linux-gnu/include -O2  -fexceptions -g -grecord-gcc-switches -pipe -Wall -Werror=format-security -Wp,-D_FORTIFY_SOURCE=2 -Wp,-D_GLIBCXX_ASSERTIONS -specs=/usr/lib/rpm/OpenCloudOS/OpenCloudOS-hardened-cc1 -fstack-protector-strong  -m64 -march=x86-64-v2 -mtune=generic -fasynchronous-unwind-tables -fstack-clash-protection -fcf-protection -fPIC -fno-semantic-interposition -fvisibility-inlines-hidden -Werror=date-time -fno-lifetime-dse -Wall -Wextra -Wno-unused-parameter -Wwrite-strings -Wcast-qual -Wno-missing-field-initializers -Wimplicit-fallthrough -Wno-nonnull -Wno-class-memaccess -Wno-redundant-move -Wno-pessimizing-move -Wno-noexcept-type -Wdelete-non-virtual-dtor -Wsuggest-override -Wno-comment -Wno-misleading-indentation -Wctad-maybe-unsupported -fdiagnostics-color -ffunction-sections -fdata-sections -O2 -g -DNDEBUG -std=c++17 -fPIC  -fno-exceptions -funwind-tables -MD -MT ELF/CMakeFiles/lldELF.dir/ScriptParser.cpp.o -MF ELF/CMakeFiles/lldELF.dir/ScriptParser.cpp.o.d -o ELF/CMakeFiles/lldELF.dir/ScriptParser.cpp.o -c /builddir/build/BUILD/lld-17.0.6.src/ELF/ScriptParser.cpp
[88/132] /usr/bin/g++ -D__STDC_CONSTANT_MACROS -D__STDC_FORMAT_MACROS -D__STDC_LIMIT_MACROS -I/builddir/build/BUILD/lld-17.0.6.src/x86_64-OpenCloudOS-linux-gnu/MachO -I/builddir/build/BUILD/lld-17.0.6.src/MachO -I/builddir/build/BUILD/lld-17.0.6.src/include -I/builddir/build/BUILD/lld-17.0.6.src/x86_64-OpenCloudOS-linux-gnu/include -I/usr/share/llvm/src/../libunwind/include -O2  -fexceptions -g -grecord-gcc-switches -pipe -Wall -Werror=format-security -Wp,-D_FORTIFY_SOURCE=2 -Wp,-D_GLIBCXX_ASSERTIONS -specs=/usr/lib/rpm/OpenCloudOS/OpenCloudOS-hardened-cc1 -fstack-protector-strong  -m64 -march=x86-64-v2 -mtune=generic -fasynchronous-unwind-tables -fstack-clash-protection -fcf-protection -fPIC -fno-semantic-interposition -fvisibility-inlines-hidden -Werror=date-time -fno-lifetime-dse -Wall -Wextra -Wno-unused-parameter -Wwrite-strings -Wcast-qual -Wno-missing-field-initializers -Wimplicit-fallthrough -Wno-nonnull -Wno-class-memaccess -Wno-redundant-move -Wno-pessimizing-move -Wno-noexcept-type -Wdelete-non-virtual-dtor -Wsuggest-override -Wno-comment -Wno-misleading-indentation -Wctad-maybe-unsupported -fdiagnostics-color -ffunction-sections -fdata-sections -O2 -g -DNDEBUG -std=c++17 -fPIC  -fno-exceptions -funwind-tables -MD -MT MachO/CMakeFiles/lldMachO.dir/OutputSegment.cpp.o -MF MachO/CMakeFiles/lldMachO.dir/OutputSegment.cpp.o.d -o MachO/CMakeFiles/lldMachO.dir/OutputSegment.cpp.o -c /builddir/build/BUILD/lld-17.0.6.src/MachO/OutputSegment.cpp
[89/132] /usr/bin/g++ -D__STDC_CONSTANT_MACROS -D__STDC_FORMAT_MACROS -D__STDC_LIMIT_MACROS -I/builddir/build/BUILD/lld-17.0.6.src/x86_64-OpenCloudOS-linux-gnu/MachO -I/builddir/build/BUILD/lld-17.0.6.src/MachO -I/builddir/build/BUILD/lld-17.0.6.src/include -I/builddir/build/BUILD/lld-17.0.6.src/x86_64-OpenCloudOS-linux-gnu/include -I/usr/share/llvm/src/../libunwind/include -O2  -fexceptions -g -grecord-gcc-switches -pipe -Wall -Werror=format-security -Wp,-D_FORTIFY_SOURCE=2 -Wp,-D_GLIBCXX_ASSERTIONS -specs=/usr/lib/rpm/OpenCloudOS/OpenCloudOS-hardened-cc1 -fstack-protector-strong  -m64 -march=x86-64-v2 -mtune=generic -fasynchronous-unwind-tables -fstack-clash-protection -fcf-protection -fPIC -fno-semantic-interposition -fvisibility-inlines-hidden -Werror=date-time -fno-lifetime-dse -Wall -Wextra -Wno-unused-parameter -Wwrite-strings -Wcast-qual -Wno-missing-field-initializers -Wimplicit-fallthrough -Wno-nonnull -Wno-class-memaccess -Wno-redundant-move -Wno-pessimizing-move -Wno-noexcept-type -Wdelete-non-virtual-dtor -Wsuggest-override -Wno-comment -Wno-misleading-indentation -Wctad-maybe-unsupported -fdiagnostics-color -ffunction-sections -fdata-sections -O2 -g -DNDEBUG -std=c++17 -fPIC  -fno-exceptions -funwind-tables -MD -MT MachO/CMakeFiles/lldMachO.dir/SectionPriorities.cpp.o -MF MachO/CMakeFiles/lldMachO.dir/SectionPriorities.cpp.o.d -o MachO/CMakeFiles/lldMachO.dir/SectionPriorities.cpp.o -c /builddir/build/BUILD/lld-17.0.6.src/MachO/SectionPriorities.cpp
[90/132] /usr/bin/g++ -D__STDC_CONSTANT_MACROS -D__STDC_FORMAT_MACROS -D__STDC_LIMIT_MACROS -I/builddir/build/BUILD/lld-17.0.6.src/x86_64-OpenCloudOS-linux-gnu/MinGW -I/builddir/build/BUILD/lld-17.0.6.src/MinGW -I/builddir/build/BUILD/lld-17.0.6.src/include -I/builddir/build/BUILD/lld-17.0.6.src/x86_64-OpenCloudOS-linux-gnu/include -O2  -fexceptions -g -grecord-gcc-switches -pipe -Wall -Werror=format-security -Wp,-D_FORTIFY_SOURCE=2 -Wp,-D_GLIBCXX_ASSERTIONS -specs=/usr/lib/rpm/OpenCloudOS/OpenCloudOS-hardened-cc1 -fstack-protector-strong  -m64 -march=x86-64-v2 -mtune=generic -fasynchronous-unwind-tables -fstack-clash-protection -fcf-protection -fPIC -fno-semantic-interposition -fvisibility-inlines-hidden -Werror=date-time -fno-lifetime-dse -Wall -Wextra -Wno-unused-parameter -Wwrite-strings -Wcast-qual -Wno-missing-field-initializers -Wimplicit-fallthrough -Wno-nonnull -Wno-class-memaccess -Wno-redundant-move -Wno-pessimizing-move -Wno-noexcept-type -Wdelete-non-virtual-dtor -Wsuggest-override -Wno-comment -Wno-misleading-indentation -Wctad-maybe-unsupported -fdiagnostics-color -ffunction-sections -fdata-sections -O2 -g -DNDEBUG -std=c++17 -fPIC  -fno-exceptions -funwind-tables -MD -MT MinGW/CMakeFiles/lldMinGW.dir/Driver.cpp.o -MF MinGW/CMakeFiles/lldMinGW.dir/Driver.cpp.o.d -o MinGW/CMakeFiles/lldMinGW.dir/Driver.cpp.o -c /builddir/build/BUILD/lld-17.0.6.src/MinGW/Driver.cpp
[91/132] /usr/bin/g++ -D__STDC_CONSTANT_MACROS -D__STDC_FORMAT_MACROS -D__STDC_LIMIT_MACROS -I/builddir/build/BUILD/lld-17.0.6.src/x86_64-OpenCloudOS-linux-gnu/COFF -I/builddir/build/BUILD/lld-17.0.6.src/COFF -I/builddir/build/BUILD/lld-17.0.6.src/include -I/builddir/build/BUILD/lld-17.0.6.src/x86_64-OpenCloudOS-linux-gnu/include -O2  -fexceptions -g -grecord-gcc-switches -pipe -Wall -Werror=format-security -Wp,-D_FORTIFY_SOURCE=2 -Wp,-D_GLIBCXX_ASSERTIONS -specs=/usr/lib/rpm/OpenCloudOS/OpenCloudOS-hardened-cc1 -fstack-protector-strong  -m64 -march=x86-64-v2 -mtune=generic -fasynchronous-unwind-tables -fstack-clash-protection -fcf-protection -fPIC -fno-semantic-interposition -fvisibility-inlines-hidden -Werror=date-time -fno-lifetime-dse -Wall -Wextra -Wno-unused-parameter -Wwrite-strings -Wcast-qual -Wno-missing-field-initializers -Wimplicit-fallthrough -Wno-nonnull -Wno-class-memaccess -Wno-redundant-move -Wno-pessimizing-move -Wno-noexcept-type -Wdelete-non-virtual-dtor -Wsuggest-override -Wno-comment -Wno-misleading-indentation -Wctad-maybe-unsupported -fdiagnostics-color -ffunction-sections -fdata-sections -O2 -g -DNDEBUG -std=c++17 -fPIC  -fno-exceptions -funwind-tables -MD -MT COFF/CMakeFiles/lldCOFF.dir/InputFiles.cpp.o -MF COFF/CMakeFiles/lldCOFF.dir/InputFiles.cpp.o.d -o COFF/CMakeFiles/lldCOFF.dir/InputFiles.cpp.o -c /builddir/build/BUILD/lld-17.0.6.src/COFF/InputFiles.cpp
[92/132] /usr/bin/g++ -D__STDC_CONSTANT_MACROS -D__STDC_FORMAT_MACROS -D__STDC_LIMIT_MACROS -I/builddir/build/BUILD/lld-17.0.6.src/x86_64-OpenCloudOS-linux-gnu/ELF -I/builddir/build/BUILD/lld-17.0.6.src/ELF -I/builddir/build/BUILD/lld-17.0.6.src/include -I/builddir/build/BUILD/lld-17.0.6.src/x86_64-OpenCloudOS-linux-gnu/include -O2  -fexceptions -g -grecord-gcc-switches -pipe -Wall -Werror=format-security -Wp,-D_FORTIFY_SOURCE=2 -Wp,-D_GLIBCXX_ASSERTIONS -specs=/usr/lib/rpm/OpenCloudOS/OpenCloudOS-hardened-cc1 -fstack-protector-strong  -m64 -march=x86-64-v2 -mtune=generic -fasynchronous-unwind-tables -fstack-clash-protection -fcf-protection -fPIC -fno-semantic-interposition -fvisibility-inlines-hidden -Werror=date-time -fno-lifetime-dse -Wall -Wextra -Wno-unused-parameter -Wwrite-strings -Wcast-qual -Wno-missing-field-initializers -Wimplicit-fallthrough -Wno-nonnull -Wno-class-memaccess -Wno-redundant-move -Wno-pessimizing-move -Wno-noexcept-type -Wdelete-non-virtual-dtor -Wsuggest-override -Wno-comment -Wno-misleading-indentation -Wctad-maybe-unsupported -fdiagnostics-color -ffunction-sections -fdata-sections -O2 -g -DNDEBUG -std=c++17 -fPIC  -fno-exceptions -funwind-tables -MD -MT ELF/CMakeFiles/lldELF.dir/LTO.cpp.o -MF ELF/CMakeFiles/lldELF.dir/LTO.cpp.o.d -o ELF/CMakeFiles/lldELF.dir/LTO.cpp.o -c /builddir/build/BUILD/lld-17.0.6.src/ELF/LTO.cpp
[93/132] /usr/bin/g++ -D__STDC_CONSTANT_MACROS -D__STDC_FORMAT_MACROS -D__STDC_LIMIT_MACROS -I/builddir/build/BUILD/lld-17.0.6.src/x86_64-OpenCloudOS-linux-gnu/MachO -I/builddir/build/BUILD/lld-17.0.6.src/MachO -I/builddir/build/BUILD/lld-17.0.6.src/include -I/builddir/build/BUILD/lld-17.0.6.src/x86_64-OpenCloudOS-linux-gnu/include -I/usr/share/llvm/src/../libunwind/include -O2  -fexceptions -g -grecord-gcc-switches -pipe -Wall -Werror=format-security -Wp,-D_FORTIFY_SOURCE=2 -Wp,-D_GLIBCXX_ASSERTIONS -specs=/usr/lib/rpm/OpenCloudOS/OpenCloudOS-hardened-cc1 -fstack-protector-strong  -m64 -march=x86-64-v2 -mtune=generic -fasynchronous-unwind-tables -fstack-clash-protection -fcf-protection -fPIC -fno-semantic-interposition -fvisibility-inlines-hidden -Werror=date-time -fno-lifetime-dse -Wall -Wextra -Wno-unused-parameter -Wwrite-strings -Wcast-qual -Wno-missing-field-initializers -Wimplicit-fallthrough -Wno-nonnull -Wno-class-memaccess -Wno-redundant-move -Wno-pessimizing-move -Wno-noexcept-type -Wdelete-non-virtual-dtor -Wsuggest-override -Wno-comment -Wno-misleading-indentation -Wctad-maybe-unsupported -fdiagnostics-color -ffunction-sections -fdata-sections -O2 -g -DNDEBUG -std=c++17 -fPIC  -fno-exceptions -funwind-tables -MD -MT MachO/CMakeFiles/lldMachO.dir/SymbolTable.cpp.o -MF MachO/CMakeFiles/lldMachO.dir/SymbolTable.cpp.o.d -o MachO/CMakeFiles/lldMachO.dir/SymbolTable.cpp.o -c /builddir/build/BUILD/lld-17.0.6.src/MachO/SymbolTable.cpp
[94/132] /usr/bin/g++ -D__STDC_CONSTANT_MACROS -D__STDC_FORMAT_MACROS -D__STDC_LIMIT_MACROS -I/builddir/build/BUILD/lld-17.0.6.src/x86_64-OpenCloudOS-linux-gnu/MachO -I/builddir/build/BUILD/lld-17.0.6.src/MachO -I/builddir/build/BUILD/lld-17.0.6.src/include -I/builddir/build/BUILD/lld-17.0.6.src/x86_64-OpenCloudOS-linux-gnu/include -I/usr/share/llvm/src/../libunwind/include -O2  -fexceptions -g -grecord-gcc-switches -pipe -Wall -Werror=format-security -Wp,-D_FORTIFY_SOURCE=2 -Wp,-D_GLIBCXX_ASSERTIONS -specs=/usr/lib/rpm/OpenCloudOS/OpenCloudOS-hardened-cc1 -fstack-protector-strong  -m64 -march=x86-64-v2 -mtune=generic -fasynchronous-unwind-tables -fstack-clash-protection -fcf-protection -fPIC -fno-semantic-interposition -fvisibility-inlines-hidden -Werror=date-time -fno-lifetime-dse -Wall -Wextra -Wno-unused-parameter -Wwrite-strings -Wcast-qual -Wno-missing-field-initializers -Wimplicit-fallthrough -Wno-nonnull -Wno-class-memaccess -Wno-redundant-move -Wno-pessimizing-move -Wno-noexcept-type -Wdelete-non-virtual-dtor -Wsuggest-override -Wno-comment -Wno-misleading-indentation -Wctad-maybe-unsupported -fdiagnostics-color -ffunction-sections -fdata-sections -O2 -g -DNDEBUG -std=c++17 -fPIC  -fno-exceptions -funwind-tables -MD -MT MachO/CMakeFiles/lldMachO.dir/UnwindInfoSection.cpp.o -MF MachO/CMakeFiles/lldMachO.dir/UnwindInfoSection.cpp.o.d -o MachO/CMakeFiles/lldMachO.dir/UnwindInfoSection.cpp.o -c /builddir/build/BUILD/lld-17.0.6.src/MachO/UnwindInfoSection.cpp
[95/132] /usr/bin/g++ -D__STDC_CONSTANT_MACROS -D__STDC_FORMAT_MACROS -D__STDC_LIMIT_MACROS -I/builddir/build/BUILD/lld-17.0.6.src/x86_64-OpenCloudOS-linux-gnu/COFF -I/builddir/build/BUILD/lld-17.0.6.src/COFF -I/builddir/build/BUILD/lld-17.0.6.src/include -I/builddir/build/BUILD/lld-17.0.6.src/x86_64-OpenCloudOS-linux-gnu/include -O2  -fexceptions -g -grecord-gcc-switches -pipe -Wall -Werror=format-security -Wp,-D_FORTIFY_SOURCE=2 -Wp,-D_GLIBCXX_ASSERTIONS -specs=/usr/lib/rpm/OpenCloudOS/OpenCloudOS-hardened-cc1 -fstack-protector-strong  -m64 -march=x86-64-v2 -mtune=generic -fasynchronous-unwind-tables -fstack-clash-protection -fcf-protection -fPIC -fno-semantic-interposition -fvisibility-inlines-hidden -Werror=date-time -fno-lifetime-dse -Wall -Wextra -Wno-unused-parameter -Wwrite-strings -Wcast-qual -Wno-missing-field-initializers -Wimplicit-fallthrough -Wno-nonnull -Wno-class-memaccess -Wno-redundant-move -Wno-pessimizing-move -Wno-noexcept-type -Wdelete-non-virtual-dtor -Wsuggest-override -Wno-comment -Wno-misleading-indentation -Wctad-maybe-unsupported -fdiagnostics-color -ffunction-sections -fdata-sections -O2 -g -DNDEBUG -std=c++17 -fPIC  -fno-exceptions -funwind-tables -MD -MT COFF/CMakeFiles/lldCOFF.dir/Driver.cpp.o -MF COFF/CMakeFiles/lldCOFF.dir/Driver.cpp.o.d -o COFF/CMakeFiles/lldCOFF.dir/Driver.cpp.o -c /builddir/build/BUILD/lld-17.0.6.src/COFF/Driver.cpp
[96/132] /usr/bin/g++ -D__STDC_CONSTANT_MACROS -D__STDC_FORMAT_MACROS -D__STDC_LIMIT_MACROS -I/builddir/build/BUILD/lld-17.0.6.src/x86_64-OpenCloudOS-linux-gnu/wasm -I/builddir/build/BUILD/lld-17.0.6.src/wasm -I/builddir/build/BUILD/lld-17.0.6.src/include -I/builddir/build/BUILD/lld-17.0.6.src/x86_64-OpenCloudOS-linux-gnu/include -O2  -fexceptions -g -grecord-gcc-switches -pipe -Wall -Werror=format-security -Wp,-D_FORTIFY_SOURCE=2 -Wp,-D_GLIBCXX_ASSERTIONS -specs=/usr/lib/rpm/OpenCloudOS/OpenCloudOS-hardened-cc1 -fstack-protector-strong  -m64 -march=x86-64-v2 -mtune=generic -fasynchronous-unwind-tables -fstack-clash-protection -fcf-protection -fPIC -fno-semantic-interposition -fvisibility-inlines-hidden -Werror=date-time -fno-lifetime-dse -Wall -Wextra -Wno-unused-parameter -Wwrite-strings -Wcast-qual -Wno-missing-field-initializers -Wimplicit-fallthrough -Wno-nonnull -Wno-class-memaccess -Wno-redundant-move -Wno-pessimizing-move -Wno-noexcept-type -Wdelete-non-virtual-dtor -Wsuggest-override -Wno-comment -Wno-misleading-indentation -Wctad-maybe-unsupported -fdiagnostics-color -ffunction-sections -fdata-sections -O2 -g -DNDEBUG -std=c++17 -fPIC  -fno-exceptions -funwind-tables -MD -MT wasm/CMakeFiles/lldWasm.dir/WriterUtils.cpp.o -MF wasm/CMakeFiles/lldWasm.dir/WriterUtils.cpp.o.d -o wasm/CMakeFiles/lldWasm.dir/WriterUtils.cpp.o -c /builddir/build/BUILD/lld-17.0.6.src/wasm/WriterUtils.cpp
[97/132] /usr/bin/g++ -D__STDC_CONSTANT_MACROS -D__STDC_FORMAT_MACROS -D__STDC_LIMIT_MACROS -I/builddir/build/BUILD/lld-17.0.6.src/x86_64-OpenCloudOS-linux-gnu/ELF -I/builddir/build/BUILD/lld-17.0.6.src/ELF -I/builddir/build/BUILD/lld-17.0.6.src/include -I/builddir/build/BUILD/lld-17.0.6.src/x86_64-OpenCloudOS-linux-gnu/include -O2  -fexceptions -g -grecord-gcc-switches -pipe -Wall -Werror=format-security -Wp,-D_FORTIFY_SOURCE=2 -Wp,-D_GLIBCXX_ASSERTIONS -specs=/usr/lib/rpm/OpenCloudOS/OpenCloudOS-hardened-cc1 -fstack-protector-strong  -m64 -march=x86-64-v2 -mtune=generic -fasynchronous-unwind-tables -fstack-clash-protection -fcf-protection -fPIC -fno-semantic-interposition -fvisibility-inlines-hidden -Werror=date-time -fno-lifetime-dse -Wall -Wextra -Wno-unused-parameter -Wwrite-strings -Wcast-qual -Wno-missing-field-initializers -Wimplicit-fallthrough -Wno-nonnull -Wno-class-memaccess -Wno-redundant-move -Wno-pessimizing-move -Wno-noexcept-type -Wdelete-non-virtual-dtor -Wsuggest-override -Wno-comment -Wno-misleading-indentation -Wctad-maybe-unsupported -fdiagnostics-color -ffunction-sections -fdata-sections -O2 -g -DNDEBUG -std=c++17 -fPIC  -fno-exceptions -funwind-tables -MD -MT ELF/CMakeFiles/lldELF.dir/InputSection.cpp.o -MF ELF/CMakeFiles/lldELF.dir/InputSection.cpp.o.d -o ELF/CMakeFiles/lldELF.dir/InputSection.cpp.o -c /builddir/build/BUILD/lld-17.0.6.src/ELF/InputSection.cpp
[98/132] : && /usr/bin/g++ -fPIC -O2  -fexceptions -g -grecord-gcc-switches -pipe -Wall -Werror=format-security -Wp,-D_FORTIFY_SOURCE=2 -Wp,-D_GLIBCXX_ASSERTIONS -specs=/usr/lib/rpm/OpenCloudOS/OpenCloudOS-hardened-cc1 -fstack-protector-strong  -m64 -march=x86-64-v2 -mtune=generic -fasynchronous-unwind-tables -fstack-clash-protection -fcf-protection -fPIC -fno-semantic-interposition -fvisibility-inlines-hidden -Werror=date-time -fno-lifetime-dse -Wall -Wextra -Wno-unused-parameter -Wwrite-strings -Wcast-qual -Wno-missing-field-initializers -Wimplicit-fallthrough -Wno-nonnull -Wno-class-memaccess -Wno-redundant-move -Wno-pessimizing-move -Wno-noexcept-type -Wdelete-non-virtual-dtor -Wsuggest-override -Wno-comment -Wno-misleading-indentation -Wctad-maybe-unsupported -fdiagnostics-color -ffunction-sections -fdata-sections -O2 -g -DNDEBUG  -Wl,-z,relro -Wl,--as-needed  -Wl,-z,now -specs=/usr/lib/rpm/OpenCloudOS/OpenCloudOS-hardened-ld  -Wl,--build-id=sha1 -Wl,-z,defs -Wl,-z,nodelete   -Wl,-rpath-link,/builddir/build/BUILD/lld-17.0.6.src/x86_64-OpenCloudOS-linux-gnu/./lib64  -Wl,--gc-sections -shared -Wl,-soname,liblldCOFF.so.17 -o lib64/liblldCOFF.so.17 COFF/CMakeFiles/lldCOFF.dir/CallGraphSort.cpp.o COFF/CMakeFiles/lldCOFF.dir/Chunks.cpp.o COFF/CMakeFiles/lldCOFF.dir/COFFLinkerContext.cpp.o COFF/CMakeFiles/lldCOFF.dir/DebugTypes.cpp.o COFF/CMakeFiles/lldCOFF.dir/DLL.cpp.o COFF/CMakeFiles/lldCOFF.dir/Driver.cpp.o COFF/CMakeFiles/lldCOFF.dir/DriverUtils.cpp.o COFF/CMakeFiles/lldCOFF.dir/ICF.cpp.o COFF/CMakeFiles/lldCOFF.dir/InputFiles.cpp.o COFF/CMakeFiles/lldCOFF.dir/LLDMapFile.cpp.o COFF/CMakeFiles/lldCOFF.dir/LTO.cpp.o COFF/CMakeFiles/lldCOFF.dir/MapFile.cpp.o COFF/CMakeFiles/lldCOFF.dir/MarkLive.cpp.o COFF/CMakeFiles/lldCOFF.dir/MinGW.cpp.o COFF/CMakeFiles/lldCOFF.dir/PDB.cpp.o COFF/CMakeFiles/lldCOFF.dir/SymbolTable.cpp.o COFF/CMakeFiles/lldCOFF.dir/Symbols.cpp.o COFF/CMakeFiles/lldCOFF.dir/Writer.cpp.o  lib64/liblldCommon.so.17  /usr/lib64/libLLVM-17.so && :
[99/132] /usr/bin/cmake -E cmake_symlink_library lib64/liblldCOFF.so.17 lib64/liblldCOFF.so.17 lib64/liblldCOFF.so && :
[100/132] : && /usr/bin/g++ -fPIC -O2  -fexceptions -g -grecord-gcc-switches -pipe -Wall -Werror=format-security -Wp,-D_FORTIFY_SOURCE=2 -Wp,-D_GLIBCXX_ASSERTIONS -specs=/usr/lib/rpm/OpenCloudOS/OpenCloudOS-hardened-cc1 -fstack-protector-strong  -m64 -march=x86-64-v2 -mtune=generic -fasynchronous-unwind-tables -fstack-clash-protection -fcf-protection -fPIC -fno-semantic-interposition -fvisibility-inlines-hidden -Werror=date-time -fno-lifetime-dse -Wall -Wextra -Wno-unused-parameter -Wwrite-strings -Wcast-qual -Wno-missing-field-initializers -Wimplicit-fallthrough -Wno-nonnull -Wno-class-memaccess -Wno-redundant-move -Wno-pessimizing-move -Wno-noexcept-type -Wdelete-non-virtual-dtor -Wsuggest-override -Wno-comment -Wno-misleading-indentation -Wctad-maybe-unsupported -fdiagnostics-color -ffunction-sections -fdata-sections -O2 -g -DNDEBUG  -Wl,-z,relro -Wl,--as-needed  -Wl,-z,now -specs=/usr/lib/rpm/OpenCloudOS/OpenCloudOS-hardened-ld  -Wl,--build-id=sha1 -Wl,-z,defs -Wl,-z,nodelete   -Wl,-rpath-link,/builddir/build/BUILD/lld-17.0.6.src/x86_64-OpenCloudOS-linux-gnu/./lib64  -Wl,--gc-sections -shared -Wl,-soname,liblldMinGW.so.17 -o lib64/liblldMinGW.so.17 MinGW/CMakeFiles/lldMinGW.dir/Driver.cpp.o  lib64/liblldCOFF.so.17  lib64/liblldCommon.so.17  /usr/lib64/libLLVM-17.so && :
[101/132] /usr/bin/cmake -E cmake_symlink_library lib64/liblldMinGW.so.17 lib64/liblldMinGW.so.17 lib64/liblldMinGW.so && :
[102/132] /usr/bin/g++ -D__STDC_CONSTANT_MACROS -D__STDC_FORMAT_MACROS -D__STDC_LIMIT_MACROS -I/builddir/build/BUILD/lld-17.0.6.src/x86_64-OpenCloudOS-linux-gnu/MachO -I/builddir/build/BUILD/lld-17.0.6.src/MachO -I/builddir/build/BUILD/lld-17.0.6.src/include -I/builddir/build/BUILD/lld-17.0.6.src/x86_64-OpenCloudOS-linux-gnu/include -I/usr/share/llvm/src/../libunwind/include -O2  -fexceptions -g -grecord-gcc-switches -pipe -Wall -Werror=format-security -Wp,-D_FORTIFY_SOURCE=2 -Wp,-D_GLIBCXX_ASSERTIONS -specs=/usr/lib/rpm/OpenCloudOS/OpenCloudOS-hardened-cc1 -fstack-protector-strong  -m64 -march=x86-64-v2 -mtune=generic -fasynchronous-unwind-tables -fstack-clash-protection -fcf-protection -fPIC -fno-semantic-interposition -fvisibility-inlines-hidden -Werror=date-time -fno-lifetime-dse -Wall -Wextra -Wno-unused-parameter -Wwrite-strings -Wcast-qual -Wno-missing-field-initializers -Wimplicit-fallthrough -Wno-nonnull -Wno-class-memaccess -Wno-redundant-move -Wno-pessimizing-move -Wno-noexcept-type -Wdelete-non-virtual-dtor -Wsuggest-override -Wno-comment -Wno-misleading-indentation -Wctad-maybe-unsupported -fdiagnostics-color -ffunction-sections -fdata-sections -O2 -g -DNDEBUG -std=c++17 -fPIC  -fno-exceptions -funwind-tables -MD -MT MachO/CMakeFiles/lldMachO.dir/DriverUtils.cpp.o -MF MachO/CMakeFiles/lldMachO.dir/DriverUtils.cpp.o.d -o MachO/CMakeFiles/lldMachO.dir/DriverUtils.cpp.o -c /builddir/build/BUILD/lld-17.0.6.src/MachO/DriverUtils.cpp
[103/132] /usr/bin/g++ -D__STDC_CONSTANT_MACROS -D__STDC_FORMAT_MACROS -D__STDC_LIMIT_MACROS -I/builddir/build/BUILD/lld-17.0.6.src/x86_64-OpenCloudOS-linux-gnu/MachO -I/builddir/build/BUILD/lld-17.0.6.src/MachO -I/builddir/build/BUILD/lld-17.0.6.src/include -I/builddir/build/BUILD/lld-17.0.6.src/x86_64-OpenCloudOS-linux-gnu/include -I/usr/share/llvm/src/../libunwind/include -O2  -fexceptions -g -grecord-gcc-switches -pipe -Wall -Werror=format-security -Wp,-D_FORTIFY_SOURCE=2 -Wp,-D_GLIBCXX_ASSERTIONS -specs=/usr/lib/rpm/OpenCloudOS/OpenCloudOS-hardened-cc1 -fstack-protector-strong  -m64 -march=x86-64-v2 -mtune=generic -fasynchronous-unwind-tables -fstack-clash-protection -fcf-protection -fPIC -fno-semantic-interposition -fvisibility-inlines-hidden -Werror=date-time -fno-lifetime-dse -Wall -Wextra -Wno-unused-parameter -Wwrite-strings -Wcast-qual -Wno-missing-field-initializers -Wimplicit-fallthrough -Wno-nonnull -Wno-class-memaccess -Wno-redundant-move -Wno-pessimizing-move -Wno-noexcept-type -Wdelete-non-virtual-dtor -Wsuggest-override -Wno-comment -Wno-misleading-indentation -Wctad-maybe-unsupported -fdiagnostics-color -ffunction-sections -fdata-sections -O2 -g -DNDEBUG -std=c++17 -fPIC  -fno-exceptions -funwind-tables -MD -MT MachO/CMakeFiles/lldMachO.dir/Writer.cpp.o -MF MachO/CMakeFiles/lldMachO.dir/Writer.cpp.o.d -o MachO/CMakeFiles/lldMachO.dir/Writer.cpp.o -c /builddir/build/BUILD/lld-17.0.6.src/MachO/Writer.cpp
[104/132] /usr/bin/g++ -D__STDC_CONSTANT_MACROS -D__STDC_FORMAT_MACROS -D__STDC_LIMIT_MACROS -I/builddir/build/BUILD/lld-17.0.6.src/x86_64-OpenCloudOS-linux-gnu/wasm -I/builddir/build/BUILD/lld-17.0.6.src/wasm -I/builddir/build/BUILD/lld-17.0.6.src/include -I/builddir/build/BUILD/lld-17.0.6.src/x86_64-OpenCloudOS-linux-gnu/include -O2  -fexceptions -g -grecord-gcc-switches -pipe -Wall -Werror=format-security -Wp,-D_FORTIFY_SOURCE=2 -Wp,-D_GLIBCXX_ASSERTIONS -specs=/usr/lib/rpm/OpenCloudOS/OpenCloudOS-hardened-cc1 -fstack-protector-strong  -m64 -march=x86-64-v2 -mtune=generic -fasynchronous-unwind-tables -fstack-clash-protection -fcf-protection -fPIC -fno-semantic-interposition -fvisibility-inlines-hidden -Werror=date-time -fno-lifetime-dse -Wall -Wextra -Wno-unused-parameter -Wwrite-strings -Wcast-qual -Wno-missing-field-initializers -Wimplicit-fallthrough -Wno-nonnull -Wno-class-memaccess -Wno-redundant-move -Wno-pessimizing-move -Wno-noexcept-type -Wdelete-non-virtual-dtor -Wsuggest-override -Wno-comment -Wno-misleading-indentation -Wctad-maybe-unsupported -fdiagnostics-color -ffunction-sections -fdata-sections -O2 -g -DNDEBUG -std=c++17 -fPIC  -fno-exceptions -funwind-tables -MD -MT wasm/CMakeFiles/lldWasm.dir/MarkLive.cpp.o -MF wasm/CMakeFiles/lldWasm.dir/MarkLive.cpp.o.d -o wasm/CMakeFiles/lldWasm.dir/MarkLive.cpp.o -c /builddir/build/BUILD/lld-17.0.6.src/wasm/MarkLive.cpp
[105/132] /usr/bin/g++ -D__STDC_CONSTANT_MACROS -D__STDC_FORMAT_MACROS -D__STDC_LIMIT_MACROS -I/builddir/build/BUILD/lld-17.0.6.src/x86_64-OpenCloudOS-linux-gnu/ELF -I/builddir/build/BUILD/lld-17.0.6.src/ELF -I/builddir/build/BUILD/lld-17.0.6.src/include -I/builddir/build/BUILD/lld-17.0.6.src/x86_64-OpenCloudOS-linux-gnu/include -O2  -fexceptions -g -grecord-gcc-switches -pipe -Wall -Werror=format-security -Wp,-D_FORTIFY_SOURCE=2 -Wp,-D_GLIBCXX_ASSERTIONS -specs=/usr/lib/rpm/OpenCloudOS/OpenCloudOS-hardened-cc1 -fstack-protector-strong  -m64 -march=x86-64-v2 -mtune=generic -fasynchronous-unwind-tables -fstack-clash-protection -fcf-protection -fPIC -fno-semantic-interposition -fvisibility-inlines-hidden -Werror=date-time -fno-lifetime-dse -Wall -Wextra -Wno-unused-parameter -Wwrite-strings -Wcast-qual -Wno-missing-field-initializers -Wimplicit-fallthrough -Wno-nonnull -Wno-class-memaccess -Wno-redundant-move -Wno-pessimizing-move -Wno-noexcept-type -Wdelete-non-virtual-dtor -Wsuggest-override -Wno-comment -Wno-misleading-indentation -Wctad-maybe-unsupported -fdiagnostics-color -ffunction-sections -fdata-sections -O2 -g -DNDEBUG -std=c++17 -fPIC  -fno-exceptions -funwind-tables -MD -MT ELF/CMakeFiles/lldELF.dir/Relocations.cpp.o -MF ELF/CMakeFiles/lldELF.dir/Relocations.cpp.o.d -o ELF/CMakeFiles/lldELF.dir/Relocations.cpp.o -c /builddir/build/BUILD/lld-17.0.6.src/ELF/Relocations.cpp
In lambda function,
    inlined from 'static Ret llvm::function_ref<Ret(Params ...)>::callback_fn(intptr_t, Params ...) [with Callable = lld::elf::ThunkCreator::createInitialThunkSections(llvm::ArrayRef<lld::elf::OutputSection*>)::<lambda(lld::elf::OutputSection*, lld::elf::InputSectionDescription*)>; Ret = void; Params = {lld::elf::OutputSection*, lld::elf::InputSectionDescription*}]' at /usr/include/llvm/ADT/STLFunctionalExtras.h:45:52:
/builddir/build/BUILD/lld-17.0.6.src/ELF/Relocations.cpp:2036:24: warning: 'isecLimit' may be used uninitialized [-Wmaybe-uninitialized]
 2036 |         addThunkSection(os, isd, isecLimit);
      |         ~~~~~~~~~~~~~~~^~~~~~~~~~~~~~~~~~~~
/builddir/build/BUILD/lld-17.0.6.src/ELF/Relocations.cpp: In static member function 'static Ret llvm::function_ref<Ret(Params ...)>::callback_fn(intptr_t, Params ...) [with Callable = lld::elf::ThunkCreator::createInitialThunkSections(llvm::ArrayRef<lld::elf::OutputSection*>)::<lambda(lld::elf::OutputSection*, lld::elf::InputSectionDescription*)>; Ret = void; Params = {lld::elf::OutputSection*, lld::elf::InputSectionDescription*}]':
/builddir/build/BUILD/lld-17.0.6.src/ELF/Relocations.cpp:2022:18: note: 'isecLimit' was declared here
 2022 |         uint32_t isecLimit;
      |                  ^~~~~~~~~
[106/132] /usr/bin/g++ -D__STDC_CONSTANT_MACROS -D__STDC_FORMAT_MACROS -D__STDC_LIMIT_MACROS -I/builddir/build/BUILD/lld-17.0.6.src/x86_64-OpenCloudOS-linux-gnu/wasm -I/builddir/build/BUILD/lld-17.0.6.src/wasm -I/builddir/build/BUILD/lld-17.0.6.src/include -I/builddir/build/BUILD/lld-17.0.6.src/x86_64-OpenCloudOS-linux-gnu/include -O2  -fexceptions -g -grecord-gcc-switches -pipe -Wall -Werror=format-security -Wp,-D_FORTIFY_SOURCE=2 -Wp,-D_GLIBCXX_ASSERTIONS -specs=/usr/lib/rpm/OpenCloudOS/OpenCloudOS-hardened-cc1 -fstack-protector-strong  -m64 -march=x86-64-v2 -mtune=generic -fasynchronous-unwind-tables -fstack-clash-protection -fcf-protection -fPIC -fno-semantic-interposition -fvisibility-inlines-hidden -Werror=date-time -fno-lifetime-dse -Wall -Wextra -Wno-unused-parameter -Wwrite-strings -Wcast-qual -Wno-missing-field-initializers -Wimplicit-fallthrough -Wno-nonnull -Wno-class-memaccess -Wno-redundant-move -Wno-pessimizing-move -Wno-noexcept-type -Wdelete-non-virtual-dtor -Wsuggest-override -Wno-comment -Wno-misleading-indentation -Wctad-maybe-unsupported -fdiagnostics-color -ffunction-sections -fdata-sections -O2 -g -DNDEBUG -std=c++17 -fPIC  -fno-exceptions -funwind-tables -MD -MT wasm/CMakeFiles/lldWasm.dir/InputChunks.cpp.o -MF wasm/CMakeFiles/lldWasm.dir/InputChunks.cpp.o.d -o wasm/CMakeFiles/lldWasm.dir/InputChunks.cpp.o -c /builddir/build/BUILD/lld-17.0.6.src/wasm/InputChunks.cpp
[107/132] /usr/bin/g++ -D__STDC_CONSTANT_MACROS -D__STDC_FORMAT_MACROS -D__STDC_LIMIT_MACROS -I/builddir/build/BUILD/lld-17.0.6.src/x86_64-OpenCloudOS-linux-gnu/MachO -I/builddir/build/BUILD/lld-17.0.6.src/MachO -I/builddir/build/BUILD/lld-17.0.6.src/include -I/builddir/build/BUILD/lld-17.0.6.src/x86_64-OpenCloudOS-linux-gnu/include -I/usr/share/llvm/src/../libunwind/include -O2  -fexceptions -g -grecord-gcc-switches -pipe -Wall -Werror=format-security -Wp,-D_FORTIFY_SOURCE=2 -Wp,-D_GLIBCXX_ASSERTIONS -specs=/usr/lib/rpm/OpenCloudOS/OpenCloudOS-hardened-cc1 -fstack-protector-strong  -m64 -march=x86-64-v2 -mtune=generic -fasynchronous-unwind-tables -fstack-clash-protection -fcf-protection -fPIC -fno-semantic-interposition -fvisibility-inlines-hidden -Werror=date-time -fno-lifetime-dse -Wall -Wextra -Wno-unused-parameter -Wwrite-strings -Wcast-qual -Wno-missing-field-initializers -Wimplicit-fallthrough -Wno-nonnull -Wno-class-memaccess -Wno-redundant-move -Wno-pessimizing-move -Wno-noexcept-type -Wdelete-non-virtual-dtor -Wsuggest-override -Wno-comment -Wno-misleading-indentation -Wctad-maybe-unsupported -fdiagnostics-color -ffunction-sections -fdata-sections -O2 -g -DNDEBUG -std=c++17 -fPIC  -fno-exceptions -funwind-tables -MD -MT MachO/CMakeFiles/lldMachO.dir/LTO.cpp.o -MF MachO/CMakeFiles/lldMachO.dir/LTO.cpp.o.d -o MachO/CMakeFiles/lldMachO.dir/LTO.cpp.o -c /builddir/build/BUILD/lld-17.0.6.src/MachO/LTO.cpp
[108/132] /usr/bin/g++ -D__STDC_CONSTANT_MACROS -D__STDC_FORMAT_MACROS -D__STDC_LIMIT_MACROS -I/builddir/build/BUILD/lld-17.0.6.src/x86_64-OpenCloudOS-linux-gnu/MachO -I/builddir/build/BUILD/lld-17.0.6.src/MachO -I/builddir/build/BUILD/lld-17.0.6.src/include -I/builddir/build/BUILD/lld-17.0.6.src/x86_64-OpenCloudOS-linux-gnu/include -I/usr/share/llvm/src/../libunwind/include -O2  -fexceptions -g -grecord-gcc-switches -pipe -Wall -Werror=format-security -Wp,-D_FORTIFY_SOURCE=2 -Wp,-D_GLIBCXX_ASSERTIONS -specs=/usr/lib/rpm/OpenCloudOS/OpenCloudOS-hardened-cc1 -fstack-protector-strong  -m64 -march=x86-64-v2 -mtune=generic -fasynchronous-unwind-tables -fstack-clash-protection -fcf-protection -fPIC -fno-semantic-interposition -fvisibility-inlines-hidden -Werror=date-time -fno-lifetime-dse -Wall -Wextra -Wno-unused-parameter -Wwrite-strings -Wcast-qual -Wno-missing-field-initializers -Wimplicit-fallthrough -Wno-nonnull -Wno-class-memaccess -Wno-redundant-move -Wno-pessimizing-move -Wno-noexcept-type -Wdelete-non-virtual-dtor -Wsuggest-override -Wno-comment -Wno-misleading-indentation -Wctad-maybe-unsupported -fdiagnostics-color -ffunction-sections -fdata-sections -O2 -g -DNDEBUG -std=c++17 -fPIC  -fno-exceptions -funwind-tables -MD -MT MachO/CMakeFiles/lldMachO.dir/SyntheticSections.cpp.o -MF MachO/CMakeFiles/lldMachO.dir/SyntheticSections.cpp.o.d -o MachO/CMakeFiles/lldMachO.dir/SyntheticSections.cpp.o -c /builddir/build/BUILD/lld-17.0.6.src/MachO/SyntheticSections.cpp
/builddir/build/BUILD/lld-17.0.6.src/MachO/SyntheticSections.cpp: In member function 'void lld::macho::ObjCImageInfoSection::finalizeContents()':
/builddir/build/BUILD/lld-17.0.6.src/MachO/SyntheticSections.cpp:1828:50: warning: 'firstFile' may be used uninitialized [-Wmaybe-uninitialized]
 1828 |       error("Swift version mismatch: " + toString(firstFile) + " has version " +
      |                                          ~~~~~~~~^~~~~~~~~~~
/builddir/build/BUILD/lld-17.0.6.src/MachO/SyntheticSections.cpp:1818:20: note: 'firstFile' was declared here
 1818 |   const InputFile *firstFile;
      |                    ^~~~~~~~~
[109/132] /usr/bin/g++ -D__STDC_CONSTANT_MACROS -D__STDC_FORMAT_MACROS -D__STDC_LIMIT_MACROS -I/builddir/build/BUILD/lld-17.0.6.src/x86_64-OpenCloudOS-linux-gnu/wasm -I/builddir/build/BUILD/lld-17.0.6.src/wasm -I/builddir/build/BUILD/lld-17.0.6.src/include -I/builddir/build/BUILD/lld-17.0.6.src/x86_64-OpenCloudOS-linux-gnu/include -O2  -fexceptions -g -grecord-gcc-switches -pipe -Wall -Werror=format-security -Wp,-D_FORTIFY_SOURCE=2 -Wp,-D_GLIBCXX_ASSERTIONS -specs=/usr/lib/rpm/OpenCloudOS/OpenCloudOS-hardened-cc1 -fstack-protector-strong  -m64 -march=x86-64-v2 -mtune=generic -fasynchronous-unwind-tables -fstack-clash-protection -fcf-protection -fPIC -fno-semantic-interposition -fvisibility-inlines-hidden -Werror=date-time -fno-lifetime-dse -Wall -Wextra -Wno-unused-parameter -Wwrite-strings -Wcast-qual -Wno-missing-field-initializers -Wimplicit-fallthrough -Wno-nonnull -Wno-class-memaccess -Wno-redundant-move -Wno-pessimizing-move -Wno-noexcept-type -Wdelete-non-virtual-dtor -Wsuggest-override -Wno-comment -Wno-misleading-indentation -Wctad-maybe-unsupported -fdiagnostics-color -ffunction-sections -fdata-sections -O2 -g -DNDEBUG -std=c++17 -fPIC  -fno-exceptions -funwind-tables -MD -MT wasm/CMakeFiles/lldWasm.dir/OutputSections.cpp.o -MF wasm/CMakeFiles/lldWasm.dir/OutputSections.cpp.o.d -o wasm/CMakeFiles/lldWasm.dir/OutputSections.cpp.o -c /builddir/build/BUILD/lld-17.0.6.src/wasm/OutputSections.cpp
[110/132] /usr/bin/g++ -D__STDC_CONSTANT_MACROS -D__STDC_FORMAT_MACROS -D__STDC_LIMIT_MACROS -I/builddir/build/BUILD/lld-17.0.6.src/x86_64-OpenCloudOS-linux-gnu/wasm -I/builddir/build/BUILD/lld-17.0.6.src/wasm -I/builddir/build/BUILD/lld-17.0.6.src/include -I/builddir/build/BUILD/lld-17.0.6.src/x86_64-OpenCloudOS-linux-gnu/include -O2  -fexceptions -g -grecord-gcc-switches -pipe -Wall -Werror=format-security -Wp,-D_FORTIFY_SOURCE=2 -Wp,-D_GLIBCXX_ASSERTIONS -specs=/usr/lib/rpm/OpenCloudOS/OpenCloudOS-hardened-cc1 -fstack-protector-strong  -m64 -march=x86-64-v2 -mtune=generic -fasynchronous-unwind-tables -fstack-clash-protection -fcf-protection -fPIC -fno-semantic-interposition -fvisibility-inlines-hidden -Werror=date-time -fno-lifetime-dse -Wall -Wextra -Wno-unused-parameter -Wwrite-strings -Wcast-qual -Wno-missing-field-initializers -Wimplicit-fallthrough -Wno-nonnull -Wno-class-memaccess -Wno-redundant-move -Wno-pessimizing-move -Wno-noexcept-type -Wdelete-non-virtual-dtor -Wsuggest-override -Wno-comment -Wno-misleading-indentation -Wctad-maybe-unsupported -fdiagnostics-color -ffunction-sections -fdata-sections -O2 -g -DNDEBUG -std=c++17 -fPIC  -fno-exceptions -funwind-tables -MD -MT wasm/CMakeFiles/lldWasm.dir/OutputSegment.cpp.o -MF wasm/CMakeFiles/lldWasm.dir/OutputSegment.cpp.o.d -o wasm/CMakeFiles/lldWasm.dir/OutputSegment.cpp.o -c /builddir/build/BUILD/lld-17.0.6.src/wasm/OutputSegment.cpp
[111/132] /usr/bin/g++ -D__STDC_CONSTANT_MACROS -D__STDC_FORMAT_MACROS -D__STDC_LIMIT_MACROS -I/builddir/build/BUILD/lld-17.0.6.src/x86_64-OpenCloudOS-linux-gnu/wasm -I/builddir/build/BUILD/lld-17.0.6.src/wasm -I/builddir/build/BUILD/lld-17.0.6.src/include -I/builddir/build/BUILD/lld-17.0.6.src/x86_64-OpenCloudOS-linux-gnu/include -O2  -fexceptions -g -grecord-gcc-switches -pipe -Wall -Werror=format-security -Wp,-D_FORTIFY_SOURCE=2 -Wp,-D_GLIBCXX_ASSERTIONS -specs=/usr/lib/rpm/OpenCloudOS/OpenCloudOS-hardened-cc1 -fstack-protector-strong  -m64 -march=x86-64-v2 -mtune=generic -fasynchronous-unwind-tables -fstack-clash-protection -fcf-protection -fPIC -fno-semantic-interposition -fvisibility-inlines-hidden -Werror=date-time -fno-lifetime-dse -Wall -Wextra -Wno-unused-parameter -Wwrite-strings -Wcast-qual -Wno-missing-field-initializers -Wimplicit-fallthrough -Wno-nonnull -Wno-class-memaccess -Wno-redundant-move -Wno-pessimizing-move -Wno-noexcept-type -Wdelete-non-virtual-dtor -Wsuggest-override -Wno-comment -Wno-misleading-indentation -Wctad-maybe-unsupported -fdiagnostics-color -ffunction-sections -fdata-sections -O2 -g -DNDEBUG -std=c++17 -fPIC  -fno-exceptions -funwind-tables -MD -MT wasm/CMakeFiles/lldWasm.dir/Relocations.cpp.o -MF wasm/CMakeFiles/lldWasm.dir/Relocations.cpp.o.d -o wasm/CMakeFiles/lldWasm.dir/Relocations.cpp.o -c /builddir/build/BUILD/lld-17.0.6.src/wasm/Relocations.cpp
[112/132] /usr/bin/g++ -D__STDC_CONSTANT_MACROS -D__STDC_FORMAT_MACROS -D__STDC_LIMIT_MACROS -I/builddir/build/BUILD/lld-17.0.6.src/x86_64-OpenCloudOS-linux-gnu/wasm -I/builddir/build/BUILD/lld-17.0.6.src/wasm -I/builddir/build/BUILD/lld-17.0.6.src/include -I/builddir/build/BUILD/lld-17.0.6.src/x86_64-OpenCloudOS-linux-gnu/include -O2  -fexceptions -g -grecord-gcc-switches -pipe -Wall -Werror=format-security -Wp,-D_FORTIFY_SOURCE=2 -Wp,-D_GLIBCXX_ASSERTIONS -specs=/usr/lib/rpm/OpenCloudOS/OpenCloudOS-hardened-cc1 -fstack-protector-strong  -m64 -march=x86-64-v2 -mtune=generic -fasynchronous-unwind-tables -fstack-clash-protection -fcf-protection -fPIC -fno-semantic-interposition -fvisibility-inlines-hidden -Werror=date-time -fno-lifetime-dse -Wall -Wextra -Wno-unused-parameter -Wwrite-strings -Wcast-qual -Wno-missing-field-initializers -Wimplicit-fallthrough -Wno-nonnull -Wno-class-memaccess -Wno-redundant-move -Wno-pessimizing-move -Wno-noexcept-type -Wdelete-non-virtual-dtor -Wsuggest-override -Wno-comment -Wno-misleading-indentation -Wctad-maybe-unsupported -fdiagnostics-color -ffunction-sections -fdata-sections -O2 -g -DNDEBUG -std=c++17 -fPIC  -fno-exceptions -funwind-tables -MD -MT wasm/CMakeFiles/lldWasm.dir/LTO.cpp.o -MF wasm/CMakeFiles/lldWasm.dir/LTO.cpp.o.d -o wasm/CMakeFiles/lldWasm.dir/LTO.cpp.o -c /builddir/build/BUILD/lld-17.0.6.src/wasm/LTO.cpp
[113/132] /usr/bin/g++ -D__STDC_CONSTANT_MACROS -D__STDC_FORMAT_MACROS -D__STDC_LIMIT_MACROS -I/builddir/build/BUILD/lld-17.0.6.src/x86_64-OpenCloudOS-linux-gnu/wasm -I/builddir/build/BUILD/lld-17.0.6.src/wasm -I/builddir/build/BUILD/lld-17.0.6.src/include -I/builddir/build/BUILD/lld-17.0.6.src/x86_64-OpenCloudOS-linux-gnu/include -O2  -fexceptions -g -grecord-gcc-switches -pipe -Wall -Werror=format-security -Wp,-D_FORTIFY_SOURCE=2 -Wp,-D_GLIBCXX_ASSERTIONS -specs=/usr/lib/rpm/OpenCloudOS/OpenCloudOS-hardened-cc1 -fstack-protector-strong  -m64 -march=x86-64-v2 -mtune=generic -fasynchronous-unwind-tables -fstack-clash-protection -fcf-protection -fPIC -fno-semantic-interposition -fvisibility-inlines-hidden -Werror=date-time -fno-lifetime-dse -Wall -Wextra -Wno-unused-parameter -Wwrite-strings -Wcast-qual -Wno-missing-field-initializers -Wimplicit-fallthrough -Wno-nonnull -Wno-class-memaccess -Wno-redundant-move -Wno-pessimizing-move -Wno-noexcept-type -Wdelete-non-virtual-dtor -Wsuggest-override -Wno-comment -Wno-misleading-indentation -Wctad-maybe-unsupported -fdiagnostics-color -ffunction-sections -fdata-sections -O2 -g -DNDEBUG -std=c++17 -fPIC  -fno-exceptions -funwind-tables -MD -MT wasm/CMakeFiles/lldWasm.dir/MapFile.cpp.o -MF wasm/CMakeFiles/lldWasm.dir/MapFile.cpp.o.d -o wasm/CMakeFiles/lldWasm.dir/MapFile.cpp.o -c /builddir/build/BUILD/lld-17.0.6.src/wasm/MapFile.cpp
[114/132] /usr/bin/g++ -D__STDC_CONSTANT_MACROS -D__STDC_FORMAT_MACROS -D__STDC_LIMIT_MACROS -I/builddir/build/BUILD/lld-17.0.6.src/x86_64-OpenCloudOS-linux-gnu/wasm -I/builddir/build/BUILD/lld-17.0.6.src/wasm -I/builddir/build/BUILD/lld-17.0.6.src/include -I/builddir/build/BUILD/lld-17.0.6.src/x86_64-OpenCloudOS-linux-gnu/include -O2  -fexceptions -g -grecord-gcc-switches -pipe -Wall -Werror=format-security -Wp,-D_FORTIFY_SOURCE=2 -Wp,-D_GLIBCXX_ASSERTIONS -specs=/usr/lib/rpm/OpenCloudOS/OpenCloudOS-hardened-cc1 -fstack-protector-strong  -m64 -march=x86-64-v2 -mtune=generic -fasynchronous-unwind-tables -fstack-clash-protection -fcf-protection -fPIC -fno-semantic-interposition -fvisibility-inlines-hidden -Werror=date-time -fno-lifetime-dse -Wall -Wextra -Wno-unused-parameter -Wwrite-strings -Wcast-qual -Wno-missing-field-initializers -Wimplicit-fallthrough -Wno-nonnull -Wno-class-memaccess -Wno-redundant-move -Wno-pessimizing-move -Wno-noexcept-type -Wdelete-non-virtual-dtor -Wsuggest-override -Wno-comment -Wno-misleading-indentation -Wctad-maybe-unsupported -fdiagnostics-color -ffunction-sections -fdata-sections -O2 -g -DNDEBUG -std=c++17 -fPIC  -fno-exceptions -funwind-tables -MD -MT wasm/CMakeFiles/lldWasm.dir/Symbols.cpp.o -MF wasm/CMakeFiles/lldWasm.dir/Symbols.cpp.o.d -o wasm/CMakeFiles/lldWasm.dir/Symbols.cpp.o -c /builddir/build/BUILD/lld-17.0.6.src/wasm/Symbols.cpp
[115/132] /usr/bin/g++ -D__STDC_CONSTANT_MACROS -D__STDC_FORMAT_MACROS -D__STDC_LIMIT_MACROS -I/builddir/build/BUILD/lld-17.0.6.src/x86_64-OpenCloudOS-linux-gnu/MachO -I/builddir/build/BUILD/lld-17.0.6.src/MachO -I/builddir/build/BUILD/lld-17.0.6.src/include -I/builddir/build/BUILD/lld-17.0.6.src/x86_64-OpenCloudOS-linux-gnu/include -I/usr/share/llvm/src/../libunwind/include -O2  -fexceptions -g -grecord-gcc-switches -pipe -Wall -Werror=format-security -Wp,-D_FORTIFY_SOURCE=2 -Wp,-D_GLIBCXX_ASSERTIONS -specs=/usr/lib/rpm/OpenCloudOS/OpenCloudOS-hardened-cc1 -fstack-protector-strong  -m64 -march=x86-64-v2 -mtune=generic -fasynchronous-unwind-tables -fstack-clash-protection -fcf-protection -fPIC -fno-semantic-interposition -fvisibility-inlines-hidden -Werror=date-time -fno-lifetime-dse -Wall -Wextra -Wno-unused-parameter -Wwrite-strings -Wcast-qual -Wno-missing-field-initializers -Wimplicit-fallthrough -Wno-nonnull -Wno-class-memaccess -Wno-redundant-move -Wno-pessimizing-move -Wno-noexcept-type -Wdelete-non-virtual-dtor -Wsuggest-override -Wno-comment -Wno-misleading-indentation -Wctad-maybe-unsupported -fdiagnostics-color -ffunction-sections -fdata-sections -O2 -g -DNDEBUG -std=c++17 -fPIC  -fno-exceptions -funwind-tables -MD -MT MachO/CMakeFiles/lldMachO.dir/Driver.cpp.o -MF MachO/CMakeFiles/lldMachO.dir/Driver.cpp.o.d -o MachO/CMakeFiles/lldMachO.dir/Driver.cpp.o -c /builddir/build/BUILD/lld-17.0.6.src/MachO/Driver.cpp
[116/132] /usr/bin/g++ -D__STDC_CONSTANT_MACROS -D__STDC_FORMAT_MACROS -D__STDC_LIMIT_MACROS -I/builddir/build/BUILD/lld-17.0.6.src/x86_64-OpenCloudOS-linux-gnu/wasm -I/builddir/build/BUILD/lld-17.0.6.src/wasm -I/builddir/build/BUILD/lld-17.0.6.src/include -I/builddir/build/BUILD/lld-17.0.6.src/x86_64-OpenCloudOS-linux-gnu/include -O2  -fexceptions -g -grecord-gcc-switches -pipe -Wall -Werror=format-security -Wp,-D_FORTIFY_SOURCE=2 -Wp,-D_GLIBCXX_ASSERTIONS -specs=/usr/lib/rpm/OpenCloudOS/OpenCloudOS-hardened-cc1 -fstack-protector-strong  -m64 -march=x86-64-v2 -mtune=generic -fasynchronous-unwind-tables -fstack-clash-protection -fcf-protection -fPIC -fno-semantic-interposition -fvisibility-inlines-hidden -Werror=date-time -fno-lifetime-dse -Wall -Wextra -Wno-unused-parameter -Wwrite-strings -Wcast-qual -Wno-missing-field-initializers -Wimplicit-fallthrough -Wno-nonnull -Wno-class-memaccess -Wno-redundant-move -Wno-pessimizing-move -Wno-noexcept-type -Wdelete-non-virtual-dtor -Wsuggest-override -Wno-comment -Wno-misleading-indentation -Wctad-maybe-unsupported -fdiagnostics-color -ffunction-sections -fdata-sections -O2 -g -DNDEBUG -std=c++17 -fPIC  -fno-exceptions -funwind-tables -MD -MT wasm/CMakeFiles/lldWasm.dir/InputFiles.cpp.o -MF wasm/CMakeFiles/lldWasm.dir/InputFiles.cpp.o.d -o wasm/CMakeFiles/lldWasm.dir/InputFiles.cpp.o -c /builddir/build/BUILD/lld-17.0.6.src/wasm/InputFiles.cpp
[117/132] /usr/bin/g++ -D__STDC_CONSTANT_MACROS -D__STDC_FORMAT_MACROS -D__STDC_LIMIT_MACROS -I/builddir/build/BUILD/lld-17.0.6.src/x86_64-OpenCloudOS-linux-gnu/ELF -I/builddir/build/BUILD/lld-17.0.6.src/ELF -I/builddir/build/BUILD/lld-17.0.6.src/include -I/builddir/build/BUILD/lld-17.0.6.src/x86_64-OpenCloudOS-linux-gnu/include -O2  -fexceptions -g -grecord-gcc-switches -pipe -Wall -Werror=format-security -Wp,-D_FORTIFY_SOURCE=2 -Wp,-D_GLIBCXX_ASSERTIONS -specs=/usr/lib/rpm/OpenCloudOS/OpenCloudOS-hardened-cc1 -fstack-protector-strong  -m64 -march=x86-64-v2 -mtune=generic -fasynchronous-unwind-tables -fstack-clash-protection -fcf-protection -fPIC -fno-semantic-interposition -fvisibility-inlines-hidden -Werror=date-time -fno-lifetime-dse -Wall -Wextra -Wno-unused-parameter -Wwrite-strings -Wcast-qual -Wno-missing-field-initializers -Wimplicit-fallthrough -Wno-nonnull -Wno-class-memaccess -Wno-redundant-move -Wno-pessimizing-move -Wno-noexcept-type -Wdelete-non-virtual-dtor -Wsuggest-override -Wno-comment -Wno-misleading-indentation -Wctad-maybe-unsupported -fdiagnostics-color -ffunction-sections -fdata-sections -O2 -g -DNDEBUG -std=c++17 -fPIC  -fno-exceptions -funwind-tables -MD -MT ELF/CMakeFiles/lldELF.dir/Driver.cpp.o -MF ELF/CMakeFiles/lldELF.dir/Driver.cpp.o.d -o ELF/CMakeFiles/lldELF.dir/Driver.cpp.o -c /builddir/build/BUILD/lld-17.0.6.src/ELF/Driver.cpp
[118/132] /usr/bin/g++ -D__STDC_CONSTANT_MACROS -D__STDC_FORMAT_MACROS -D__STDC_LIMIT_MACROS -I/builddir/build/BUILD/lld-17.0.6.src/x86_64-OpenCloudOS-linux-gnu/ELF -I/builddir/build/BUILD/lld-17.0.6.src/ELF -I/builddir/build/BUILD/lld-17.0.6.src/include -I/builddir/build/BUILD/lld-17.0.6.src/x86_64-OpenCloudOS-linux-gnu/include -O2  -fexceptions -g -grecord-gcc-switches -pipe -Wall -Werror=format-security -Wp,-D_FORTIFY_SOURCE=2 -Wp,-D_GLIBCXX_ASSERTIONS -specs=/usr/lib/rpm/OpenCloudOS/OpenCloudOS-hardened-cc1 -fstack-protector-strong  -m64 -march=x86-64-v2 -mtune=generic -fasynchronous-unwind-tables -fstack-clash-protection -fcf-protection -fPIC -fno-semantic-interposition -fvisibility-inlines-hidden -Werror=date-time -fno-lifetime-dse -Wall -Wextra -Wno-unused-parameter -Wwrite-strings -Wcast-qual -Wno-missing-field-initializers -Wimplicit-fallthrough -Wno-nonnull -Wno-class-memaccess -Wno-redundant-move -Wno-pessimizing-move -Wno-noexcept-type -Wdelete-non-virtual-dtor -Wsuggest-override -Wno-comment -Wno-misleading-indentation -Wctad-maybe-unsupported -fdiagnostics-color -ffunction-sections -fdata-sections -O2 -g -DNDEBUG -std=c++17 -fPIC  -fno-exceptions -funwind-tables -MD -MT ELF/CMakeFiles/lldELF.dir/Writer.cpp.o -MF ELF/CMakeFiles/lldELF.dir/Writer.cpp.o.d -o ELF/CMakeFiles/lldELF.dir/Writer.cpp.o -c /builddir/build/BUILD/lld-17.0.6.src/ELF/Writer.cpp
[119/132] /usr/bin/g++ -D__STDC_CONSTANT_MACROS -D__STDC_FORMAT_MACROS -D__STDC_LIMIT_MACROS -I/builddir/build/BUILD/lld-17.0.6.src/x86_64-OpenCloudOS-linux-gnu/wasm -I/builddir/build/BUILD/lld-17.0.6.src/wasm -I/builddir/build/BUILD/lld-17.0.6.src/include -I/builddir/build/BUILD/lld-17.0.6.src/x86_64-OpenCloudOS-linux-gnu/include -O2  -fexceptions -g -grecord-gcc-switches -pipe -Wall -Werror=format-security -Wp,-D_FORTIFY_SOURCE=2 -Wp,-D_GLIBCXX_ASSERTIONS -specs=/usr/lib/rpm/OpenCloudOS/OpenCloudOS-hardened-cc1 -fstack-protector-strong  -m64 -march=x86-64-v2 -mtune=generic -fasynchronous-unwind-tables -fstack-clash-protection -fcf-protection -fPIC -fno-semantic-interposition -fvisibility-inlines-hidden -Werror=date-time -fno-lifetime-dse -Wall -Wextra -Wno-unused-parameter -Wwrite-strings -Wcast-qual -Wno-missing-field-initializers -Wimplicit-fallthrough -Wno-nonnull -Wno-class-memaccess -Wno-redundant-move -Wno-pessimizing-move -Wno-noexcept-type -Wdelete-non-virtual-dtor -Wsuggest-override -Wno-comment -Wno-misleading-indentation -Wctad-maybe-unsupported -fdiagnostics-color -ffunction-sections -fdata-sections -O2 -g -DNDEBUG -std=c++17 -fPIC  -fno-exceptions -funwind-tables -MD -MT wasm/CMakeFiles/lldWasm.dir/Driver.cpp.o -MF wasm/CMakeFiles/lldWasm.dir/Driver.cpp.o.d -o wasm/CMakeFiles/lldWasm.dir/Driver.cpp.o -c /builddir/build/BUILD/lld-17.0.6.src/wasm/Driver.cpp
[120/132] /usr/bin/g++ -D__STDC_CONSTANT_MACROS -D__STDC_FORMAT_MACROS -D__STDC_LIMIT_MACROS -I/builddir/build/BUILD/lld-17.0.6.src/x86_64-OpenCloudOS-linux-gnu/wasm -I/builddir/build/BUILD/lld-17.0.6.src/wasm -I/builddir/build/BUILD/lld-17.0.6.src/include -I/builddir/build/BUILD/lld-17.0.6.src/x86_64-OpenCloudOS-linux-gnu/include -O2  -fexceptions -g -grecord-gcc-switches -pipe -Wall -Werror=format-security -Wp,-D_FORTIFY_SOURCE=2 -Wp,-D_GLIBCXX_ASSERTIONS -specs=/usr/lib/rpm/OpenCloudOS/OpenCloudOS-hardened-cc1 -fstack-protector-strong  -m64 -march=x86-64-v2 -mtune=generic -fasynchronous-unwind-tables -fstack-clash-protection -fcf-protection -fPIC -fno-semantic-interposition -fvisibility-inlines-hidden -Werror=date-time -fno-lifetime-dse -Wall -Wextra -Wno-unused-parameter -Wwrite-strings -Wcast-qual -Wno-missing-field-initializers -Wimplicit-fallthrough -Wno-nonnull -Wno-class-memaccess -Wno-redundant-move -Wno-pessimizing-move -Wno-noexcept-type -Wdelete-non-virtual-dtor -Wsuggest-override -Wno-comment -Wno-misleading-indentation -Wctad-maybe-unsupported -fdiagnostics-color -ffunction-sections -fdata-sections -O2 -g -DNDEBUG -std=c++17 -fPIC  -fno-exceptions -funwind-tables -MD -MT wasm/CMakeFiles/lldWasm.dir/SymbolTable.cpp.o -MF wasm/CMakeFiles/lldWasm.dir/SymbolTable.cpp.o.d -o wasm/CMakeFiles/lldWasm.dir/SymbolTable.cpp.o -c /builddir/build/BUILD/lld-17.0.6.src/wasm/SymbolTable.cpp
[121/132] /usr/bin/g++ -D__STDC_CONSTANT_MACROS -D__STDC_FORMAT_MACROS -D__STDC_LIMIT_MACROS -I/builddir/build/BUILD/lld-17.0.6.src/x86_64-OpenCloudOS-linux-gnu/wasm -I/builddir/build/BUILD/lld-17.0.6.src/wasm -I/builddir/build/BUILD/lld-17.0.6.src/include -I/builddir/build/BUILD/lld-17.0.6.src/x86_64-OpenCloudOS-linux-gnu/include -O2  -fexceptions -g -grecord-gcc-switches -pipe -Wall -Werror=format-security -Wp,-D_FORTIFY_SOURCE=2 -Wp,-D_GLIBCXX_ASSERTIONS -specs=/usr/lib/rpm/OpenCloudOS/OpenCloudOS-hardened-cc1 -fstack-protector-strong  -m64 -march=x86-64-v2 -mtune=generic -fasynchronous-unwind-tables -fstack-clash-protection -fcf-protection -fPIC -fno-semantic-interposition -fvisibility-inlines-hidden -Werror=date-time -fno-lifetime-dse -Wall -Wextra -Wno-unused-parameter -Wwrite-strings -Wcast-qual -Wno-missing-field-initializers -Wimplicit-fallthrough -Wno-nonnull -Wno-class-memaccess -Wno-redundant-move -Wno-pessimizing-move -Wno-noexcept-type -Wdelete-non-virtual-dtor -Wsuggest-override -Wno-comment -Wno-misleading-indentation -Wctad-maybe-unsupported -fdiagnostics-color -ffunction-sections -fdata-sections -O2 -g -DNDEBUG -std=c++17 -fPIC  -fno-exceptions -funwind-tables -MD -MT wasm/CMakeFiles/lldWasm.dir/SyntheticSections.cpp.o -MF wasm/CMakeFiles/lldWasm.dir/SyntheticSections.cpp.o.d -o wasm/CMakeFiles/lldWasm.dir/SyntheticSections.cpp.o -c /builddir/build/BUILD/lld-17.0.6.src/wasm/SyntheticSections.cpp
[122/132] /usr/bin/g++ -D__STDC_CONSTANT_MACROS -D__STDC_FORMAT_MACROS -D__STDC_LIMIT_MACROS -I/builddir/build/BUILD/lld-17.0.6.src/x86_64-OpenCloudOS-linux-gnu/ELF -I/builddir/build/BUILD/lld-17.0.6.src/ELF -I/builddir/build/BUILD/lld-17.0.6.src/include -I/builddir/build/BUILD/lld-17.0.6.src/x86_64-OpenCloudOS-linux-gnu/include -O2  -fexceptions -g -grecord-gcc-switches -pipe -Wall -Werror=format-security -Wp,-D_FORTIFY_SOURCE=2 -Wp,-D_GLIBCXX_ASSERTIONS -specs=/usr/lib/rpm/OpenCloudOS/OpenCloudOS-hardened-cc1 -fstack-protector-strong  -m64 -march=x86-64-v2 -mtune=generic -fasynchronous-unwind-tables -fstack-clash-protection -fcf-protection -fPIC -fno-semantic-interposition -fvisibility-inlines-hidden -Werror=date-time -fno-lifetime-dse -Wall -Wextra -Wno-unused-parameter -Wwrite-strings -Wcast-qual -Wno-missing-field-initializers -Wimplicit-fallthrough -Wno-nonnull -Wno-class-memaccess -Wno-redundant-move -Wno-pessimizing-move -Wno-noexcept-type -Wdelete-non-virtual-dtor -Wsuggest-override -Wno-comment -Wno-misleading-indentation -Wctad-maybe-unsupported -fdiagnostics-color -ffunction-sections -fdata-sections -O2 -g -DNDEBUG -std=c++17 -fPIC  -fno-exceptions -funwind-tables -MD -MT ELF/CMakeFiles/lldELF.dir/InputFiles.cpp.o -MF ELF/CMakeFiles/lldELF.dir/InputFiles.cpp.o.d -o ELF/CMakeFiles/lldELF.dir/InputFiles.cpp.o -c /builddir/build/BUILD/lld-17.0.6.src/ELF/InputFiles.cpp
/builddir/build/BUILD/lld-17.0.6.src/ELF/InputFiles.cpp: In function 'void handleSectionGroup(llvm::ArrayRef<lld::elf::InputSectionBase*>, llvm::ArrayRef<typename ELFT::Word>) [with ELFT = llvm::object::ELFType<llvm::support::little, false>]':
/builddir/build/BUILD/lld-17.0.6.src/ELF/InputFiles.cpp:447:30: warning: 'head' may be used uninitialized [-Wmaybe-uninitialized]
  447 |     prev->nextInSectionGroup = head;
      |     ~~~~~~~~~~~~~~~~~~~~~~~~~^~~~~~
/builddir/build/BUILD/lld-17.0.6.src/ELF/InputFiles.cpp:434:21: note: 'head' was declared here
  434 |   InputSectionBase *head;
      |                     ^~~~
/builddir/build/BUILD/lld-17.0.6.src/ELF/InputFiles.cpp: In function 'void handleSectionGroup(llvm::ArrayRef<lld::elf::InputSectionBase*>, llvm::ArrayRef<typename ELFT::Word>) [with ELFT = llvm::object::ELFType<llvm::support::big, false>]':
/builddir/build/BUILD/lld-17.0.6.src/ELF/InputFiles.cpp:447:30: warning: 'head' may be used uninitialized [-Wmaybe-uninitialized]
  447 |     prev->nextInSectionGroup = head;
      |     ~~~~~~~~~~~~~~~~~~~~~~~~~^~~~~~
/builddir/build/BUILD/lld-17.0.6.src/ELF/InputFiles.cpp:434:21: note: 'head' was declared here
  434 |   InputSectionBase *head;
      |                     ^~~~
[123/132] /usr/bin/g++ -D__STDC_CONSTANT_MACROS -D__STDC_FORMAT_MACROS -D__STDC_LIMIT_MACROS -I/builddir/build/BUILD/lld-17.0.6.src/x86_64-OpenCloudOS-linux-gnu/MachO -I/builddir/build/BUILD/lld-17.0.6.src/MachO -I/builddir/build/BUILD/lld-17.0.6.src/include -I/builddir/build/BUILD/lld-17.0.6.src/x86_64-OpenCloudOS-linux-gnu/include -I/usr/share/llvm/src/../libunwind/include -O2  -fexceptions -g -grecord-gcc-switches -pipe -Wall -Werror=format-security -Wp,-D_FORTIFY_SOURCE=2 -Wp,-D_GLIBCXX_ASSERTIONS -specs=/usr/lib/rpm/OpenCloudOS/OpenCloudOS-hardened-cc1 -fstack-protector-strong  -m64 -march=x86-64-v2 -mtune=generic -fasynchronous-unwind-tables -fstack-clash-protection -fcf-protection -fPIC -fno-semantic-interposition -fvisibility-inlines-hidden -Werror=date-time -fno-lifetime-dse -Wall -Wextra -Wno-unused-parameter -Wwrite-strings -Wcast-qual -Wno-missing-field-initializers -Wimplicit-fallthrough -Wno-nonnull -Wno-class-memaccess -Wno-redundant-move -Wno-pessimizing-move -Wno-noexcept-type -Wdelete-non-virtual-dtor -Wsuggest-override -Wno-comment -Wno-misleading-indentation -Wctad-maybe-unsupported -fdiagnostics-color -ffunction-sections -fdata-sections -O2 -g -DNDEBUG -std=c++17 -fPIC  -fno-exceptions -funwind-tables -MD -MT MachO/CMakeFiles/lldMachO.dir/InputFiles.cpp.o -MF MachO/CMakeFiles/lldMachO.dir/InputFiles.cpp.o.d -o MachO/CMakeFiles/lldMachO.dir/InputFiles.cpp.o -c /builddir/build/BUILD/lld-17.0.6.src/MachO/InputFiles.cpp
[124/132] : && /usr/bin/g++ -fPIC -O2  -fexceptions -g -grecord-gcc-switches -pipe -Wall -Werror=format-security -Wp,-D_FORTIFY_SOURCE=2 -Wp,-D_GLIBCXX_ASSERTIONS -specs=/usr/lib/rpm/OpenCloudOS/OpenCloudOS-hardened-cc1 -fstack-protector-strong  -m64 -march=x86-64-v2 -mtune=generic -fasynchronous-unwind-tables -fstack-clash-protection -fcf-protection -fPIC -fno-semantic-interposition -fvisibility-inlines-hidden -Werror=date-time -fno-lifetime-dse -Wall -Wextra -Wno-unused-parameter -Wwrite-strings -Wcast-qual -Wno-missing-field-initializers -Wimplicit-fallthrough -Wno-nonnull -Wno-class-memaccess -Wno-redundant-move -Wno-pessimizing-move -Wno-noexcept-type -Wdelete-non-virtual-dtor -Wsuggest-override -Wno-comment -Wno-misleading-indentation -Wctad-maybe-unsupported -fdiagnostics-color -ffunction-sections -fdata-sections -O2 -g -DNDEBUG  -Wl,-z,relro -Wl,--as-needed  -Wl,-z,now -specs=/usr/lib/rpm/OpenCloudOS/OpenCloudOS-hardened-ld  -Wl,--build-id=sha1 -Wl,-z,defs -Wl,-z,nodelete   -Wl,-rpath-link,/builddir/build/BUILD/lld-17.0.6.src/x86_64-OpenCloudOS-linux-gnu/./lib64  -Wl,--gc-sections -shared -Wl,-soname,liblldMachO.so.17 -o lib64/liblldMachO.so.17 MachO/CMakeFiles/lldMachO.dir/Arch/ARM64.cpp.o MachO/CMakeFiles/lldMachO.dir/Arch/ARM64Common.cpp.o MachO/CMakeFiles/lldMachO.dir/Arch/ARM64_32.cpp.o MachO/CMakeFiles/lldMachO.dir/Arch/X86_64.cpp.o MachO/CMakeFiles/lldMachO.dir/ConcatOutputSection.cpp.o MachO/CMakeFiles/lldMachO.dir/Driver.cpp.o MachO/CMakeFiles/lldMachO.dir/DriverUtils.cpp.o MachO/CMakeFiles/lldMachO.dir/Dwarf.cpp.o MachO/CMakeFiles/lldMachO.dir/EhFrame.cpp.o MachO/CMakeFiles/lldMachO.dir/ExportTrie.cpp.o MachO/CMakeFiles/lldMachO.dir/ICF.cpp.o MachO/CMakeFiles/lldMachO.dir/InputFiles.cpp.o MachO/CMakeFiles/lldMachO.dir/InputSection.cpp.o MachO/CMakeFiles/lldMachO.dir/LTO.cpp.o MachO/CMakeFiles/lldMachO.dir/MapFile.cpp.o MachO/CMakeFiles/lldMachO.dir/MarkLive.cpp.o MachO/CMakeFiles/lldMachO.dir/ObjC.cpp.o MachO/CMakeFiles/lldMachO.dir/OutputSection.cpp.o MachO/CMakeFiles/lldMachO.dir/OutputSegment.cpp.o MachO/CMakeFiles/lldMachO.dir/Relocations.cpp.o MachO/CMakeFiles/lldMachO.dir/SectionPriorities.cpp.o MachO/CMakeFiles/lldMachO.dir/SymbolTable.cpp.o MachO/CMakeFiles/lldMachO.dir/Symbols.cpp.o MachO/CMakeFiles/lldMachO.dir/SyntheticSections.cpp.o MachO/CMakeFiles/lldMachO.dir/Target.cpp.o MachO/CMakeFiles/lldMachO.dir/UnwindInfoSection.cpp.o MachO/CMakeFiles/lldMachO.dir/Writer.cpp.o  lib64/liblldCommon.so.17  /usr/lib64/libLLVM-17.so && :
[125/132] /usr/bin/cmake -E cmake_symlink_library lib64/liblldMachO.so.17 lib64/liblldMachO.so.17 lib64/liblldMachO.so && :
[126/132] /usr/bin/g++ -D__STDC_CONSTANT_MACROS -D__STDC_FORMAT_MACROS -D__STDC_LIMIT_MACROS -I/builddir/build/BUILD/lld-17.0.6.src/x86_64-OpenCloudOS-linux-gnu/wasm -I/builddir/build/BUILD/lld-17.0.6.src/wasm -I/builddir/build/BUILD/lld-17.0.6.src/include -I/builddir/build/BUILD/lld-17.0.6.src/x86_64-OpenCloudOS-linux-gnu/include -O2  -fexceptions -g -grecord-gcc-switches -pipe -Wall -Werror=format-security -Wp,-D_FORTIFY_SOURCE=2 -Wp,-D_GLIBCXX_ASSERTIONS -specs=/usr/lib/rpm/OpenCloudOS/OpenCloudOS-hardened-cc1 -fstack-protector-strong  -m64 -march=x86-64-v2 -mtune=generic -fasynchronous-unwind-tables -fstack-clash-protection -fcf-protection -fPIC -fno-semantic-interposition -fvisibility-inlines-hidden -Werror=date-time -fno-lifetime-dse -Wall -Wextra -Wno-unused-parameter -Wwrite-strings -Wcast-qual -Wno-missing-field-initializers -Wimplicit-fallthrough -Wno-nonnull -Wno-class-memaccess -Wno-redundant-move -Wno-pessimizing-move -Wno-noexcept-type -Wdelete-non-virtual-dtor -Wsuggest-override -Wno-comment -Wno-misleading-indentation -Wctad-maybe-unsupported -fdiagnostics-color -ffunction-sections -fdata-sections -O2 -g -DNDEBUG -std=c++17 -fPIC  -fno-exceptions -funwind-tables -MD -MT wasm/CMakeFiles/lldWasm.dir/Writer.cpp.o -MF wasm/CMakeFiles/lldWasm.dir/Writer.cpp.o.d -o wasm/CMakeFiles/lldWasm.dir/Writer.cpp.o -c /builddir/build/BUILD/lld-17.0.6.src/wasm/Writer.cpp
In lambda function,
    inlined from 'void lld::wasm::{anonymous}::Writer::createInitMemoryFunction()' at /builddir/build/BUILD/lld-17.0.6.src/wasm/Writer.cpp:1361:26:
/builddir/build/BUILD/lld-17.0.6.src/wasm/Writer.cpp:1258:22: warning: 'flagAddress' may be used uninitialized [-Wmaybe-uninitialized]
 1258 |         writePtrConst(os, flagAddress, is64, "flag address");
      |         ~~~~~~~~~~~~~^~~~~~~~~~~~~~~~~~~~~~~~~~~~~~~~~~~~~~~
/builddir/build/BUILD/lld-17.0.6.src/wasm/Writer.cpp: In member function 'void lld::wasm::{anonymous}::Writer::createInitMemoryFunction()':
/builddir/build/BUILD/lld-17.0.6.src/wasm/Writer.cpp:1193:12: note: 'flagAddress' was declared here
 1193 |   uint64_t flagAddress;
      |            ^~~~~~~~~~~
[127/132] : && /usr/bin/g++ -fPIC -O2  -fexceptions -g -grecord-gcc-switches -pipe -Wall -Werror=format-security -Wp,-D_FORTIFY_SOURCE=2 -Wp,-D_GLIBCXX_ASSERTIONS -specs=/usr/lib/rpm/OpenCloudOS/OpenCloudOS-hardened-cc1 -fstack-protector-strong  -m64 -march=x86-64-v2 -mtune=generic -fasynchronous-unwind-tables -fstack-clash-protection -fcf-protection -fPIC -fno-semantic-interposition -fvisibility-inlines-hidden -Werror=date-time -fno-lifetime-dse -Wall -Wextra -Wno-unused-parameter -Wwrite-strings -Wcast-qual -Wno-missing-field-initializers -Wimplicit-fallthrough -Wno-nonnull -Wno-class-memaccess -Wno-redundant-move -Wno-pessimizing-move -Wno-noexcept-type -Wdelete-non-virtual-dtor -Wsuggest-override -Wno-comment -Wno-misleading-indentation -Wctad-maybe-unsupported -fdiagnostics-color -ffunction-sections -fdata-sections -O2 -g -DNDEBUG  -Wl,-z,relro -Wl,--as-needed  -Wl,-z,now -specs=/usr/lib/rpm/OpenCloudOS/OpenCloudOS-hardened-ld  -Wl,--build-id=sha1 -Wl,-z,defs -Wl,-z,nodelete   -Wl,-rpath-link,/builddir/build/BUILD/lld-17.0.6.src/x86_64-OpenCloudOS-linux-gnu/./lib64  -Wl,--gc-sections -shared -Wl,-soname,liblldWasm.so.17 -o lib64/liblldWasm.so.17 wasm/CMakeFiles/lldWasm.dir/Driver.cpp.o wasm/CMakeFiles/lldWasm.dir/InputChunks.cpp.o wasm/CMakeFiles/lldWasm.dir/InputFiles.cpp.o wasm/CMakeFiles/lldWasm.dir/LTO.cpp.o wasm/CMakeFiles/lldWasm.dir/MapFile.cpp.o wasm/CMakeFiles/lldWasm.dir/MarkLive.cpp.o wasm/CMakeFiles/lldWasm.dir/OutputSections.cpp.o wasm/CMakeFiles/lldWasm.dir/OutputSegment.cpp.o wasm/CMakeFiles/lldWasm.dir/Relocations.cpp.o wasm/CMakeFiles/lldWasm.dir/SymbolTable.cpp.o wasm/CMakeFiles/lldWasm.dir/Symbols.cpp.o wasm/CMakeFiles/lldWasm.dir/SyntheticSections.cpp.o wasm/CMakeFiles/lldWasm.dir/Writer.cpp.o wasm/CMakeFiles/lldWasm.dir/WriterUtils.cpp.o  lib64/liblldCommon.so.17  /usr/lib64/libLLVM-17.so && :
[128/132] /usr/bin/cmake -E cmake_symlink_library lib64/liblldWasm.so.17 lib64/liblldWasm.so.17 lib64/liblldWasm.so && :
[129/132] /usr/bin/g++ -D__STDC_CONSTANT_MACROS -D__STDC_FORMAT_MACROS -D__STDC_LIMIT_MACROS -I/builddir/build/BUILD/lld-17.0.6.src/x86_64-OpenCloudOS-linux-gnu/ELF -I/builddir/build/BUILD/lld-17.0.6.src/ELF -I/builddir/build/BUILD/lld-17.0.6.src/include -I/builddir/build/BUILD/lld-17.0.6.src/x86_64-OpenCloudOS-linux-gnu/include -O2  -fexceptions -g -grecord-gcc-switches -pipe -Wall -Werror=format-security -Wp,-D_FORTIFY_SOURCE=2 -Wp,-D_GLIBCXX_ASSERTIONS -specs=/usr/lib/rpm/OpenCloudOS/OpenCloudOS-hardened-cc1 -fstack-protector-strong  -m64 -march=x86-64-v2 -mtune=generic -fasynchronous-unwind-tables -fstack-clash-protection -fcf-protection -fPIC -fno-semantic-interposition -fvisibility-inlines-hidden -Werror=date-time -fno-lifetime-dse -Wall -Wextra -Wno-unused-parameter -Wwrite-strings -Wcast-qual -Wno-missing-field-initializers -Wimplicit-fallthrough -Wno-nonnull -Wno-class-memaccess -Wno-redundant-move -Wno-pessimizing-move -Wno-noexcept-type -Wdelete-non-virtual-dtor -Wsuggest-override -Wno-comment -Wno-misleading-indentation -Wctad-maybe-unsupported -fdiagnostics-color -ffunction-sections -fdata-sections -O2 -g -DNDEBUG -std=c++17 -fPIC  -fno-exceptions -funwind-tables -MD -MT ELF/CMakeFiles/lldELF.dir/SyntheticSections.cpp.o -MF ELF/CMakeFiles/lldELF.dir/SyntheticSections.cpp.o.d -o ELF/CMakeFiles/lldELF.dir/SyntheticSections.cpp.o -c /builddir/build/BUILD/lld-17.0.6.src/ELF/SyntheticSections.cpp
[130/132] : && /usr/bin/g++ -fPIC -O2  -fexceptions -g -grecord-gcc-switches -pipe -Wall -Werror=format-security -Wp,-D_FORTIFY_SOURCE=2 -Wp,-D_GLIBCXX_ASSERTIONS -specs=/usr/lib/rpm/OpenCloudOS/OpenCloudOS-hardened-cc1 -fstack-protector-strong  -m64 -march=x86-64-v2 -mtune=generic -fasynchronous-unwind-tables -fstack-clash-protection -fcf-protection -fPIC -fno-semantic-interposition -fvisibility-inlines-hidden -Werror=date-time -fno-lifetime-dse -Wall -Wextra -Wno-unused-parameter -Wwrite-strings -Wcast-qual -Wno-missing-field-initializers -Wimplicit-fallthrough -Wno-nonnull -Wno-class-memaccess -Wno-redundant-move -Wno-pessimizing-move -Wno-noexcept-type -Wdelete-non-virtual-dtor -Wsuggest-override -Wno-comment -Wno-misleading-indentation -Wctad-maybe-unsupported -fdiagnostics-color -ffunction-sections -fdata-sections -O2 -g -DNDEBUG  -Wl,-z,relro -Wl,--as-needed  -Wl,-z,now -specs=/usr/lib/rpm/OpenCloudOS/OpenCloudOS-hardened-ld  -Wl,--build-id=sha1 -Wl,-z,defs -Wl,-z,nodelete   -Wl,-rpath-link,/builddir/build/BUILD/lld-17.0.6.src/x86_64-OpenCloudOS-linux-gnu/./lib64  -Wl,--gc-sections -shared -Wl,-soname,liblldELF.so.17 -o lib64/liblldELF.so.17 ELF/CMakeFiles/lldELF.dir/AArch64ErrataFix.cpp.o ELF/CMakeFiles/lldELF.dir/Arch/AArch64.cpp.o ELF/CMakeFiles/lldELF.dir/Arch/AMDGPU.cpp.o ELF/CMakeFiles/lldELF.dir/Arch/ARM.cpp.o ELF/CMakeFiles/lldELF.dir/Arch/AVR.cpp.o ELF/CMakeFiles/lldELF.dir/Arch/Hexagon.cpp.o ELF/CMakeFiles/lldELF.dir/Arch/LoongArch.cpp.o ELF/CMakeFiles/lldELF.dir/Arch/Mips.cpp.o ELF/CMakeFiles/lldELF.dir/Arch/MipsArchTree.cpp.o ELF/CMakeFiles/lldELF.dir/Arch/MSP430.cpp.o ELF/CMakeFiles/lldELF.dir/Arch/PPC.cpp.o ELF/CMakeFiles/lldELF.dir/Arch/PPC64.cpp.o ELF/CMakeFiles/lldELF.dir/Arch/RISCV.cpp.o ELF/CMakeFiles/lldELF.dir/Arch/SPARCV9.cpp.o ELF/CMakeFiles/lldELF.dir/Arch/X86.cpp.o ELF/CMakeFiles/lldELF.dir/Arch/X86_64.cpp.o ELF/CMakeFiles/lldELF.dir/ARMErrataFix.cpp.o ELF/CMakeFiles/lldELF.dir/CallGraphSort.cpp.o ELF/CMakeFiles/lldELF.dir/DWARF.cpp.o ELF/CMakeFiles/lldELF.dir/Driver.cpp.o ELF/CMakeFiles/lldELF.dir/DriverUtils.cpp.o ELF/CMakeFiles/lldELF.dir/EhFrame.cpp.o ELF/CMakeFiles/lldELF.dir/ICF.cpp.o ELF/CMakeFiles/lldELF.dir/InputFiles.cpp.o ELF/CMakeFiles/lldELF.dir/InputSection.cpp.o ELF/CMakeFiles/lldELF.dir/LTO.cpp.o ELF/CMakeFiles/lldELF.dir/LinkerScript.cpp.o ELF/CMakeFiles/lldELF.dir/MapFile.cpp.o ELF/CMakeFiles/lldELF.dir/MarkLive.cpp.o ELF/CMakeFiles/lldELF.dir/OutputSections.cpp.o ELF/CMakeFiles/lldELF.dir/Relocations.cpp.o ELF/CMakeFiles/lldELF.dir/ScriptLexer.cpp.o ELF/CMakeFiles/lldELF.dir/ScriptParser.cpp.o ELF/CMakeFiles/lldELF.dir/SymbolTable.cpp.o ELF/CMakeFiles/lldELF.dir/Symbols.cpp.o ELF/CMakeFiles/lldELF.dir/SyntheticSections.cpp.o ELF/CMakeFiles/lldELF.dir/Target.cpp.o ELF/CMakeFiles/lldELF.dir/Thunks.cpp.o ELF/CMakeFiles/lldELF.dir/Writer.cpp.o  lib64/liblldCommon.so.17  /usr/lib64/libz.so  /usr/lib64/libLLVM-17.so && :
[131/132] /usr/bin/cmake -E cmake_symlink_library lib64/liblldELF.so.17 lib64/liblldELF.so.17 lib64/liblldELF.so && :
[132/132] : && /usr/bin/g++ -O2  -fexceptions -g -grecord-gcc-switches -pipe -Wall -Werror=format-security -Wp,-D_FORTIFY_SOURCE=2 -Wp,-D_GLIBCXX_ASSERTIONS -specs=/usr/lib/rpm/OpenCloudOS/OpenCloudOS-hardened-cc1 -fstack-protector-strong  -m64 -march=x86-64-v2 -mtune=generic -fasynchronous-unwind-tables -fstack-clash-protection -fcf-protection -fPIC -fno-semantic-interposition -fvisibility-inlines-hidden -Werror=date-time -fno-lifetime-dse -Wall -Wextra -Wno-unused-parameter -Wwrite-strings -Wcast-qual -Wno-missing-field-initializers -Wimplicit-fallthrough -Wno-nonnull -Wno-class-memaccess -Wno-redundant-move -Wno-pessimizing-move -Wno-noexcept-type -Wdelete-non-virtual-dtor -Wsuggest-override -Wno-comment -Wno-misleading-indentation -Wctad-maybe-unsupported -fdiagnostics-color -ffunction-sections -fdata-sections -O2 -g -DNDEBUG -Wl,-z,relro -Wl,--as-needed  -Wl,-z,now -specs=/usr/lib/rpm/OpenCloudOS/OpenCloudOS-hardened-ld  -Wl,--build-id=sha1   -Wl,--export-dynamic  -rdynamic  -Wl,-rpath-link,/builddir/build/BUILD/lld-17.0.6.src/x86_64-OpenCloudOS-linux-gnu/./lib64 tools/lld/CMakeFiles/lld.dir/lld.cpp.o tools/lld/CMakeFiles/lld.dir/lld-driver.cpp.o -o bin/lld  lib64/liblldELF.so.17  lib64/liblldMachO.so.17  lib64/liblldMinGW.so.17  lib64/liblldWasm.so.17  lib64/liblldCOFF.so.17  lib64/liblldCommon.so.17  /usr/lib64/libLLVM-17.so && cd /builddir/build/BUILD/lld-17.0.6.src/x86_64-OpenCloudOS-linux-gnu/tools/lld && /usr/bin/cmake -E copy /builddir/build/BUILD/lld-17.0.6.src/x86_64-OpenCloudOS-linux-gnu/bin/lld /builddir/build/BUILD/lld-17.0.6.src/x86_64-OpenCloudOS-linux-gnu/./bin/lld-link && cd /builddir/build/BUILD/lld-17.0.6.src/x86_64-OpenCloudOS-linux-gnu/tools/lld && /usr/bin/cmake -E copy /builddir/build/BUILD/lld-17.0.6.src/x86_64-OpenCloudOS-linux-gnu/bin/lld /builddir/build/BUILD/lld-17.0.6.src/x86_64-OpenCloudOS-linux-gnu/./bin/ld.lld && cd /builddir/build/BUILD/lld-17.0.6.src/x86_64-OpenCloudOS-linux-gnu/tools/lld && /usr/bin/cmake -E copy /builddir/build/BUILD/lld-17.0.6.src/x86_64-OpenCloudOS-linux-gnu/bin/lld /builddir/build/BUILD/lld-17.0.6.src/x86_64-OpenCloudOS-linux-gnu/./bin/ld64.lld && cd /builddir/build/BUILD/lld-17.0.6.src/x86_64-OpenCloudOS-linux-gnu/tools/lld && /usr/bin/cmake -E copy /builddir/build/BUILD/lld-17.0.6.src/x86_64-OpenCloudOS-linux-gnu/bin/lld /builddir/build/BUILD/lld-17.0.6.src/x86_64-OpenCloudOS-linux-gnu/./bin/wasm-ld
+ /usr/bin/cmake --build x86_64-OpenCloudOS-linux-gnu -j32 --verbose --target lld-test-depends
ninja: no work to do.
+ RPM_EC=0
++ jobs -p
+ exit 0
Executing(%install): /bin/sh -e /var/tmp/rpm-tmp.l0K0v0
+ umask 022
+ cd /builddir/build/BUILD
+ '[' /builddir/build/BUILDROOT/lld-17.0.6-2.ocs23.x86_64 '!=' / ']'
+ rm -rf /builddir/build/BUILDROOT/lld-17.0.6-2.ocs23.x86_64
++ dirname /builddir/build/BUILDROOT/lld-17.0.6-2.ocs23.x86_64
+ mkdir -p /builddir/build/BUILDROOT
+ mkdir /builddir/build/BUILDROOT/lld-17.0.6-2.ocs23.x86_64
+ cd lld-17.0.6.src
+ head -n -1 x86_64-OpenCloudOS-linux-gnu/test/lit.site.cfg.py
+ for f in test/x86_64.site.cfg.py
+ echo 'lit_config.load_config(config, '\''/usr/share/lld/lit.lld-test.cfg.py'\'')'
+ install -d /builddir/build/BUILDROOT/lld-17.0.6-2.ocs23.x86_64/usr/share/lld/src
+ cp /builddir/build/SOURCES/lit.lld-test.cfg.py /builddir/build/BUILDROOT/lld-17.0.6-2.ocs23.x86_64/usr/share/lld/
+ mv test/x86_64.site.cfg.py /builddir/build/BUILDROOT/lld-17.0.6-2.ocs23.x86_64/usr/share/lld/src/x86_64.site.cfg.py
+ tar --sort=name '--mtime=UTC 2020-01-01' -c test/
+ gzip -n
+ install -d /builddir/build/BUILDROOT/lld-17.0.6-2.ocs23.x86_64/usr/libexec/tests/lld
+ install -m 0755 /builddir/build/SOURCES/run-lit-tests /builddir/build/BUILDROOT/lld-17.0.6-2.ocs23.x86_64/usr/libexec/tests/lld
+ install -d /builddir/build/BUILDROOT/lld-17.0.6-2.ocs23.x86_64/usr/lib64/lld/
+ DESTDIR=/builddir/build/BUILDROOT/lld-17.0.6-2.ocs23.x86_64
+ /usr/bin/cmake --install x86_64-OpenCloudOS-linux-gnu
-- Install configuration: "RelWithDebInfo"
-- Installing: /builddir/build/BUILDROOT/lld-17.0.6-2.ocs23.x86_64/usr/include
-- Installing: /builddir/build/BUILDROOT/lld-17.0.6-2.ocs23.x86_64/usr/include/lld
-- Installing: /builddir/build/BUILDROOT/lld-17.0.6-2.ocs23.x86_64/usr/include/lld/Common
-- Installing: /builddir/build/BUILDROOT/lld-17.0.6-2.ocs23.x86_64/usr/include/lld/Common/Arrays.h
-- Installing: /builddir/build/BUILDROOT/lld-17.0.6-2.ocs23.x86_64/usr/include/lld/Common/TargetOptionsCommandFlags.h
-- Installing: /builddir/build/BUILDROOT/lld-17.0.6-2.ocs23.x86_64/usr/include/lld/Common/Reproduce.h
-- Installing: /builddir/build/BUILDROOT/lld-17.0.6-2.ocs23.x86_64/usr/include/lld/Common/Filesystem.h
-- Installing: /builddir/build/BUILDROOT/lld-17.0.6-2.ocs23.x86_64/usr/include/lld/Common/ErrorHandler.h
-- Installing: /builddir/build/BUILDROOT/lld-17.0.6-2.ocs23.x86_64/usr/include/lld/Common/Args.h
-- Installing: /builddir/build/BUILDROOT/lld-17.0.6-2.ocs23.x86_64/usr/include/lld/Common/LLVM.h
-- Installing: /builddir/build/BUILDROOT/lld-17.0.6-2.ocs23.x86_64/usr/include/lld/Common/Memory.h
-- Installing: /builddir/build/BUILDROOT/lld-17.0.6-2.ocs23.x86_64/usr/include/lld/Common/DWARF.h
-- Installing: /builddir/build/BUILDROOT/lld-17.0.6-2.ocs23.x86_64/usr/include/lld/Common/Driver.h
-- Installing: /builddir/build/BUILDROOT/lld-17.0.6-2.ocs23.x86_64/usr/include/lld/Common/CommonLinkerContext.h
-- Installing: /builddir/build/BUILDROOT/lld-17.0.6-2.ocs23.x86_64/usr/include/lld/Common/Strings.h
-- Installing: /builddir/build/BUILDROOT/lld-17.0.6-2.ocs23.x86_64/usr/include/lld/Common/Version.h
-- Installing: /builddir/build/BUILDROOT/lld-17.0.6-2.ocs23.x86_64/usr/include/lld/Common/Timer.h
-- Installing: /builddir/build/BUILDROOT/lld-17.0.6-2.ocs23.x86_64/usr/include/mach-o
-- Installing: /builddir/build/BUILDROOT/lld-17.0.6-2.ocs23.x86_64/usr/include/mach-o/compact_unwind_encoding.h
-- Installing: /builddir/build/BUILDROOT/lld-17.0.6-2.ocs23.x86_64/usr/lib64/liblldCommon.so.17
-- Installing: /builddir/build/BUILDROOT/lld-17.0.6-2.ocs23.x86_64/usr/lib64/liblldCommon.so
-- Installing: /builddir/build/BUILDROOT/lld-17.0.6-2.ocs23.x86_64/usr/bin/lld
-- Up-to-date: /builddir/build/BUILDROOT/lld-17.0.6-2.ocs23.x86_64/usr/bin/lld
-- Creating lld-link
-- Creating ld.lld
-- Creating ld64.lld
-- Creating wasm-ld
-- Installing: /builddir/build/BUILDROOT/lld-17.0.6-2.ocs23.x86_64/usr/lib64/liblldCOFF.so.17
-- Installing: /builddir/build/BUILDROOT/lld-17.0.6-2.ocs23.x86_64/usr/lib64/liblldCOFF.so
-- Installing: /builddir/build/BUILDROOT/lld-17.0.6-2.ocs23.x86_64/usr/lib64/liblldELF.so.17
-- Installing: /builddir/build/BUILDROOT/lld-17.0.6-2.ocs23.x86_64/usr/lib64/liblldELF.so
-- Installing: /builddir/build/BUILDROOT/lld-17.0.6-2.ocs23.x86_64/usr/lib64/liblldMachO.so.17
-- Installing: /builddir/build/BUILDROOT/lld-17.0.6-2.ocs23.x86_64/usr/lib64/liblldMachO.so
-- Installing: /builddir/build/BUILDROOT/lld-17.0.6-2.ocs23.x86_64/usr/lib64/liblldMinGW.so.17
-- Installing: /builddir/build/BUILDROOT/lld-17.0.6-2.ocs23.x86_64/usr/lib64/liblldMinGW.so
-- Installing: /builddir/build/BUILDROOT/lld-17.0.6-2.ocs23.x86_64/usr/lib64/liblldWasm.so.17
-- Installing: /builddir/build/BUILDROOT/lld-17.0.6-2.ocs23.x86_64/usr/lib64/liblldWasm.so
-- Installing: /builddir/build/BUILDROOT/lld-17.0.6-2.ocs23.x86_64/usr/lib64/cmake/lld/LLDTargets.cmake
-- Installing: /builddir/build/BUILDROOT/lld-17.0.6-2.ocs23.x86_64/usr/lib64/cmake/lld/LLDTargets-relwithdebinfo.cmake
-- Installing: /builddir/build/BUILDROOT/lld-17.0.6-2.ocs23.x86_64/usr/lib64/cmake/lld/LLDConfig.cmake
-- Installing: /builddir/build/BUILDROOT/lld-17.0.6-2.ocs23.x86_64/usr/lib64/cmake/lld/LLDConfigVersion.cmake
+ rm /builddir/build/BUILDROOT/lld-17.0.6-2.ocs23.x86_64/usr/include/mach-o/compact_unwind_encoding.h
+ touch /builddir/build/BUILDROOT/lld-17.0.6-2.ocs23.x86_64/usr/bin/ld
+ install -D -m 644 -t /builddir/build/BUILDROOT/lld-17.0.6-2.ocs23.x86_64/usr/share/man/man1/ docs/ld.lld.1
+ /usr/bin/find-debuginfo -j32 --strict-build-id -m -i --build-id-seed 17.0.6-2.ocs23 --unique-debug-suffix -17.0.6-2.ocs23.x86_64 --unique-debug-src-base lld-17.0.6-2.ocs23.x86_64 -S debugsourcefiles.list /builddir/build/BUILD/lld-17.0.6.src
extracting debug info from /builddir/build/BUILDROOT/lld-17.0.6-2.ocs23.x86_64/usr/bin/ld.lld
extracting debug info from /builddir/build/BUILDROOT/lld-17.0.6-2.ocs23.x86_64/usr/bin/ld64.lld
extracting debug info from /builddir/build/BUILDROOT/lld-17.0.6-2.ocs23.x86_64/usr/bin/lld
extracting debug info from /builddir/build/BUILDROOT/lld-17.0.6-2.ocs23.x86_64/usr/bin/lld-link
extracting debug info from /builddir/build/BUILDROOT/lld-17.0.6-2.ocs23.x86_64/usr/bin/wasm-ld
extracting debug info from /builddir/build/BUILDROOT/lld-17.0.6-2.ocs23.x86_64/usr/lib64/liblldCOFF.so.17
extracting debug info from /builddir/build/BUILDROOT/lld-17.0.6-2.ocs23.x86_64/usr/lib64/liblldCommon.so.17
extracting debug info from /builddir/build/BUILDROOT/lld-17.0.6-2.ocs23.x86_64/usr/lib64/liblldMachO.so.17
extracting debug info from /builddir/build/BUILDROOT/lld-17.0.6-2.ocs23.x86_64/usr/lib64/liblldELF.so.17
extracting debug info from /builddir/build/BUILDROOT/lld-17.0.6-2.ocs23.x86_64/usr/lib64/liblldMinGW.so.17
extracting debug info from /builddir/build/BUILDROOT/lld-17.0.6-2.ocs23.x86_64/usr/lib64/liblldWasm.so.17
6906 blocks
+ /usr/lib/rpm/check-buildroot
+ /usr/lib/rpm/OpenCloudOS/brp-ldconfig
+ /usr/lib/rpm/brp-compress
+ /usr/lib/rpm/OpenCloudOS/brp-strip-lto /usr/bin/strip
+ /usr/lib/rpm/brp-strip-static-archive /usr/bin/strip
+ /usr/lib/rpm/check-rpaths
+ /usr/lib/rpm/OpenCloudOS/brp-mangle-shebangs
mangling shebang in /usr/libexec/tests/lld/run-lit-tests from /bin/bash to #!/usr/bin/bash
+ /usr/lib/rpm/OpenCloudOS/brp-python-bytecompile '' 1 0
+ /usr/lib/rpm/OpenCloudOS/brp-python-hardlink
Executing(%check): /bin/sh -e /var/tmp/rpm-tmp.WDLnu0
+ umask 022
+ cd /builddir/build/BUILD
+ CFLAGS='-O2  -fexceptions -g -grecord-gcc-switches -pipe -Wall -Werror=format-security -Wp,-D_FORTIFY_SOURCE=2 -Wp,-D_GLIBCXX_ASSERTIONS -specs=/usr/lib/rpm/OpenCloudOS/OpenCloudOS-hardened-cc1 -fstack-protector-strong  -m64 -march=x86-64-v2 -mtune=generic -fasynchronous-unwind-tables -fstack-clash-protection -fcf-protection'
+ export CFLAGS
+ CXXFLAGS='-O2  -fexceptions -g -grecord-gcc-switches -pipe -Wall -Werror=format-security -Wp,-D_FORTIFY_SOURCE=2 -Wp,-D_GLIBCXX_ASSERTIONS -specs=/usr/lib/rpm/OpenCloudOS/OpenCloudOS-hardened-cc1 -fstack-protector-strong  -m64 -march=x86-64-v2 -mtune=generic -fasynchronous-unwind-tables -fstack-clash-protection -fcf-protection'
+ export CXXFLAGS
+ FFLAGS='-O2  -fexceptions -g -grecord-gcc-switches -pipe -Wall -Werror=format-security -Wp,-D_FORTIFY_SOURCE=2 -Wp,-D_GLIBCXX_ASSERTIONS -specs=/usr/lib/rpm/OpenCloudOS/OpenCloudOS-hardened-cc1 -fstack-protector-strong  -m64 -march=x86-64-v2 -mtune=generic -fasynchronous-unwind-tables -fstack-clash-protection -fcf-protection -I/usr/lib64/gfortran/modules'
+ export FFLAGS
+ FCFLAGS='-O2  -fexceptions -g -grecord-gcc-switches -pipe -Wall -Werror=format-security -Wp,-D_FORTIFY_SOURCE=2 -Wp,-D_GLIBCXX_ASSERTIONS -specs=/usr/lib/rpm/OpenCloudOS/OpenCloudOS-hardened-cc1 -fstack-protector-strong  -m64 -march=x86-64-v2 -mtune=generic -fasynchronous-unwind-tables -fstack-clash-protection -fcf-protection -I/usr/lib64/gfortran/modules'
+ export FCFLAGS
+ LDFLAGS='-Wl,-z,relro -Wl,--as-needed  -Wl,-z,now -specs=/usr/lib/rpm/OpenCloudOS/OpenCloudOS-hardened-ld  -Wl,--build-id=sha1'
+ export LDFLAGS
+ LT_SYS_LIBRARY_PATH=/usr/lib64:
+ export LT_SYS_LIBRARY_PATH
+ CC=gcc
+ export CC
+ CXX=g++
+ export CXX
+ cd lld-17.0.6.src
+ /usr/bin/cmake --build x86_64-OpenCloudOS-linux-gnu -j32 --verbose --target check-lld
[0/1] cd /builddir/build/BUILD/lld-17.0.6.src/x86_64-OpenCloudOS-linux-gnu/test && /usr/bin/python3.11 /usr/bin/lit -sv 	--path /usr/lib64/llvm /builddir/build/BUILD/lld-17.0.6.src/x86_64-OpenCloudOS-linux-gnu/test
lit: /usr/lib/python3.11/site-packages/lit/llvm/config.py:459: note: using ld.lld: /builddir/build/BUILD/lld-17.0.6.src/x86_64-OpenCloudOS-linux-gnu/bin/ld.lld
lit: /usr/lib/python3.11/site-packages/lit/llvm/config.py:459: note: using lld-link: /builddir/build/BUILD/lld-17.0.6.src/x86_64-OpenCloudOS-linux-gnu/bin/lld-link
lit: /usr/lib/python3.11/site-packages/lit/llvm/config.py:459: note: using ld64.lld: /builddir/build/BUILD/lld-17.0.6.src/x86_64-OpenCloudOS-linux-gnu/bin/ld64.lld
lit: /usr/lib/python3.11/site-packages/lit/llvm/config.py:459: note: using wasm-ld: /builddir/build/BUILD/lld-17.0.6.src/x86_64-OpenCloudOS-linux-gnu/bin/wasm-ld
lit: /usr/lib/python3.11/site-packages/lit/discovery.py:247: warning: test suite 'LLD-Unit' contained no tests
-- Testing: 2812 tests, 32 workers --
Testing:  0.. 10.. 20.. 30.. 40.. 50
FAIL: lld :: ELF/loongarch-reloc-leb128.s (1499 of 2812)
******************** TEST 'lld :: ELF/loongarch-reloc-leb128.s' FAILED ********************
Script:
--
: 'RUN: at line 2';   rm -rf /builddir/build/BUILD/lld-17.0.6.src/x86_64-OpenCloudOS-linux-gnu/test/ELF/Output/loongarch-reloc-leb128.s.tmp && split-file /builddir/build/BUILD/lld-17.0.6.src/test/ELF/loongarch-reloc-leb128.s /builddir/build/BUILD/lld-17.0.6.src/x86_64-OpenCloudOS-linux-gnu/test/ELF/Output/loongarch-reloc-leb128.s.tmp && cd /builddir/build/BUILD/lld-17.0.6.src/x86_64-OpenCloudOS-linux-gnu/test/ELF/Output/loongarch-reloc-leb128.s.tmp
: 'RUN: at line 4';   /usr/bin/llvm-mc --filetype=obj --triple=loongarch64 --mattr=+relax a.s -o a.o
: 'RUN: at line 5';   /usr/bin/llvm-readobj -r -x .gcc_except_table -x .debug_rnglists -x .debug_loclists a.o | /usr/bin/FileCheck /builddir/build/BUILD/lld-17.0.6.src/test/ELF/loongarch-reloc-leb128.s --check-prefix=REL
: 'RUN: at line 6';   /builddir/build/BUILD/lld-17.0.6.src/x86_64-OpenCloudOS-linux-gnu/bin/ld.lld -shared --gc-sections a.o -o a.so
: 'RUN: at line 7';   /usr/bin/llvm-readelf -x .gcc_except_table -x .debug_rnglists -x .debug_loclists a.so | /usr/bin/FileCheck /builddir/build/BUILD/lld-17.0.6.src/test/ELF/loongarch-reloc-leb128.s
: 'RUN: at line 9';   /usr/bin/llvm-mc --filetype=obj --triple=loongarch32 --mattr=+relax a.s -o a32.o
: 'RUN: at line 10';   /usr/bin/llvm-readobj -r -x .gcc_except_table -x .debug_rnglists -x .debug_loclists a32.o | /usr/bin/FileCheck /builddir/build/BUILD/lld-17.0.6.src/test/ELF/loongarch-reloc-leb128.s --check-prefix=REL
: 'RUN: at line 11';   /builddir/build/BUILD/lld-17.0.6.src/x86_64-OpenCloudOS-linux-gnu/bin/ld.lld -shared --gc-sections a32.o -o a32.so
: 'RUN: at line 12';   /usr/bin/llvm-readelf -x .gcc_except_table -x .debug_rnglists -x .debug_loclists a32.so | /usr/bin/FileCheck /builddir/build/BUILD/lld-17.0.6.src/test/ELF/loongarch-reloc-leb128.s
: 'RUN: at line 14';   /usr/bin/llvm-mc --filetype=obj --triple=loongarch32 --mattr=+relax extraspace.s -o extraspace32.o
: 'RUN: at line 15';   /usr/bin/llvm-mc --filetype=obj --triple=loongarch64 --mattr=+relax extraspace.s -o extraspace64.o
: 'RUN: at line 16';   not /builddir/build/BUILD/lld-17.0.6.src/x86_64-OpenCloudOS-linux-gnu/bin/ld.lld -shared extraspace32.o 2>&1 | /usr/bin/FileCheck /builddir/build/BUILD/lld-17.0.6.src/test/ELF/loongarch-reloc-leb128.s --check-prefix=ERROR
: 'RUN: at line 17';   not /builddir/build/BUILD/lld-17.0.6.src/x86_64-OpenCloudOS-linux-gnu/bin/ld.lld -shared extraspace64.o 2>&1 | /usr/bin/FileCheck /builddir/build/BUILD/lld-17.0.6.src/test/ELF/loongarch-reloc-leb128.s --check-prefix=ERROR
--
Exit Code: 1
Command Output (stderr):
--
'+relax' is not a recognized feature for this target (ignoring feature)
/builddir/build/BUILD/lld-17.0.6.src/test/ELF/loongarch-reloc-leb128.s:55:8: error: REL: expected string not found in input
# REL: Section ({{.*}}) .rela.debug_rnglists {
       ^
<stdin>:1:1: note: scanning from here
^
<stdin>:16:13: note: possible intended match here
Hex dump of section '.debug_rnglists':
            ^
Input file: <stdin>
Check file: /builddir/build/BUILD/lld-17.0.6.src/test/ELF/loongarch-reloc-leb128.s
-dump-input=help explains the following input dump.
Input was:
<<<<<<
            1:  
check:55'0     X error: no match found
            2: File: a.o 
check:55'0     ~~~~~~~~~~
            3: Format: elf64-loongarch 
check:55'0     ~~~~~~~~~~~~~~~~~~~~~~~~
            4: Arch: loongarch64 
check:55'0     ~~~~~~~~~~~~~~~~~~
            5: AddressSize: 64bit 
check:55'0     ~~~~~~~~~~~~~~~~~~~
            6: LoadName: <Not found> 
check:55'0     ~~~~~~~~~~~~~~~~~~~~~~
            .
            .
            .
           11:  } 
check:55'0     ~~~
           12: ] 
check:55'0     ~~
           13: Hex dump of section '.gcc_except_table': 
check:55'0     ~~~~~~~~~~~~~~~~~~~~~~~~~~~~~~~~~~~~~~~~~
           14: 0x00000000 788901f8 7f898001 f8ff7f89 808001 x.............. 
check:55'0     ~~~~~~~~~~~~~~~~~~~~~~~~~~~~~~~~~~~~~~~~~~~~~~~~~~~~~~~~~~~~~
           15:  
check:55'0     ~
           16: Hex dump of section '.debug_rnglists': 
check:55'0     ~~~~~~~~~~~~~~~~~~~~~~~~~~~~~~~~~~~~~~~
check:55'1                 ?                           possible intended match
           17: 0x00000000 788901f8 7f898001 f8ff7f89 808001 x.............. 
check:55'0     ~~~~~~~~~~~~~~~~~~~~~~~~~~~~~~~~~~~~~~~~~~~~~~~~~~~~~~~~~~~~~
           18:  
check:55'0     ~
           19: Hex dump of section '.debug_loclists': 
check:55'0     ~~~~~~~~~~~~~~~~~~~~~~~~~~~~~~~~~~~~~~~
           20: 0x00000000 04 . 
check:55'0     ~~~~~~~~~~~~~~~~
>>>>>>
--
********************
Testing:  0.. 10.. 20.. 30.. 40.. 50
FAIL: lld :: ELF/loongarch-relax-emit-relocs.s (1506 of 2812)
******************** TEST 'lld :: ELF/loongarch-relax-emit-relocs.s' FAILED ********************
Script:
--
: 'RUN: at line 4';   /usr/bin/llvm-mc --filetype=obj --triple=loongarch32 --mattr=+relax /builddir/build/BUILD/lld-17.0.6.src/test/ELF/loongarch-relax-emit-relocs.s -o /builddir/build/BUILD/lld-17.0.6.src/x86_64-OpenCloudOS-linux-gnu/test/ELF/Output/loongarch-relax-emit-relocs.s.tmp.32.o
: 'RUN: at line 5';   /usr/bin/llvm-mc --filetype=obj --triple=loongarch64 --mattr=+relax /builddir/build/BUILD/lld-17.0.6.src/test/ELF/loongarch-relax-emit-relocs.s -o /builddir/build/BUILD/lld-17.0.6.src/x86_64-OpenCloudOS-linux-gnu/test/ELF/Output/loongarch-relax-emit-relocs.s.tmp.64.o
: 'RUN: at line 6';   /builddir/build/BUILD/lld-17.0.6.src/x86_64-OpenCloudOS-linux-gnu/bin/ld.lld -Ttext=0x10000 --emit-relocs /builddir/build/BUILD/lld-17.0.6.src/x86_64-OpenCloudOS-linux-gnu/test/ELF/Output/loongarch-relax-emit-relocs.s.tmp.32.o -o /builddir/build/BUILD/lld-17.0.6.src/x86_64-OpenCloudOS-linux-gnu/test/ELF/Output/loongarch-relax-emit-relocs.s.tmp.32
: 'RUN: at line 7';   /builddir/build/BUILD/lld-17.0.6.src/x86_64-OpenCloudOS-linux-gnu/bin/ld.lld -Ttext=0x10000 --emit-relocs /builddir/build/BUILD/lld-17.0.6.src/x86_64-OpenCloudOS-linux-gnu/test/ELF/Output/loongarch-relax-emit-relocs.s.tmp.64.o -o /builddir/build/BUILD/lld-17.0.6.src/x86_64-OpenCloudOS-linux-gnu/test/ELF/Output/loongarch-relax-emit-relocs.s.tmp.64
: 'RUN: at line 8';   /usr/bin/llvm-objdump -dr /builddir/build/BUILD/lld-17.0.6.src/x86_64-OpenCloudOS-linux-gnu/test/ELF/Output/loongarch-relax-emit-relocs.s.tmp.32 | /usr/bin/FileCheck /builddir/build/BUILD/lld-17.0.6.src/test/ELF/loongarch-relax-emit-relocs.s
: 'RUN: at line 9';   /usr/bin/llvm-objdump -dr /builddir/build/BUILD/lld-17.0.6.src/x86_64-OpenCloudOS-linux-gnu/test/ELF/Output/loongarch-relax-emit-relocs.s.tmp.64 | /usr/bin/FileCheck /builddir/build/BUILD/lld-17.0.6.src/test/ELF/loongarch-relax-emit-relocs.s
: 'RUN: at line 12';   /builddir/build/BUILD/lld-17.0.6.src/x86_64-OpenCloudOS-linux-gnu/bin/ld.lld -r /builddir/build/BUILD/lld-17.0.6.src/x86_64-OpenCloudOS-linux-gnu/test/ELF/Output/loongarch-relax-emit-relocs.s.tmp.64.o -o /builddir/build/BUILD/lld-17.0.6.src/x86_64-OpenCloudOS-linux-gnu/test/ELF/Output/loongarch-relax-emit-relocs.s.tmp.64.r
: 'RUN: at line 13';   /usr/bin/llvm-objdump -dr /builddir/build/BUILD/lld-17.0.6.src/x86_64-OpenCloudOS-linux-gnu/test/ELF/Output/loongarch-relax-emit-relocs.s.tmp.64.r | /usr/bin/FileCheck /builddir/build/BUILD/lld-17.0.6.src/test/ELF/loongarch-relax-emit-relocs.s --check-prefix=CHECKR
: 'RUN: at line 17';   /builddir/build/BUILD/lld-17.0.6.src/x86_64-OpenCloudOS-linux-gnu/bin/ld.lld -Ttext=0x10000 --emit-relocs --no-relax /builddir/build/BUILD/lld-17.0.6.src/x86_64-OpenCloudOS-linux-gnu/test/ELF/Output/loongarch-relax-emit-relocs.s.tmp.64.o -o /builddir/build/BUILD/lld-17.0.6.src/x86_64-OpenCloudOS-linux-gnu/test/ELF/Output/loongarch-relax-emit-relocs.s.tmp.64.norelax
: 'RUN: at line 18';   /usr/bin/llvm-objdump -dr /builddir/build/BUILD/lld-17.0.6.src/x86_64-OpenCloudOS-linux-gnu/test/ELF/Output/loongarch-relax-emit-relocs.s.tmp.64.norelax | /usr/bin/FileCheck /builddir/build/BUILD/lld-17.0.6.src/test/ELF/loongarch-relax-emit-relocs.s
--
Exit Code: 1
Command Output (stderr):
--
'+relax' is not a recognized feature for this target (ignoring feature)
'+relax' is not a recognized feature for this target (ignoring feature)
/builddir/build/BUILD/lld-17.0.6.src/test/ELF/loongarch-relax-emit-relocs.s:23:15: error: CHECK-NEXT: expected string not found in input
# CHECK-NEXT: R_LARCH_RELAX *ABS*
              ^
<stdin>:8:37: note: scanning from here
 00010000: R_LARCH_PCALA_HI20 _start
                                    ^
<stdin>:10:12: note: possible intended match here
 00010004: R_LARCH_PCALA_LO12 _start
           ^
Input file: <stdin>
Check file: /builddir/build/BUILD/lld-17.0.6.src/test/ELF/loongarch-relax-emit-relocs.s
-dump-input=help explains the following input dump.
Input was:
<<<<<<
           1:  
           2: /builddir/build/BUILD/lld-17.0.6.src/x86_64-OpenCloudOS-linux-gnu/test/ELF/Output/loongarch-relax-emit-relocs.s.tmp.32: file format elf32-loongarch 
           3:  
           4: Disassembly of section .text: 
           5:  
           6: 00010000 <_start>: 
           7:  10000: 04 00 00 1a pcalau12i $a0, 0 
           8:  00010000: R_LARCH_PCALA_HI20 _start 
next:23'0                                         X error: no match found
           9:  10004: 84 00 80 02 addi.w $a0, $a0, 0 
next:23'0     ~~~~~~~~~~~~~~~~~~~~~~~~~~~~~~~~~~~~~~~
          10:  00010004: R_LARCH_PCALA_LO12 _start 
next:23'0     ~~~~~~~~~~~~~~~~~~~~~~~~~~~~~~~~~~~~~
next:23'1                ?                          possible intended match
          11:  10008: 00 00 40 03 nop 
next:23'0     ~~~~~~~~~~~~~~~~~~~~~~~~
          12:  1000c: 00 00 40 03 nop 
next:23'0     ~~~~~~~~~~~~~~~~~~~~~~~~
          13:  10010: 20 00 00 4c ret 
next:23'0     ~~~~~~~~~~~~~~~~~~~~~~~~
>>>>>>
--
********************
Testing:  0.. 10.. 20.. 30.. 40.. 50
FAIL: lld :: ELF/loongarch-relax-align.s (1511 of 2812)
******************** TEST 'lld :: ELF/loongarch-relax-align.s' FAILED ********************
Script:
--
: 'RUN: at line 3';   /usr/bin/llvm-mc --filetype=obj --triple=loongarch32 --mattr=+relax /builddir/build/BUILD/lld-17.0.6.src/test/ELF/loongarch-relax-align.s -o /builddir/build/BUILD/lld-17.0.6.src/x86_64-OpenCloudOS-linux-gnu/test/ELF/Output/loongarch-relax-align.s.tmp.32.o
: 'RUN: at line 4';   /usr/bin/llvm-mc --filetype=obj --triple=loongarch64 --mattr=+relax /builddir/build/BUILD/lld-17.0.6.src/test/ELF/loongarch-relax-align.s -o /builddir/build/BUILD/lld-17.0.6.src/x86_64-OpenCloudOS-linux-gnu/test/ELF/Output/loongarch-relax-align.s.tmp.64.o
: 'RUN: at line 5';   /builddir/build/BUILD/lld-17.0.6.src/x86_64-OpenCloudOS-linux-gnu/bin/ld.lld --section-start=.text=0x10000 --section-start=.text2=0x20000 -e 0 /builddir/build/BUILD/lld-17.0.6.src/x86_64-OpenCloudOS-linux-gnu/test/ELF/Output/loongarch-relax-align.s.tmp.32.o -o /builddir/build/BUILD/lld-17.0.6.src/x86_64-OpenCloudOS-linux-gnu/test/ELF/Output/loongarch-relax-align.s.tmp.32
: 'RUN: at line 6';   /builddir/build/BUILD/lld-17.0.6.src/x86_64-OpenCloudOS-linux-gnu/bin/ld.lld --section-start=.text=0x10000 --section-start=.text2=0x20000 -e 0 /builddir/build/BUILD/lld-17.0.6.src/x86_64-OpenCloudOS-linux-gnu/test/ELF/Output/loongarch-relax-align.s.tmp.64.o -o /builddir/build/BUILD/lld-17.0.6.src/x86_64-OpenCloudOS-linux-gnu/test/ELF/Output/loongarch-relax-align.s.tmp.64
: 'RUN: at line 7';   /builddir/build/BUILD/lld-17.0.6.src/x86_64-OpenCloudOS-linux-gnu/bin/ld.lld --section-start=.text=0x10000 --section-start=.text2=0x20000 -e 0 /builddir/build/BUILD/lld-17.0.6.src/x86_64-OpenCloudOS-linux-gnu/test/ELF/Output/loongarch-relax-align.s.tmp.32.o --no-relax -o /builddir/build/BUILD/lld-17.0.6.src/x86_64-OpenCloudOS-linux-gnu/test/ELF/Output/loongarch-relax-align.s.tmp.32n
: 'RUN: at line 8';   /builddir/build/BUILD/lld-17.0.6.src/x86_64-OpenCloudOS-linux-gnu/bin/ld.lld --section-start=.text=0x10000 --section-start=.text2=0x20000 -e 0 /builddir/build/BUILD/lld-17.0.6.src/x86_64-OpenCloudOS-linux-gnu/test/ELF/Output/loongarch-relax-align.s.tmp.64.o --no-relax -o /builddir/build/BUILD/lld-17.0.6.src/x86_64-OpenCloudOS-linux-gnu/test/ELF/Output/loongarch-relax-align.s.tmp.64n
: 'RUN: at line 9';   /usr/bin/llvm-objdump -td --no-show-raw-insn /builddir/build/BUILD/lld-17.0.6.src/x86_64-OpenCloudOS-linux-gnu/test/ELF/Output/loongarch-relax-align.s.tmp.32 | /usr/bin/FileCheck /builddir/build/BUILD/lld-17.0.6.src/test/ELF/loongarch-relax-align.s
: 'RUN: at line 10';   /usr/bin/llvm-objdump -td --no-show-raw-insn /builddir/build/BUILD/lld-17.0.6.src/x86_64-OpenCloudOS-linux-gnu/test/ELF/Output/loongarch-relax-align.s.tmp.64 | /usr/bin/FileCheck /builddir/build/BUILD/lld-17.0.6.src/test/ELF/loongarch-relax-align.s
: 'RUN: at line 11';   /usr/bin/llvm-objdump -td --no-show-raw-insn /builddir/build/BUILD/lld-17.0.6.src/x86_64-OpenCloudOS-linux-gnu/test/ELF/Output/loongarch-relax-align.s.tmp.32n | /usr/bin/FileCheck /builddir/build/BUILD/lld-17.0.6.src/test/ELF/loongarch-relax-align.s
: 'RUN: at line 12';   /usr/bin/llvm-objdump -td --no-show-raw-insn /builddir/build/BUILD/lld-17.0.6.src/x86_64-OpenCloudOS-linux-gnu/test/ELF/Output/loongarch-relax-align.s.tmp.64n | /usr/bin/FileCheck /builddir/build/BUILD/lld-17.0.6.src/test/ELF/loongarch-relax-align.s
: 'RUN: at line 15';   /usr/bin/llvm-mc --filetype=obj --triple=loongarch64 --mattr=+relax /builddir/build/BUILD/lld-17.0.6.src/test/ELF/loongarch-relax-align.s -o /builddir/build/BUILD/lld-17.0.6.src/x86_64-OpenCloudOS-linux-gnu/test/ELF/Output/loongarch-relax-align.s.tmp.o64.o --defsym=old=1
: 'RUN: at line 16';   /builddir/build/BUILD/lld-17.0.6.src/x86_64-OpenCloudOS-linux-gnu/bin/ld.lld --section-start=.text=0x10000 --section-start=.text2=0x20000 -e 0 /builddir/build/BUILD/lld-17.0.6.src/x86_64-OpenCloudOS-linux-gnu/test/ELF/Output/loongarch-relax-align.s.tmp.o64.o -o /builddir/build/BUILD/lld-17.0.6.src/x86_64-OpenCloudOS-linux-gnu/test/ELF/Output/loongarch-relax-align.s.tmp.o64
: 'RUN: at line 17';   /builddir/build/BUILD/lld-17.0.6.src/x86_64-OpenCloudOS-linux-gnu/bin/ld.lld --section-start=.text=0x10000 --section-start=.text2=0x20000 -e 0 /builddir/build/BUILD/lld-17.0.6.src/x86_64-OpenCloudOS-linux-gnu/test/ELF/Output/loongarch-relax-align.s.tmp.o64.o --no-relax -o /builddir/build/BUILD/lld-17.0.6.src/x86_64-OpenCloudOS-linux-gnu/test/ELF/Output/loongarch-relax-align.s.tmp.o64n
: 'RUN: at line 18';   /usr/bin/llvm-objdump -td --no-show-raw-insn /builddir/build/BUILD/lld-17.0.6.src/x86_64-OpenCloudOS-linux-gnu/test/ELF/Output/loongarch-relax-align.s.tmp.o64 | /usr/bin/FileCheck /builddir/build/BUILD/lld-17.0.6.src/test/ELF/loongarch-relax-align.s
: 'RUN: at line 19';   /usr/bin/llvm-objdump -td --no-show-raw-insn /builddir/build/BUILD/lld-17.0.6.src/x86_64-OpenCloudOS-linux-gnu/test/ELF/Output/loongarch-relax-align.s.tmp.o64n | /usr/bin/FileCheck /builddir/build/BUILD/lld-17.0.6.src/test/ELF/loongarch-relax-align.s
: 'RUN: at line 22';   /builddir/build/BUILD/lld-17.0.6.src/x86_64-OpenCloudOS-linux-gnu/bin/ld.lld -r /builddir/build/BUILD/lld-17.0.6.src/x86_64-OpenCloudOS-linux-gnu/test/ELF/Output/loongarch-relax-align.s.tmp.64.o -o /builddir/build/BUILD/lld-17.0.6.src/x86_64-OpenCloudOS-linux-gnu/test/ELF/Output/loongarch-relax-align.s.tmp.64.r
: 'RUN: at line 23';   /usr/bin/llvm-objdump -dr --no-show-raw-insn /builddir/build/BUILD/lld-17.0.6.src/x86_64-OpenCloudOS-linux-gnu/test/ELF/Output/loongarch-relax-align.s.tmp.64.r | /usr/bin/FileCheck /builddir/build/BUILD/lld-17.0.6.src/test/ELF/loongarch-relax-align.s --check-prefix=CHECKR
--
Exit Code: 1
Command Output (stderr):
--
'+relax' is not a recognized feature for this target (ignoring feature)
'+relax' is not a recognized feature for this target (ignoring feature)
/builddir/build/BUILD/lld-17.0.6.src/test/ELF/loongarch-relax-align.s:25:14: error: CHECK-DAG: expected string not found in input
# CHECK-DAG: {{0*}}10000 l .text {{0*}}44 .Ltext_start
             ^
<stdin>:1:1: note: scanning from here
^
<stdin>:8:1: note: possible intended match here
00010000 <.text>:
^
Input file: <stdin>
Check file: /builddir/build/BUILD/lld-17.0.6.src/test/ELF/loongarch-relax-align.s
-dump-input=help explains the following input dump.
Input was:
<<<<<<
          1:  
dag:25'0     X error: no match found
          2: /builddir/build/BUILD/lld-17.0.6.src/x86_64-OpenCloudOS-linux-gnu/test/ELF/Output/loongarch-relax-align.s.tmp.32: file format elf32-loongarch 
dag:25'0     ~~~~~~~~~~~~~~~~~~~~~~~~~~~~~~~~~~~~~~~~~~~~~~~~~~~~~~~~~~~~~~~~~~~~~~~~~~~~~~~~~~~~~~~~~~~~~~~~~~~~~~~~~~~~~~~~~~~~~~~~~~~~~~~~~~~~~~~~~~~~~~
          3:  
dag:25'0     ~
          4: SYMBOL TABLE: 
dag:25'0     ~~~~~~~~~~~~~~
          5:  
dag:25'0     ~
          6: Disassembly of section .text: 
dag:25'0     ~~~~~~~~~~~~~~~~~~~~~~~~~~~~~~
          7:  
dag:25'0     ~
          8: 00010000 <.text>: 
dag:25'0     ~~~~~~~~~~~~~~~~~~
dag:25'1     ?                  possible intended match
          9:  10000: break 1 
dag:25'0     ~~~~~~~~~~~~~~~~
         10:  10004: break 2 
dag:25'0     ~~~~~~~~~~~~~~~~
         11:  10008: nop 
dag:25'0     ~~~~~~~~~~~~
         12:  1000c: nop 
dag:25'0     ~~~~~~~~~~~~
         13:  10010: break 3 
dag:25'0     ~~~~~~~~~~~~~~~~
          .
          .
          .
>>>>>>
--
********************
Testing:  0.. 10.. 20.. 30.. 40.. 50.. 60.. 70.. 80.. 90.. 
1 warning(s) in tests
********************
Failed Tests (3):
  lld :: ELF/loongarch-relax-align.s
  lld :: ELF/loongarch-relax-emit-relocs.s
  lld :: ELF/loongarch-reloc-leb128.s
Testing Time: 16.30s
  Unsupported      :   20
  Passed           : 2788
  Expectedly Failed:    1
  Failed           :    3
FAILED: test/CMakeFiles/check-lld /builddir/build/BUILD/lld-17.0.6.src/x86_64-OpenCloudOS-linux-gnu/test/CMakeFiles/check-lld 
cd /builddir/build/BUILD/lld-17.0.6.src/x86_64-OpenCloudOS-linux-gnu/test && /usr/bin/python3.11 /usr/bin/lit -sv 	--path /usr/lib64/llvm /builddir/build/BUILD/lld-17.0.6.src/x86_64-OpenCloudOS-linux-gnu/test
ninja: build stopped: subcommand failed.
error: Bad exit status from /var/tmp/rpm-tmp.WDLnu0 (%check)
    Bad exit status from /var/tmp/rpm-tmp.WDLnu0 (%check)
RPM build errors:
Child return code was: 1
EXCEPTION: [Error('Command failed: \n # bash --login -c /usr/bin/rpmbuild -bb --noclean --target x86_64 --nodeps /builddir/build/SPECS/lld.spec\n', 1)]
Traceback (most recent call last):
  File "/usr/lib/python3.11/site-packages/mockbuild/trace_decorator.py", line 93, in trace
    result = func(*args, **kw)
             ^^^^^^^^^^^^^^^^^
  File "/usr/lib/python3.11/site-packages/mockbuild/util.py", line 597, in do_with_status
    raise exception.Error("Command failed: \n # %s\n%s" % (command, output), child.returncode)
mockbuild.exception.Error: Command failed: 
 # bash --login -c /usr/bin/rpmbuild -bb --noclean --target x86_64 --nodeps /builddir/build/SPECS/lld.spec