Mock Version: 4.1
Mock Version: 4.1
Mock Version: 4.1
ENTER ['do_with_status'](['bash', '--login', '-c', '/usr/bin/rpmbuild -bs --noclean --target noarch --nodeps /builddir/build/SPECS/python-readme-renderer.spec'], chrootPath='/var/lib/mock/dist-ocs23-python311-build-85249-4721/root'env={'TERM': 'vt100', 'SHELL': '/bin/bash', 'HOME': '/builddir', 'HOSTNAME': 'mock', 'PATH': '/usr/bin:/bin:/usr/sbin:/sbin', 'PROMPT_COMMAND': 'printf "\\033]0;<mock-chroot>\\007"', 'PS1': '<mock-chroot> \\s-\\v\\$ ', 'LANG': 'C.UTF-8'}shell=Falselogger=<mockbuild.trace_decorator.getLog object at 0x7f8e75617fd0>timeout=86400uid=981gid=135user='mockbuild'nspawn_args=[]unshare_net=TrueprintOutput=False)
Executing command: ['bash', '--login', '-c', '/usr/bin/rpmbuild -bs --noclean --target noarch --nodeps /builddir/build/SPECS/python-readme-renderer.spec'] with env {'TERM': 'vt100', 'SHELL': '/bin/bash', 'HOME': '/builddir', 'HOSTNAME': 'mock', 'PATH': '/usr/bin:/bin:/usr/sbin:/sbin', 'PROMPT_COMMAND': 'printf "\\033]0;<mock-chroot>\\007"', 'PS1': '<mock-chroot> \\s-\\v\\$ ', 'LANG': 'C.UTF-8'} and shell False
Building target platforms: noarch
Building for target noarch
Wrote: /builddir/build/SRPMS/python-readme-renderer-37.3-3.ocs23.src.rpm
Child return code was: 0
ENTER ['do_with_status'](['bash', '--login', '-c', '/usr/bin/rpmbuild -br --noclean --target noarch --nodeps /builddir/build/SPECS/python-readme-renderer.spec'], chrootPath='/var/lib/mock/dist-ocs23-python311-build-85249-4721/root'env={'TERM': 'vt100', 'SHELL': '/bin/bash', 'HOME': '/builddir', 'HOSTNAME': 'mock', 'PATH': '/usr/bin:/bin:/usr/sbin:/sbin', 'PROMPT_COMMAND': 'printf "\\033]0;<mock-chroot>\\007"', 'PS1': '<mock-chroot> \\s-\\v\\$ ', 'LANG': 'C.UTF-8'}shell=Falselogger=<mockbuild.trace_decorator.getLog object at 0x7f8e75617fd0>timeout=86400uid=981gid=135user='mockbuild'nspawn_args=[]unshare_net=TrueraiseExc=FalseprintOutput=False)
Executing command: ['bash', '--login', '-c', '/usr/bin/rpmbuild -br --noclean --target noarch --nodeps /builddir/build/SPECS/python-readme-renderer.spec'] with env {'TERM': 'vt100', 'SHELL': '/bin/bash', 'HOME': '/builddir', 'HOSTNAME': 'mock', 'PATH': '/usr/bin:/bin:/usr/sbin:/sbin', 'PROMPT_COMMAND': 'printf "\\033]0;<mock-chroot>\\007"', 'PS1': '<mock-chroot> \\s-\\v\\$ ', 'LANG': 'C.UTF-8'} and shell False
Building target platforms: noarch
Building for target noarch
Executing(%prep): /bin/sh -e /var/tmp/rpm-tmp.NPstsv
+ umask 022
+ cd /builddir/build/BUILD
+ cd /builddir/build/BUILD
+ rm -rf readme_renderer-37.3
+ /usr/lib/rpm/rpmuncompress -x /builddir/build/SOURCES/37.3.tar.gz
+ STATUS=0
+ '[' 0 -ne 0 ']'
+ cd readme_renderer-37.3
+ /usr/bin/chmod -Rf a+rX,u+w,g-w,o-w .
+ RPM_EC=0
++ jobs -p
+ exit 0
Executing(%generate_buildrequires): /bin/sh -e /var/tmp/rpm-tmp.pEhxZb
+ umask 022
+ cd /builddir/build/BUILD
+ cd readme_renderer-37.3
+ echo pyproject-rpm-macros
+ echo python3-devel
+ echo 'python3dist(pip) >= 19'
+ echo 'python3dist(packaging)'
+ '[' -f pyproject.toml ']'
+ echo 'python3dist(toml)'
+ rm -rfv '*.dist-info/'
+ '[' -f /usr/bin/python3 ']'
+ RPM_TOXENV=py311
+ HOSTNAME=rpmbuild
+ /usr/bin/python3 -s /usr/lib/rpm/OpenCloudOS/pyproject_buildrequires.py --generate-extras --python3_pkgversion 3 -t
Import error: No module named 'toml'
+ RPM_EC=0
++ jobs -p
+ exit 0
Wrote: /builddir/build/SRPMS/python-readme-renderer-37.3-3.ocs23.buildreqs.nosrc.rpm
Child return code was: 11
Dynamic buildrequires detected
Going to install missing buildrequires. See root.log for details.
ENTER ['do_with_status'](['bash', '--login', '-c', '/usr/bin/rpmbuild -br --noclean --target noarch --nodeps /builddir/build/SPECS/python-readme-renderer.spec'], chrootPath='/var/lib/mock/dist-ocs23-python311-build-85249-4721/root'env={'TERM': 'vt100', 'SHELL': '/bin/bash', 'HOME': '/builddir', 'HOSTNAME': 'mock', 'PATH': '/usr/bin:/bin:/usr/sbin:/sbin', 'PROMPT_COMMAND': 'printf "\\033]0;<mock-chroot>\\007"', 'PS1': '<mock-chroot> \\s-\\v\\$ ', 'LANG': 'C.UTF-8'}shell=Falselogger=<mockbuild.trace_decorator.getLog object at 0x7f8e75617fd0>timeout=86400uid=981gid=135user='mockbuild'nspawn_args=[]unshare_net=TrueraiseExc=FalseprintOutput=False)
Executing command: ['bash', '--login', '-c', '/usr/bin/rpmbuild -br --noclean --target noarch --nodeps /builddir/build/SPECS/python-readme-renderer.spec'] with env {'TERM': 'vt100', 'SHELL': '/bin/bash', 'HOME': '/builddir', 'HOSTNAME': 'mock', 'PATH': '/usr/bin:/bin:/usr/sbin:/sbin', 'PROMPT_COMMAND': 'printf "\\033]0;<mock-chroot>\\007"', 'PS1': '<mock-chroot> \\s-\\v\\$ ', 'LANG': 'C.UTF-8'} and shell False
Building target platforms: noarch
Building for target noarch
Executing(%prep): /bin/sh -e /var/tmp/rpm-tmp.o0CGb1
+ umask 022
+ cd /builddir/build/BUILD
+ cd /builddir/build/BUILD
+ rm -rf readme_renderer-37.3
+ /usr/lib/rpm/rpmuncompress -x /builddir/build/SOURCES/37.3.tar.gz
+ STATUS=0
+ '[' 0 -ne 0 ']'
+ cd readme_renderer-37.3
+ /usr/bin/chmod -Rf a+rX,u+w,g-w,o-w .
+ RPM_EC=0
++ jobs -p
+ exit 0
Executing(%generate_buildrequires): /bin/sh -e /var/tmp/rpm-tmp.ZTgvzB
+ umask 022
+ cd /builddir/build/BUILD
+ cd readme_renderer-37.3
+ echo pyproject-rpm-macros
+ echo python3-devel
+ echo 'python3dist(pip) >= 19'
+ echo 'python3dist(packaging)'
+ '[' -f pyproject.toml ']'
+ echo 'python3dist(toml)'
+ rm -rfv '*.dist-info/'
+ '[' -f /usr/bin/python3 ']'
+ RPM_TOXENV=py311
+ HOSTNAME=rpmbuild
+ /usr/bin/python3 -s /usr/lib/rpm/OpenCloudOS/pyproject_buildrequires.py --generate-extras --python3_pkgversion 3 -t
Handling setuptools>=40.8.0 from build-system.requires
Requirement satisfied: setuptools>=40.8.0
   (installed: setuptools 65.5.1)
HOOK STDOUT: running egg_info
HOOK STDOUT: creating readme_renderer.egg-info
HOOK STDOUT: writing readme_renderer.egg-info/PKG-INFO
HOOK STDOUT: writing dependency_links to readme_renderer.egg-info/dependency_links.txt
HOOK STDOUT: writing requirements to readme_renderer.egg-info/requires.txt
HOOK STDOUT: writing top-level names to readme_renderer.egg-info/top_level.txt
HOOK STDOUT: writing manifest file 'readme_renderer.egg-info/SOURCES.txt'
HOOK STDOUT: reading manifest file 'readme_renderer.egg-info/SOURCES.txt'
HOOK STDOUT: reading manifest template 'MANIFEST.in'
HOOK STDOUT: adding license file 'LICENSE'
HOOK STDOUT: writing manifest file 'readme_renderer.egg-info/SOURCES.txt'
Handling wheel from get_requires_for_build_wheel
Requirement satisfied: wheel
   (installed: wheel 0.37.0)
Handling tox-current-env >= 0.0.6 from tox itself
Requirement not satisfied: tox-current-env >= 0.0.6
Exiting dependency generation pass: tox itself
+ RPM_EC=0
++ jobs -p
+ exit 0
Wrote: /builddir/build/SRPMS/python-readme-renderer-37.3-3.ocs23.buildreqs.nosrc.rpm
Child return code was: 11
Dynamic buildrequires detected
Going to install missing buildrequires. See root.log for details.
ENTER ['do_with_status'](['bash', '--login', '-c', '/usr/bin/rpmbuild -br --noclean --target noarch --nodeps /builddir/build/SPECS/python-readme-renderer.spec'], chrootPath='/var/lib/mock/dist-ocs23-python311-build-85249-4721/root'env={'TERM': 'vt100', 'SHELL': '/bin/bash', 'HOME': '/builddir', 'HOSTNAME': 'mock', 'PATH': '/usr/bin:/bin:/usr/sbin:/sbin', 'PROMPT_COMMAND': 'printf "\\033]0;<mock-chroot>\\007"', 'PS1': '<mock-chroot> \\s-\\v\\$ ', 'LANG': 'C.UTF-8'}shell=Falselogger=<mockbuild.trace_decorator.getLog object at 0x7f8e75617fd0>timeout=86400uid=981gid=135user='mockbuild'nspawn_args=[]unshare_net=TrueraiseExc=FalseprintOutput=False)
Executing command: ['bash', '--login', '-c', '/usr/bin/rpmbuild -br --noclean --target noarch --nodeps /builddir/build/SPECS/python-readme-renderer.spec'] with env {'TERM': 'vt100', 'SHELL': '/bin/bash', 'HOME': '/builddir', 'HOSTNAME': 'mock', 'PATH': '/usr/bin:/bin:/usr/sbin:/sbin', 'PROMPT_COMMAND': 'printf "\\033]0;<mock-chroot>\\007"', 'PS1': '<mock-chroot> \\s-\\v\\$ ', 'LANG': 'C.UTF-8'} and shell False
Building target platforms: noarch
Building for target noarch
Executing(%prep): /bin/sh -e /var/tmp/rpm-tmp.DnKAgB
+ umask 022
+ cd /builddir/build/BUILD
+ cd /builddir/build/BUILD
+ rm -rf readme_renderer-37.3
+ /usr/lib/rpm/rpmuncompress -x /builddir/build/SOURCES/37.3.tar.gz
+ STATUS=0
+ '[' 0 -ne 0 ']'
+ cd readme_renderer-37.3
+ /usr/bin/chmod -Rf a+rX,u+w,g-w,o-w .
+ RPM_EC=0
++ jobs -p
+ exit 0
Executing(%generate_buildrequires): /bin/sh -e /var/tmp/rpm-tmp.F7BYLk
+ umask 022
+ cd /builddir/build/BUILD
+ cd readme_renderer-37.3
+ echo pyproject-rpm-macros
+ echo python3-devel
+ echo 'python3dist(pip) >= 19'
+ echo 'python3dist(packaging)'
+ '[' -f pyproject.toml ']'
+ echo 'python3dist(toml)'
+ rm -rfv '*.dist-info/'
+ '[' -f /usr/bin/python3 ']'
+ RPM_TOXENV=py311
+ HOSTNAME=rpmbuild
+ /usr/bin/python3 -s /usr/lib/rpm/OpenCloudOS/pyproject_buildrequires.py --generate-extras --python3_pkgversion 3 -t
Handling setuptools>=40.8.0 from build-system.requires
Requirement satisfied: setuptools>=40.8.0
   (installed: setuptools 65.5.1)
HOOK STDOUT: running egg_info
HOOK STDOUT: creating readme_renderer.egg-info
HOOK STDOUT: writing readme_renderer.egg-info/PKG-INFO
HOOK STDOUT: writing dependency_links to readme_renderer.egg-info/dependency_links.txt
HOOK STDOUT: writing requirements to readme_renderer.egg-info/requires.txt
HOOK STDOUT: writing top-level names to readme_renderer.egg-info/top_level.txt
HOOK STDOUT: writing manifest file 'readme_renderer.egg-info/SOURCES.txt'
HOOK STDOUT: reading manifest file 'readme_renderer.egg-info/SOURCES.txt'
HOOK STDOUT: reading manifest template 'MANIFEST.in'
HOOK STDOUT: adding license file 'LICENSE'
HOOK STDOUT: writing manifest file 'readme_renderer.egg-info/SOURCES.txt'
Handling wheel from get_requires_for_build_wheel
Requirement satisfied: wheel
   (installed: wheel 0.37.0)
Handling tox-current-env >= 0.0.6 from tox itself
Requirement satisfied: tox-current-env >= 0.0.6
   (installed: tox-current-env 0.0.8)
___________________________________ summary ____________________________________
  py311: commands succeeded
  congratulations :)
Handling pytest from tox --print-deps-only: py311
Requirement not satisfied: pytest
Handling pytest-cov from tox --print-deps-only: py311
Requirement not satisfied: pytest-cov
HOOK STDOUT: running dist_info
HOOK STDOUT: writing readme_renderer.egg-info/PKG-INFO
HOOK STDOUT: writing dependency_links to readme_renderer.egg-info/dependency_links.txt
HOOK STDOUT: writing requirements to readme_renderer.egg-info/requires.txt
HOOK STDOUT: writing top-level names to readme_renderer.egg-info/top_level.txt
HOOK STDOUT: reading manifest file 'readme_renderer.egg-info/SOURCES.txt'
HOOK STDOUT: reading manifest template 'MANIFEST.in'
HOOK STDOUT: adding license file 'LICENSE'
HOOK STDOUT: writing manifest file 'readme_renderer.egg-info/SOURCES.txt'
HOOK STDOUT: creating '/builddir/build/BUILD/readme_renderer-37.3/readme_renderer-37.3.dist-info'
HOOK STDOUT: adding license file "LICENSE" (matched pattern "LICENSE")
Handling bleach (>=2.1.0) from wheel metadata: Requires-Dist
Requirement not satisfied: bleach (>=2.1.0)
Handling docutils (>=0.13.1) from wheel metadata: Requires-Dist
Requirement not satisfied: docutils (>=0.13.1)
Handling Pygments (>=2.5.1) from wheel metadata: Requires-Dist
Requirement not satisfied: Pygments (>=2.5.1)
Handling cmarkgfm (>=0.8.0) ; extra == 'md' from wheel metadata: Requires-Dist
Requirement not satisfied: cmarkgfm (>=0.8.0) ; extra == 'md'
+ RPM_EC=0
++ jobs -p
+ exit 0
Wrote: /builddir/build/SRPMS/python-readme-renderer-37.3-3.ocs23.buildreqs.nosrc.rpm
Child return code was: 11
Dynamic buildrequires detected
Going to install missing buildrequires. See root.log for details.
ENTER ['do_with_status'](['bash', '--login', '-c', '/usr/bin/rpmbuild -br --noclean --target noarch --nodeps /builddir/build/SPECS/python-readme-renderer.spec'], chrootPath='/var/lib/mock/dist-ocs23-python311-build-85249-4721/root'env={'TERM': 'vt100', 'SHELL': '/bin/bash', 'HOME': '/builddir', 'HOSTNAME': 'mock', 'PATH': '/usr/bin:/bin:/usr/sbin:/sbin', 'PROMPT_COMMAND': 'printf "\\033]0;<mock-chroot>\\007"', 'PS1': '<mock-chroot> \\s-\\v\\$ ', 'LANG': 'C.UTF-8'}shell=Falselogger=<mockbuild.trace_decorator.getLog object at 0x7f8e75617fd0>timeout=86400uid=981gid=135user='mockbuild'nspawn_args=[]unshare_net=TrueraiseExc=FalseprintOutput=False)
Executing command: ['bash', '--login', '-c', '/usr/bin/rpmbuild -br --noclean --target noarch --nodeps /builddir/build/SPECS/python-readme-renderer.spec'] with env {'TERM': 'vt100', 'SHELL': '/bin/bash', 'HOME': '/builddir', 'HOSTNAME': 'mock', 'PATH': '/usr/bin:/bin:/usr/sbin:/sbin', 'PROMPT_COMMAND': 'printf "\\033]0;<mock-chroot>\\007"', 'PS1': '<mock-chroot> \\s-\\v\\$ ', 'LANG': 'C.UTF-8'} and shell False
Building target platforms: noarch
Building for target noarch
Executing(%prep): /bin/sh -e /var/tmp/rpm-tmp.HTpgSA
+ umask 022
+ cd /builddir/build/BUILD
+ cd /builddir/build/BUILD
+ rm -rf readme_renderer-37.3
+ /usr/lib/rpm/rpmuncompress -x /builddir/build/SOURCES/37.3.tar.gz
+ STATUS=0
+ '[' 0 -ne 0 ']'
+ cd readme_renderer-37.3
+ /usr/bin/chmod -Rf a+rX,u+w,g-w,o-w .
+ RPM_EC=0
++ jobs -p
+ exit 0
Executing(%generate_buildrequires): /bin/sh -e /var/tmp/rpm-tmp.7bWmk0
+ umask 022
+ cd /builddir/build/BUILD
+ cd readme_renderer-37.3
+ echo pyproject-rpm-macros
+ echo python3-devel
+ echo 'python3dist(pip) >= 19'
+ echo 'python3dist(packaging)'
+ '[' -f pyproject.toml ']'
+ echo 'python3dist(toml)'
+ rm -rfv '*.dist-info/'
+ '[' -f /usr/bin/python3 ']'
+ RPM_TOXENV=py311
+ HOSTNAME=rpmbuild
+ /usr/bin/python3 -s /usr/lib/rpm/OpenCloudOS/pyproject_buildrequires.py --generate-extras --python3_pkgversion 3 -t
Handling setuptools>=40.8.0 from build-system.requires
Requirement satisfied: setuptools>=40.8.0
   (installed: setuptools 65.5.1)
HOOK STDOUT: running egg_info
HOOK STDOUT: creating readme_renderer.egg-info
HOOK STDOUT: writing readme_renderer.egg-info/PKG-INFO
HOOK STDOUT: writing dependency_links to readme_renderer.egg-info/dependency_links.txt
HOOK STDOUT: writing requirements to readme_renderer.egg-info/requires.txt
HOOK STDOUT: writing top-level names to readme_renderer.egg-info/top_level.txt
HOOK STDOUT: writing manifest file 'readme_renderer.egg-info/SOURCES.txt'
HOOK STDOUT: reading manifest file 'readme_renderer.egg-info/SOURCES.txt'
HOOK STDOUT: reading manifest template 'MANIFEST.in'
HOOK STDOUT: adding license file 'LICENSE'
HOOK STDOUT: writing manifest file 'readme_renderer.egg-info/SOURCES.txt'
Handling wheel from get_requires_for_build_wheel
Requirement satisfied: wheel
   (installed: wheel 0.37.0)
Handling tox-current-env >= 0.0.6 from tox itself
Requirement satisfied: tox-current-env >= 0.0.6
   (installed: tox-current-env 0.0.8)
___________________________________ summary ____________________________________
  py311: commands succeeded
  congratulations :)
Handling pytest from tox --print-deps-only: py311
Requirement satisfied: pytest
   (installed: pytest 7.1.3)
Handling pytest-cov from tox --print-deps-only: py311
Requirement satisfied: pytest-cov
   (installed: pytest-cov 4.0.0)
HOOK STDOUT: running dist_info
HOOK STDOUT: writing readme_renderer.egg-info/PKG-INFO
HOOK STDOUT: writing dependency_links to readme_renderer.egg-info/dependency_links.txt
HOOK STDOUT: writing requirements to readme_renderer.egg-info/requires.txt
HOOK STDOUT: writing top-level names to readme_renderer.egg-info/top_level.txt
HOOK STDOUT: reading manifest file 'readme_renderer.egg-info/SOURCES.txt'
HOOK STDOUT: reading manifest template 'MANIFEST.in'
HOOK STDOUT: adding license file 'LICENSE'
HOOK STDOUT: writing manifest file 'readme_renderer.egg-info/SOURCES.txt'
HOOK STDOUT: creating '/builddir/build/BUILD/readme_renderer-37.3/readme_renderer-37.3.dist-info'
HOOK STDOUT: adding license file "LICENSE" (matched pattern "LICENSE")
Handling bleach (>=2.1.0) from wheel metadata: Requires-Dist
Requirement satisfied: bleach (>=2.1.0)
   (installed: bleach 6.0.0)
Handling docutils (>=0.13.1) from wheel metadata: Requires-Dist
Requirement satisfied: docutils (>=0.13.1)
   (installed: docutils 0.17.1)
Handling Pygments (>=2.5.1) from wheel metadata: Requires-Dist
Requirement satisfied: Pygments (>=2.5.1)
   (installed: Pygments 2.16.1)
Handling cmarkgfm (>=0.8.0) ; extra == 'md' from wheel metadata: Requires-Dist
Requirement satisfied: cmarkgfm (>=0.8.0) ; extra == 'md'
   (installed: cmarkgfm 2022.10.27)
+ RPM_EC=0
++ jobs -p
+ exit 0
Wrote: /builddir/build/SRPMS/python-readme-renderer-37.3-3.ocs23.buildreqs.nosrc.rpm
Child return code was: 11
Dynamic buildrequires detected
Going to install missing buildrequires. See root.log for details.
ENTER ['do_with_status'](['bash', '--login', '-c', '/usr/bin/rpmbuild -ba --noprep --noclean --target noarch --nodeps /builddir/build/SPECS/python-readme-renderer.spec'], chrootPath='/var/lib/mock/dist-ocs23-python311-build-85249-4721/root'env={'TERM': 'vt100', 'SHELL': '/bin/bash', 'HOME': '/builddir', 'HOSTNAME': 'mock', 'PATH': '/usr/bin:/bin:/usr/sbin:/sbin', 'PROMPT_COMMAND': 'printf "\\033]0;<mock-chroot>\\007"', 'PS1': '<mock-chroot> \\s-\\v\\$ ', 'LANG': 'C.UTF-8'}shell=Falselogger=<mockbuild.trace_decorator.getLog object at 0x7f8e75617fd0>timeout=86400uid=981gid=135user='mockbuild'nspawn_args=[]unshare_net=TrueprintOutput=False)
Executing command: ['bash', '--login', '-c', '/usr/bin/rpmbuild -ba --noprep --noclean --target noarch --nodeps /builddir/build/SPECS/python-readme-renderer.spec'] with env {'TERM': 'vt100', 'SHELL': '/bin/bash', 'HOME': '/builddir', 'HOSTNAME': 'mock', 'PATH': '/usr/bin:/bin:/usr/sbin:/sbin', 'PROMPT_COMMAND': 'printf "\\033]0;<mock-chroot>\\007"', 'PS1': '<mock-chroot> \\s-\\v\\$ ', 'LANG': 'C.UTF-8'} and shell False
Building target platforms: noarch
Building for target noarch
Executing(%generate_buildrequires): /bin/sh -e /var/tmp/rpm-tmp.TYbXy6
+ umask 022
+ cd /builddir/build/BUILD
+ cd readme_renderer-37.3
+ echo pyproject-rpm-macros
+ echo python3-devel
+ echo 'python3dist(pip) >= 19'
+ echo 'python3dist(packaging)'
+ '[' -f pyproject.toml ']'
+ echo 'python3dist(toml)'
+ rm -rfv readme_renderer-37.3.dist-info/
removed 'readme_renderer-37.3.dist-info/METADATA'
removed 'readme_renderer-37.3.dist-info/top_level.txt'
removed 'readme_renderer-37.3.dist-info/LICENSE'
removed directory 'readme_renderer-37.3.dist-info/'
+ '[' -f /usr/bin/python3 ']'
+ RPM_TOXENV=py311
+ HOSTNAME=rpmbuild
+ /usr/bin/python3 -s /usr/lib/rpm/OpenCloudOS/pyproject_buildrequires.py --generate-extras --python3_pkgversion 3 -t
Handling setuptools>=40.8.0 from build-system.requires
Requirement satisfied: setuptools>=40.8.0
   (installed: setuptools 65.5.1)
HOOK STDOUT: running egg_info
HOOK STDOUT: writing readme_renderer.egg-info/PKG-INFO
HOOK STDOUT: writing dependency_links to readme_renderer.egg-info/dependency_links.txt
HOOK STDOUT: writing requirements to readme_renderer.egg-info/requires.txt
HOOK STDOUT: writing top-level names to readme_renderer.egg-info/top_level.txt
HOOK STDOUT: reading manifest file 'readme_renderer.egg-info/SOURCES.txt'
HOOK STDOUT: reading manifest template 'MANIFEST.in'
HOOK STDOUT: adding license file 'LICENSE'
HOOK STDOUT: writing manifest file 'readme_renderer.egg-info/SOURCES.txt'
Handling wheel from get_requires_for_build_wheel
Requirement satisfied: wheel
   (installed: wheel 0.37.0)
Handling tox-current-env >= 0.0.6 from tox itself
Requirement satisfied: tox-current-env >= 0.0.6
   (installed: tox-current-env 0.0.8)
___________________________________ summary ____________________________________
  py311: commands succeeded
  congratulations :)
Handling pytest from tox --print-deps-only: py311
Requirement satisfied: pytest
   (installed: pytest 7.1.3)
Handling pytest-cov from tox --print-deps-only: py311
Requirement satisfied: pytest-cov
   (installed: pytest-cov 4.0.0)
HOOK STDOUT: running dist_info
HOOK STDOUT: writing readme_renderer.egg-info/PKG-INFO
HOOK STDOUT: writing dependency_links to readme_renderer.egg-info/dependency_links.txt
HOOK STDOUT: writing requirements to readme_renderer.egg-info/requires.txt
HOOK STDOUT: writing top-level names to readme_renderer.egg-info/top_level.txt
HOOK STDOUT: reading manifest file 'readme_renderer.egg-info/SOURCES.txt'
HOOK STDOUT: reading manifest template 'MANIFEST.in'
HOOK STDOUT: adding license file 'LICENSE'
HOOK STDOUT: writing manifest file 'readme_renderer.egg-info/SOURCES.txt'
HOOK STDOUT: creating '/builddir/build/BUILD/readme_renderer-37.3/readme_renderer-37.3.dist-info'
HOOK STDOUT: adding license file "LICENSE" (matched pattern "LICENSE")
Handling bleach (>=2.1.0) from wheel metadata: Requires-Dist
Requirement satisfied: bleach (>=2.1.0)
   (installed: bleach 6.0.0)
Handling docutils (>=0.13.1) from wheel metadata: Requires-Dist
Requirement satisfied: docutils (>=0.13.1)
   (installed: docutils 0.17.1)
Handling Pygments (>=2.5.1) from wheel metadata: Requires-Dist
Requirement satisfied: Pygments (>=2.5.1)
   (installed: Pygments 2.16.1)
Handling cmarkgfm (>=0.8.0) ; extra == 'md' from wheel metadata: Requires-Dist
Requirement satisfied: cmarkgfm (>=0.8.0) ; extra == 'md'
   (installed: cmarkgfm 2022.10.27)
+ RPM_EC=0
++ jobs -p
+ exit 0
Executing(%build): /bin/sh -e /var/tmp/rpm-tmp.8vBfsp
+ umask 022
+ cd /builddir/build/BUILD
+ CFLAGS='-O2 -flto=auto -ffat-lto-objects -fexceptions -g -grecord-gcc-switches -pipe -Wall -Werror=format-security -Wp,-D_FORTIFY_SOURCE=2 -Wp,-D_GLIBCXX_ASSERTIONS -specs=/usr/lib/rpm/OpenCloudOS/OpenCloudOS-hardened-cc1 -fstack-protector-strong  -m64 -march=x86-64-v2 -mtune=generic -fasynchronous-unwind-tables -fstack-clash-protection -fcf-protection'
+ export CFLAGS
+ CXXFLAGS='-O2 -flto=auto -ffat-lto-objects -fexceptions -g -grecord-gcc-switches -pipe -Wall -Werror=format-security -Wp,-D_FORTIFY_SOURCE=2 -Wp,-D_GLIBCXX_ASSERTIONS -specs=/usr/lib/rpm/OpenCloudOS/OpenCloudOS-hardened-cc1 -fstack-protector-strong  -m64 -march=x86-64-v2 -mtune=generic -fasynchronous-unwind-tables -fstack-clash-protection -fcf-protection'
+ export CXXFLAGS
+ FFLAGS='-O2 -flto=auto -ffat-lto-objects -fexceptions -g -grecord-gcc-switches -pipe -Wall -Werror=format-security -Wp,-D_FORTIFY_SOURCE=2 -Wp,-D_GLIBCXX_ASSERTIONS -specs=/usr/lib/rpm/OpenCloudOS/OpenCloudOS-hardened-cc1 -fstack-protector-strong  -m64 -march=x86-64-v2 -mtune=generic -fasynchronous-unwind-tables -fstack-clash-protection -fcf-protection -I/usr/lib/gfortran/modules'
+ export FFLAGS
+ FCFLAGS='-O2 -flto=auto -ffat-lto-objects -fexceptions -g -grecord-gcc-switches -pipe -Wall -Werror=format-security -Wp,-D_FORTIFY_SOURCE=2 -Wp,-D_GLIBCXX_ASSERTIONS -specs=/usr/lib/rpm/OpenCloudOS/OpenCloudOS-hardened-cc1 -fstack-protector-strong  -m64 -march=x86-64-v2 -mtune=generic -fasynchronous-unwind-tables -fstack-clash-protection -fcf-protection -I/usr/lib/gfortran/modules'
+ export FCFLAGS
+ LDFLAGS='-Wl,-z,relro -Wl,--as-needed  -Wl,-z,now -specs=/usr/lib/rpm/OpenCloudOS/OpenCloudOS-hardened-ld  -Wl,--build-id=sha1'
+ export LDFLAGS
+ LT_SYS_LIBRARY_PATH=/usr/lib:
+ export LT_SYS_LIBRARY_PATH
+ CC=gcc
+ export CC
+ CXX=g++
+ export CXX
+ cd readme_renderer-37.3
+ mkdir -p /builddir/build/BUILD/readme_renderer-37.3/.pyproject-builddir
+ CFLAGS='-O2 -flto=auto -ffat-lto-objects -fexceptions -g -grecord-gcc-switches -pipe -Wall -Werror=format-security -Wp,-D_FORTIFY_SOURCE=2 -Wp,-D_GLIBCXX_ASSERTIONS -specs=/usr/lib/rpm/OpenCloudOS/OpenCloudOS-hardened-cc1 -fstack-protector-strong  -m64 -march=x86-64-v2 -mtune=generic -fasynchronous-unwind-tables -fstack-clash-protection -fcf-protection'
+ LDFLAGS='-Wl,-z,relro -Wl,--as-needed  -Wl,-z,now -specs=/usr/lib/rpm/OpenCloudOS/OpenCloudOS-hardened-ld  -Wl,--build-id=sha1'
+ TMPDIR=/builddir/build/BUILD/readme_renderer-37.3/.pyproject-builddir
+ /usr/bin/python3 -m pip wheel --wheel-dir /builddir/build/BUILD/readme_renderer-37.3/pyproject-wheeldir --no-deps --use-pep517 --no-build-isolation --disable-pip-version-check --no-clean --progress-bar off --verbose .
Processing /builddir/build/BUILD/readme_renderer-37.3
  Preparing metadata (pyproject.toml): started
  Running command Preparing metadata (pyproject.toml)
  running dist_info
  creating /builddir/build/BUILD/readme_renderer-37.3/.pyproject-builddir/pip-modern-metadata-0tzz9azl/readme_renderer.egg-info
  writing /builddir/build/BUILD/readme_renderer-37.3/.pyproject-builddir/pip-modern-metadata-0tzz9azl/readme_renderer.egg-info/PKG-INFO
  writing dependency_links to /builddir/build/BUILD/readme_renderer-37.3/.pyproject-builddir/pip-modern-metadata-0tzz9azl/readme_renderer.egg-info/dependency_links.txt
  writing requirements to /builddir/build/BUILD/readme_renderer-37.3/.pyproject-builddir/pip-modern-metadata-0tzz9azl/readme_renderer.egg-info/requires.txt
  writing top-level names to /builddir/build/BUILD/readme_renderer-37.3/.pyproject-builddir/pip-modern-metadata-0tzz9azl/readme_renderer.egg-info/top_level.txt
  writing manifest file '/builddir/build/BUILD/readme_renderer-37.3/.pyproject-builddir/pip-modern-metadata-0tzz9azl/readme_renderer.egg-info/SOURCES.txt'
  reading manifest file '/builddir/build/BUILD/readme_renderer-37.3/.pyproject-builddir/pip-modern-metadata-0tzz9azl/readme_renderer.egg-info/SOURCES.txt'
  reading manifest template 'MANIFEST.in'
  adding license file 'LICENSE'
  writing manifest file '/builddir/build/BUILD/readme_renderer-37.3/.pyproject-builddir/pip-modern-metadata-0tzz9azl/readme_renderer.egg-info/SOURCES.txt'
  creating '/builddir/build/BUILD/readme_renderer-37.3/.pyproject-builddir/pip-modern-metadata-0tzz9azl/readme_renderer-37.3.dist-info'
  adding license file "LICENSE" (matched pattern "LICENSE")
  Preparing metadata (pyproject.toml): finished with status 'done'
Building wheels for collected packages: readme-renderer
  Building wheel for readme-renderer (pyproject.toml): started
  Running command Building wheel for readme-renderer (pyproject.toml)
  running bdist_wheel
  running build
  running build_py
  creating build
  creating build/lib
  creating build/lib/readme_renderer
  copying readme_renderer/txt.py -> build/lib/readme_renderer
  copying readme_renderer/__main__.py -> build/lib/readme_renderer
  copying readme_renderer/markdown.py -> build/lib/readme_renderer
  copying readme_renderer/rst.py -> build/lib/readme_renderer
  copying readme_renderer/clean.py -> build/lib/readme_renderer
  copying readme_renderer/__init__.py -> build/lib/readme_renderer
  copying readme_renderer/__about__.py -> build/lib/readme_renderer
  running egg_info
  writing readme_renderer.egg-info/PKG-INFO
  writing dependency_links to readme_renderer.egg-info/dependency_links.txt
  writing requirements to readme_renderer.egg-info/requires.txt
  writing top-level names to readme_renderer.egg-info/top_level.txt
  reading manifest file 'readme_renderer.egg-info/SOURCES.txt'
  reading manifest template 'MANIFEST.in'
  adding license file 'LICENSE'
  writing manifest file 'readme_renderer.egg-info/SOURCES.txt'
  copying readme_renderer/py.typed -> build/lib/readme_renderer
  installing to build/bdist.linux-x86_64/wheel
  running install
  running install_lib
  creating build/bdist.linux-x86_64
  creating build/bdist.linux-x86_64/wheel
  creating build/bdist.linux-x86_64/wheel/readme_renderer
  copying build/lib/readme_renderer/txt.py -> build/bdist.linux-x86_64/wheel/readme_renderer
  copying build/lib/readme_renderer/__main__.py -> build/bdist.linux-x86_64/wheel/readme_renderer
  copying build/lib/readme_renderer/markdown.py -> build/bdist.linux-x86_64/wheel/readme_renderer
  copying build/lib/readme_renderer/rst.py -> build/bdist.linux-x86_64/wheel/readme_renderer
  copying build/lib/readme_renderer/clean.py -> build/bdist.linux-x86_64/wheel/readme_renderer
  copying build/lib/readme_renderer/__init__.py -> build/bdist.linux-x86_64/wheel/readme_renderer
  copying build/lib/readme_renderer/py.typed -> build/bdist.linux-x86_64/wheel/readme_renderer
  copying build/lib/readme_renderer/__about__.py -> build/bdist.linux-x86_64/wheel/readme_renderer
  running install_egg_info
  Copying readme_renderer.egg-info to build/bdist.linux-x86_64/wheel/readme_renderer-37.3-py3.11.egg-info
  running install_scripts
  adding license file "LICENSE" (matched pattern "LICENSE")
  creating build/bdist.linux-x86_64/wheel/readme_renderer-37.3.dist-info/WHEEL
  creating '/builddir/build/BUILD/readme_renderer-37.3/.pyproject-builddir/pip-wheel-mtbb56zp/tmpiutl4c4y/readme_renderer-37.3-py3-none-any.whl' and adding 'build/bdist.linux-x86_64/wheel' to it
  adding 'readme_renderer/__about__.py'
  adding 'readme_renderer/__init__.py'
  adding 'readme_renderer/__main__.py'
  adding 'readme_renderer/clean.py'
  adding 'readme_renderer/markdown.py'
  adding 'readme_renderer/py.typed'
  adding 'readme_renderer/rst.py'
  adding 'readme_renderer/txt.py'
  adding 'readme_renderer-37.3.dist-info/LICENSE'
  adding 'readme_renderer-37.3.dist-info/METADATA'
  adding 'readme_renderer-37.3.dist-info/WHEEL'
  adding 'readme_renderer-37.3.dist-info/top_level.txt'
  adding 'readme_renderer-37.3.dist-info/RECORD'
  removing build/bdist.linux-x86_64/wheel
  Building wheel for readme-renderer (pyproject.toml): finished with status 'done'
  Created wheel for readme-renderer: filename=readme_renderer-37.3-py3-none-any.whl size=14056 sha256=d2eade62709dd7a119d419ac9d15eac6d5700e10ce95a671bd523b66e8e67fb8
  Stored in directory: /builddir/.cache/pip/wheels/5c/66/3e/ba1c4baa1cc290c8039ab58e74f58c7dd38a7c414cedd93674
Successfully built readme-renderer
+ RPM_EC=0
++ jobs -p
+ exit 0
Executing(%install): /bin/sh -e /var/tmp/rpm-tmp.gunAEC
+ umask 022
+ cd /builddir/build/BUILD
+ '[' /builddir/build/BUILDROOT/python-readme-renderer-37.3-3.ocs23.noarch '!=' / ']'
+ rm -rf /builddir/build/BUILDROOT/python-readme-renderer-37.3-3.ocs23.noarch
++ dirname /builddir/build/BUILDROOT/python-readme-renderer-37.3-3.ocs23.noarch
+ mkdir -p /builddir/build/BUILDROOT
+ mkdir /builddir/build/BUILDROOT/python-readme-renderer-37.3-3.ocs23.noarch
+ cd readme_renderer-37.3
++ ls /builddir/build/BUILD/readme_renderer-37.3/pyproject-wheeldir/readme_renderer-37.3-py3-none-any.whl
++ xargs basename --multiple
++ sed -E 's/([^-]+)-([^-]+)-.+\.whl/\1==\2/'
+ specifier=readme_renderer==37.3
+ TMPDIR=/builddir/build/BUILD/readme_renderer-37.3/.pyproject-builddir
+ /usr/bin/python3 -m pip install --root /builddir/build/BUILDROOT/python-readme-renderer-37.3-3.ocs23.noarch --no-deps --disable-pip-version-check --progress-bar off --verbose --ignore-installed --no-warn-script-location --no-index --no-cache-dir --find-links /builddir/build/BUILD/readme_renderer-37.3/pyproject-wheeldir readme_renderer==37.3
Using pip 22.3.1 from /usr/lib/python3.11/site-packages/pip (python 3.11)
Looking in links: /builddir/build/BUILD/readme_renderer-37.3/pyproject-wheeldir
Processing ./pyproject-wheeldir/readme_renderer-37.3-py3-none-any.whl
Installing collected packages: readme_renderer
Successfully installed readme_renderer-37.3
+ '[' -d /builddir/build/BUILDROOT/python-readme-renderer-37.3-3.ocs23.noarch/usr/bin ']'
+ rm -f /builddir/build/BUILD/pyproject-ghost-distinfo
+ site_dirs=()
+ '[' -d /builddir/build/BUILDROOT/python-readme-renderer-37.3-3.ocs23.noarch/usr/lib/python3.11/site-packages ']'
+ site_dirs+=("/usr/lib/python3.11/site-packages")
+ '[' /builddir/build/BUILDROOT/python-readme-renderer-37.3-3.ocs23.noarch/usr/lib64/python3.11/site-packages '!=' /builddir/build/BUILDROOT/python-readme-renderer-37.3-3.ocs23.noarch/usr/lib/python3.11/site-packages ']'
+ '[' -d /builddir/build/BUILDROOT/python-readme-renderer-37.3-3.ocs23.noarch/usr/lib64/python3.11/site-packages ']'
+ for site_dir in ${site_dirs[@]}
+ for distinfo in /builddir/build/BUILDROOT/python-readme-renderer-37.3-3.ocs23.noarch$site_dir/*.dist-info
+ echo '%ghost /usr/lib/python3.11/site-packages/readme_renderer-37.3.dist-info'
+ sed -i s/pip/rpm/ /builddir/build/BUILDROOT/python-readme-renderer-37.3-3.ocs23.noarch/usr/lib/python3.11/site-packages/readme_renderer-37.3.dist-info/INSTALLER
+ PYTHONPATH=/usr/lib/rpm/OpenCloudOS
+ /usr/bin/python3 -B /usr/lib/rpm/OpenCloudOS/pyproject_preprocess_record.py --buildroot /builddir/build/BUILDROOT/python-readme-renderer-37.3-3.ocs23.noarch --record /builddir/build/BUILDROOT/python-readme-renderer-37.3-3.ocs23.noarch/usr/lib/python3.11/site-packages/readme_renderer-37.3.dist-info/RECORD --output /builddir/build/BUILD/pyproject-record
+ rm -fv /builddir/build/BUILDROOT/python-readme-renderer-37.3-3.ocs23.noarch/usr/lib/python3.11/site-packages/readme_renderer-37.3.dist-info/RECORD
removed '/builddir/build/BUILDROOT/python-readme-renderer-37.3-3.ocs23.noarch/usr/lib/python3.11/site-packages/readme_renderer-37.3.dist-info/RECORD'
+ rm -fv /builddir/build/BUILDROOT/python-readme-renderer-37.3-3.ocs23.noarch/usr/lib/python3.11/site-packages/readme_renderer-37.3.dist-info/REQUESTED
removed '/builddir/build/BUILDROOT/python-readme-renderer-37.3-3.ocs23.noarch/usr/lib/python3.11/site-packages/readme_renderer-37.3.dist-info/REQUESTED'
++ wc -l /builddir/build/BUILD/pyproject-ghost-distinfo
++ cut -f1 '-d '
+ lines=1
+ '[' 1 -ne 1 ']'
+ /usr/bin/python3 /usr/lib/rpm/OpenCloudOS/pyproject_save_files.py --output-files /builddir/build/BUILD/pyproject-files --output-modules /builddir/build/BUILD/pyproject-modules --buildroot /builddir/build/BUILDROOT/python-readme-renderer-37.3-3.ocs23.noarch --sitelib /usr/lib/python3.11/site-packages --sitearch /usr/lib64/python3.11/site-packages --python-version 3.11 --pyproject-record /builddir/build/BUILD/pyproject-record --prefix /usr readme_renderer
+ /usr/bin/find-debuginfo -j32 --strict-build-id -m -i --build-id-seed 37.3-3.ocs23 --unique-debug-suffix -37.3-3.ocs23.noarch --unique-debug-src-base python-readme-renderer-37.3-3.ocs23.noarch -S debugsourcefiles.list /builddir/build/BUILD/readme_renderer-37.3
find: 'debug': No such file or directory
+ /usr/lib/rpm/check-buildroot
+ /usr/lib/rpm/OpenCloudOS/brp-ldconfig
+ /usr/lib/rpm/brp-compress
+ /usr/lib/rpm/OpenCloudOS/brp-strip-lto /usr/bin/strip
+ /usr/lib/rpm/brp-strip-static-archive /usr/bin/strip
+ /usr/lib/rpm/check-rpaths
+ /usr/lib/rpm/OpenCloudOS/brp-mangle-shebangs
+ /usr/lib/rpm/OpenCloudOS/brp-python-bytecompile '' 1 0
Bytecompiling .py files below /builddir/build/BUILDROOT/python-readme-renderer-37.3-3.ocs23.noarch/usr/lib/python3.11 using python3.11
+ /usr/lib/rpm/OpenCloudOS/brp-python-hardlink
Executing(%check): /bin/sh -e /var/tmp/rpm-tmp.H6UJC5
+ umask 022
+ cd /builddir/build/BUILD
+ CFLAGS='-O2 -flto=auto -ffat-lto-objects -fexceptions -g -grecord-gcc-switches -pipe -Wall -Werror=format-security -Wp,-D_FORTIFY_SOURCE=2 -Wp,-D_GLIBCXX_ASSERTIONS -specs=/usr/lib/rpm/OpenCloudOS/OpenCloudOS-hardened-cc1 -fstack-protector-strong  -m64 -march=x86-64-v2 -mtune=generic -fasynchronous-unwind-tables -fstack-clash-protection -fcf-protection'
+ export CFLAGS
+ CXXFLAGS='-O2 -flto=auto -ffat-lto-objects -fexceptions -g -grecord-gcc-switches -pipe -Wall -Werror=format-security -Wp,-D_FORTIFY_SOURCE=2 -Wp,-D_GLIBCXX_ASSERTIONS -specs=/usr/lib/rpm/OpenCloudOS/OpenCloudOS-hardened-cc1 -fstack-protector-strong  -m64 -march=x86-64-v2 -mtune=generic -fasynchronous-unwind-tables -fstack-clash-protection -fcf-protection'
+ export CXXFLAGS
+ FFLAGS='-O2 -flto=auto -ffat-lto-objects -fexceptions -g -grecord-gcc-switches -pipe -Wall -Werror=format-security -Wp,-D_FORTIFY_SOURCE=2 -Wp,-D_GLIBCXX_ASSERTIONS -specs=/usr/lib/rpm/OpenCloudOS/OpenCloudOS-hardened-cc1 -fstack-protector-strong  -m64 -march=x86-64-v2 -mtune=generic -fasynchronous-unwind-tables -fstack-clash-protection -fcf-protection -I/usr/lib/gfortran/modules'
+ export FFLAGS
+ FCFLAGS='-O2 -flto=auto -ffat-lto-objects -fexceptions -g -grecord-gcc-switches -pipe -Wall -Werror=format-security -Wp,-D_FORTIFY_SOURCE=2 -Wp,-D_GLIBCXX_ASSERTIONS -specs=/usr/lib/rpm/OpenCloudOS/OpenCloudOS-hardened-cc1 -fstack-protector-strong  -m64 -march=x86-64-v2 -mtune=generic -fasynchronous-unwind-tables -fstack-clash-protection -fcf-protection -I/usr/lib/gfortran/modules'
+ export FCFLAGS
+ LDFLAGS='-Wl,-z,relro -Wl,--as-needed  -Wl,-z,now -specs=/usr/lib/rpm/OpenCloudOS/OpenCloudOS-hardened-ld  -Wl,--build-id=sha1'
+ export LDFLAGS
+ LT_SYS_LIBRARY_PATH=/usr/lib:
+ export LT_SYS_LIBRARY_PATH
+ CC=gcc
+ export CC
+ CXX=g++
+ export CXX
+ cd readme_renderer-37.3
+ CFLAGS='-O2 -flto=auto -ffat-lto-objects -fexceptions -g -grecord-gcc-switches -pipe -Wall -Werror=format-security -Wp,-D_FORTIFY_SOURCE=2 -Wp,-D_GLIBCXX_ASSERTIONS -specs=/usr/lib/rpm/OpenCloudOS/OpenCloudOS-hardened-cc1 -fstack-protector-strong  -m64 -march=x86-64-v2 -mtune=generic -fasynchronous-unwind-tables -fstack-clash-protection -fcf-protection'
+ LDFLAGS='-Wl,-z,relro -Wl,--as-needed  -Wl,-z,now -specs=/usr/lib/rpm/OpenCloudOS/OpenCloudOS-hardened-ld  -Wl,--build-id=sha1'
+ PATH=/builddir/build/BUILDROOT/python-readme-renderer-37.3-3.ocs23.noarch/usr/bin:/usr/bin:/bin:/usr/sbin:/sbin:/usr/local/sbin
+ PYTHONPATH=/builddir/build/BUILDROOT/python-readme-renderer-37.3-3.ocs23.noarch/usr/lib64/python3.11/site-packages:/builddir/build/BUILDROOT/python-readme-renderer-37.3-3.ocs23.noarch/usr/lib/python3.11/site-packages
+ PYTHONDONTWRITEBYTECODE=1
+ PYTEST_ADDOPTS=' --ignore=/builddir/build/BUILD/readme_renderer-37.3/.pyproject-builddir'
+ /usr/bin/pytest -v tests -k 'not test_rst_fixtures'
============================= test session starts ==============================
platform linux -- Python 3.11.4, pytest-7.1.3, pluggy-1.0.0 -- /usr/bin/python3
cachedir: .pytest_cache
rootdir: /builddir/build/BUILD/readme_renderer-37.3
plugins: cov-4.0.0
collecting ... collected 73 items / 19 deselected / 54 selected
tests/test_clean.py::test_invalid_link PASSED                            [  1%]
tests/test_markdown.py::test_md_fixtures[test_GFM_style.md] PASSED       [  3%]
tests/test_markdown.py::test_md_fixtures[test_GFM_023.md] PASSED         [  5%]
tests/test_markdown.py::test_md_fixtures[test_GFM_doublequotes.md] FAILED [  7%]
tests/test_markdown.py::test_md_fixtures[test_GFM_024.md] PASSED         [  9%]
tests/test_markdown.py::test_md_fixtures[test_GFM_005.md] PASSED         [ 11%]
tests/test_markdown.py::test_md_fixtures[test_GFM_025.md] PASSED         [ 12%]
tests/test_markdown.py::test_md_fixtures[test_GFM_003.md] PASSED         [ 14%]
tests/test_markdown.py::test_md_fixtures[test_GFM_022.md] PASSED         [ 16%]
tests/test_markdown.py::test_md_fixtures[test_GFM_malicious_pre.md] FAILED [ 18%]
tests/test_markdown.py::test_md_fixtures[test_GFM_006.md] PASSED         [ 20%]
tests/test_markdown.py::test_md_fixtures[test_GFM_014.md] PASSED         [ 22%]
tests/test_markdown.py::test_md_fixtures[test_GFM_img.md] PASSED         [ 24%]
tests/test_markdown.py::test_md_fixtures[test_GFM_011.md] PASSED         [ 25%]
tests/test_markdown.py::test_md_fixtures[test_GFM_009.md] PASSED         [ 27%]
tests/test_markdown.py::test_md_fixtures[test_GFM_highlight_default_py.md] PASSED [ 29%]
tests/test_markdown.py::test_md_fixtures[test_GFM_007.md] PASSED         [ 31%]
tests/test_markdown.py::test_md_fixtures[test_GFM_019.md] PASSED         [ 33%]
tests/test_markdown.py::test_md_fixtures[test_GFM_016.md] PASSED         [ 35%]
tests/test_markdown.py::test_md_fixtures[test_GFM_highlight.md] FAILED   [ 37%]
tests/test_markdown.py::test_md_fixtures[test_GFM_010.md] PASSED         [ 38%]
tests/test_markdown.py::test_md_fixtures[test_GFM_013.md] PASSED         [ 40%]
tests/test_markdown.py::test_md_fixtures[test_GFM_008.md] PASSED         [ 42%]
tests/test_markdown.py::test_md_fixtures[test_GFM_004.md] PASSED         [ 44%]
tests/test_markdown.py::test_md_fixtures[test_GFM_002.md] PASSED         [ 46%]
tests/test_markdown.py::test_md_fixtures[test_GFM_012.md] PASSED         [ 48%]
tests/test_markdown.py::test_md_fixtures[test_GFM_015.md] PASSED         [ 50%]
tests/test_markdown.py::test_md_fixtures[test_GFM_001.md] PASSED         [ 51%]
tests/test_markdown.py::test_md_fixtures[test_GFM_017.md] PASSED         [ 53%]
tests/test_markdown.py::test_md_fixtures[test_GFM_018.md] PASSED         [ 55%]
tests/test_markdown.py::test_md_fixtures[test_GFM_020.md] PASSED         [ 57%]
tests/test_markdown.py::test_md_fixtures[test_GFM_021.md] PASSED         [ 59%]
tests/test_markdown.py::test_md_fixtures[test_CommonMark_001.md] PASSED  [ 61%]
tests/test_markdown.py::test_md_fixtures[test_CommonMark_006.md] PASSED  [ 62%]
tests/test_markdown.py::test_md_fixtures[test_CommonMark_008.md] FAILED  [ 64%]
tests/test_markdown.py::test_md_fixtures[test_CommonMark_strong.md] PASSED [ 66%]
tests/test_markdown.py::test_md_fixtures[test_CommonMark_003.md] PASSED  [ 68%]
tests/test_markdown.py::test_md_fixtures[test_CommonMark_009.md] PASSED  [ 70%]
tests/test_markdown.py::test_md_fixtures[test_CommonMark_smart_strong.md] PASSED [ 72%]
tests/test_markdown.py::test_md_fixtures[test_CommonMark_005.md] PASSED  [ 74%]
tests/test_markdown.py::test_md_fixtures[test_CommonMark_007.md] PASSED  [ 75%]
tests/test_markdown.py::test_md_fixtures[test_CommonMark_004.md] PASSED  [ 77%]
tests/test_markdown.py::test_md_fixtures[test_CommonMark_002.md] PASSED  [ 79%]
tests/test_markdown.py::test_md_fixtures[test_CommonMark_style.md] PASSED [ 81%]
tests/test_markdown.py::test_missing_variant PASSED                      [ 83%]
tests/test_noextra.py::test_no_extra[GFM] SKIPPED (Extra is installed)   [ 85%]
tests/test_noextra.py::test_no_extra[CommonMark] SKIPPED (Extra is i...) [ 87%]
tests/test_rst.py::test_rst_001 PASSED                                   [ 88%]
tests/test_rst.py::test_rst_002 PASSED                                   [ 90%]
tests/test_rst.py::test_rst_raw PASSED                                   [ 92%]
tests/test_rst.py::test_rst_empty_file PASSED                            [ 94%]
tests/test_rst.py::test_rst_header_only PASSED                           [ 96%]
tests/test_rst.py::test_header_and_malformed_emits_docutils_warning_only PASSED [ 98%]
tests/test_txt.py::test_txt_fixtures[test_txt_001.txt] PASSED            [100%]
=================================== FAILURES ===================================
__________________ test_md_fixtures[test_GFM_doublequotes.md] __________________
md_filename = PosixPath('/builddir/build/BUILD/readme_renderer-37.3/tests/fixtures/test_GFM_doublequotes.md')
html_filename = PosixPath('/builddir/build/BUILD/readme_renderer-37.3/tests/fixtures/test_GFM_doublequotes.html')
variant = 'GFM'
    @pytest.mark.parametrize(
        ("md_filename", "html_filename", "variant"),
        [
            (pytest.param(fn, fn.with_suffix(".html"), variant, id=fn.name))
            for variant in variants
            for fn in Path(__file__).parent.glob(f"fixtures/test_{variant}*.md")
        ],
    )
    def test_md_fixtures(md_filename, html_filename, variant):
        # Get our Markup
        with open(md_filename, encoding='utf-8') as f:
            md_markup = f.read()
    
        # Get our expected
        with open(html_filename, encoding="utf-8") as f:
            expected = f.read()
    
>       assert render(md_markup, variant=variant) == expected
E       assert '<p>This is n...an>\n</pre>\n' == '<p>This is n...an>\n</pre>\n'
E           <p>This is normal text.</p>
E           <pre><code>This is code text.
E           </code></pre>
E           <pre lang="python3"><span class="k">def</span> <span class="nf">this_is_python</span><span class="p">():</span>
E         -     <span class="sd">&quot;&quot;&quot;This is a docstring.&quot;&quot;&quot;</span>
E         ? ----
E         + <span class="w">    </span><span class="sd">&quot;&quot;&quot;This is a docstring.&quot;&quot;&quot;</span>...
E         
E         ...Full output truncated (14 lines hidden), use '-vv' to show
tests/test_markdown.py:25: AssertionError
_________________ test_md_fixtures[test_GFM_malicious_pre.md] __________________
md_filename = PosixPath('/builddir/build/BUILD/readme_renderer-37.3/tests/fixtures/test_GFM_malicious_pre.md')
html_filename = PosixPath('/builddir/build/BUILD/readme_renderer-37.3/tests/fixtures/test_GFM_malicious_pre.html')
variant = 'GFM'
    @pytest.mark.parametrize(
        ("md_filename", "html_filename", "variant"),
        [
            (pytest.param(fn, fn.with_suffix(".html"), variant, id=fn.name))
            for variant in variants
            for fn in Path(__file__).parent.glob(f"fixtures/test_{variant}*.md")
        ],
    )
    def test_md_fixtures(md_filename, html_filename, variant):
        # Get our Markup
        with open(md_filename, encoding='utf-8') as f:
            md_markup = f.read()
    
        # Get our expected
        with open(html_filename, encoding="utf-8") as f:
            expected = f.read()
    
>       assert render(md_markup, variant=variant) == expected
E       assert '<p>This is n...an>\n</pre>\n' == '<p>This is n...an>\n</pre>\n'
E           <p>This is normal text.</p>
E           <pre lang="python3"><span class="k">def</span> <span class="nf">this_is_python</span><span class="p">():</span>
E         -     <span class="sd">&quot;&quot;&quot;This is a docstring.&quot;&quot;&quot;</span>
E         ? ----
E         + <span class="w">    </span><span class="sd">&quot;&quot;&quot;This is a docstring.&quot;&quot;&quot;</span>
E         ?      +++++++++++++++++++++++++++
E               <span class="k">pass</span>...
E         
E         ...Full output truncated (3 lines hidden), use '-vv' to show
tests/test_markdown.py:25: AssertionError
___________________ test_md_fixtures[test_GFM_highlight.md] ____________________
md_filename = PosixPath('/builddir/build/BUILD/readme_renderer-37.3/tests/fixtures/test_GFM_highlight.md')
html_filename = PosixPath('/builddir/build/BUILD/readme_renderer-37.3/tests/fixtures/test_GFM_highlight.html')
variant = 'GFM'
    @pytest.mark.parametrize(
        ("md_filename", "html_filename", "variant"),
        [
            (pytest.param(fn, fn.with_suffix(".html"), variant, id=fn.name))
            for variant in variants
            for fn in Path(__file__).parent.glob(f"fixtures/test_{variant}*.md")
        ],
    )
    def test_md_fixtures(md_filename, html_filename, variant):
        # Get our Markup
        with open(md_filename, encoding='utf-8') as f:
            md_markup = f.read()
    
        # Get our expected
        with open(html_filename, encoding="utf-8") as f:
            expected = f.read()
    
>       assert render(md_markup, variant=variant) == expected
E       assert '<p>This is n...ock\n</pre>\n' == '<p>This is n...ock\n</pre>\n'
E           <p>This is normal text.</p>
E           <pre><code>This is code text.
E           </code></pre>
E           <pre lang="python3"><span class="k">def</span> <span class="nf">this_is_python</span><span class="p">():</span>
E               <span class="k">pass</span>
E           </pre>
E         - <pre lang="go"><span class="kd">func</span><span class="w"> </span><span class="nx">ThisIsGo</span><span class="p">(){</span><span class="w"></span>...
E         
E         ...Full output truncated (12 lines hidden), use '-vv' to show
tests/test_markdown.py:25: AssertionError
___________________ test_md_fixtures[test_CommonMark_008.md] ___________________
md_filename = PosixPath('/builddir/build/BUILD/readme_renderer-37.3/tests/fixtures/test_CommonMark_008.md')
html_filename = PosixPath('/builddir/build/BUILD/readme_renderer-37.3/tests/fixtures/test_CommonMark_008.html')
variant = 'CommonMark'
    @pytest.mark.parametrize(
        ("md_filename", "html_filename", "variant"),
        [
            (pytest.param(fn, fn.with_suffix(".html"), variant, id=fn.name))
            for variant in variants
            for fn in Path(__file__).parent.glob(f"fixtures/test_{variant}*.md")
        ],
    )
    def test_md_fixtures(md_filename, html_filename, variant):
        # Get our Markup
        with open(md_filename, encoding='utf-8') as f:
            md_markup = f.read()
    
        # Get our expected
        with open(html_filename, encoding="utf-8") as f:
            expected = f.read()
    
>       assert render(md_markup, variant=variant) == expected
E       assert '<p>Here is s...key</a></p>\n' == '<p>Here is s...key</a></p>\n'
E           <p>Here is some Python code for a <code>Dog</code>:</p>
E           <pre lang="python3"><span class="k">class</span> <span class="nc">Dog</span><span class="p">(</span><span class="n">Animal</span><span class="p">):</span>
E               <span class="k">def</span> <span class="fm">__init__</span><span class="p">(</span><span class="bp">self</span><span class="p">,</span> <span class="n">name</span><span class="p">):</span>
E                   <span class="bp">self</span><span class="o">.</span><span class="n">name</span> <span class="o">=</span> <span class="n">name</span>
E           
E               <span class="k">def...
E         
E         ...Full output truncated (13 lines hidden), use '-vv' to show
tests/test_markdown.py:25: AssertionError
=========================== short test summary info ============================
FAILED tests/test_markdown.py::test_md_fixtures[test_GFM_doublequotes.md] - a...
FAILED tests/test_markdown.py::test_md_fixtures[test_GFM_malicious_pre.md] - ...
FAILED tests/test_markdown.py::test_md_fixtures[test_GFM_highlight.md] - asse...
FAILED tests/test_markdown.py::test_md_fixtures[test_CommonMark_008.md] - ass...
============ 4 failed, 48 passed, 2 skipped, 19 deselected in 0.36s ============
error: Bad exit status from /var/tmp/rpm-tmp.H6UJC5 (%check)
    Bad exit status from /var/tmp/rpm-tmp.H6UJC5 (%check)
RPM build errors:
Child return code was: 1
EXCEPTION: [Error('Command failed: \n # bash --login -c /usr/bin/rpmbuild -ba --noprep --noclean --target noarch --nodeps /builddir/build/SPECS/python-readme-renderer.spec\n', 1)]
Traceback (most recent call last):
  File "/usr/lib/python3.10/site-packages/mockbuild/trace_decorator.py", line 93, in trace
    result = func(*args, **kw)
  File "/usr/lib/python3.10/site-packages/mockbuild/util.py", line 597, in do_with_status
    raise exception.Error("Command failed: \n # %s\n%s" % (command, output), child.returncode)
mockbuild.exception.Error: Command failed: 
 # bash --login -c /usr/bin/rpmbuild -ba --noprep --noclean --target noarch --nodeps /builddir/build/SPECS/python-readme-renderer.spec