Mock Version: 4.1
Mock Version: 4.1
Mock Version: 4.1
ENTER ['do_with_status'](['bash', '--login', '-c', '/usr/bin/rpmbuild -bs --noclean --target x86_64 --nodeps /builddir/build/SPECS/eth-tools.spec'], chrootPath='/var/lib/mock/dist-ocs23-build-212393-15360/root'env={'TERM': 'vt100', 'SHELL': '/bin/bash', 'HOME': '/builddir', 'HOSTNAME': 'mock', 'PATH': '/usr/bin:/bin:/usr/sbin:/sbin', 'PROMPT_COMMAND': 'printf "\\033]0;<mock-chroot>\\007"', 'PS1': '<mock-chroot> \\s-\\v\\$ ', 'LANG': 'C.UTF-8'}shell=Falselogger=<mockbuild.trace_decorator.getLog object at 0x7fb7a0028f10>timeout=86400uid=981gid=135user='mockbuild'nspawn_args=[]unshare_net=TrueprintOutput=False)
Executing command: ['bash', '--login', '-c', '/usr/bin/rpmbuild -bs --noclean --target x86_64 --nodeps /builddir/build/SPECS/eth-tools.spec'] with env {'TERM': 'vt100', 'SHELL': '/bin/bash', 'HOME': '/builddir', 'HOSTNAME': 'mock', 'PATH': '/usr/bin:/bin:/usr/sbin:/sbin', 'PROMPT_COMMAND': 'printf "\\033]0;<mock-chroot>\\007"', 'PS1': '<mock-chroot> \\s-\\v\\$ ', 'LANG': 'C.UTF-8'} and shell False
Building target platforms: x86_64
Building for target x86_64
Wrote: /builddir/build/SRPMS/eth-tools-11.7.0.0-1.ocs23.src.rpm
Child return code was: 0
ENTER ['do_with_status'](['bash', '--login', '-c', '/usr/bin/rpmbuild -bb --noclean --target x86_64 --nodeps /builddir/build/SPECS/eth-tools.spec'], chrootPath='/var/lib/mock/dist-ocs23-build-212393-15360/root'env={'TERM': 'vt100', 'SHELL': '/bin/bash', 'HOME': '/builddir', 'HOSTNAME': 'mock', 'PATH': '/usr/bin:/bin:/usr/sbin:/sbin', 'PROMPT_COMMAND': 'printf "\\033]0;<mock-chroot>\\007"', 'PS1': '<mock-chroot> \\s-\\v\\$ ', 'LANG': 'C.UTF-8'}shell=Falselogger=<mockbuild.trace_decorator.getLog object at 0x7fb7a0028f10>timeout=86400uid=981gid=135user='mockbuild'nspawn_args=[]unshare_net=TrueprintOutput=False)
Executing command: ['bash', '--login', '-c', '/usr/bin/rpmbuild -bb --noclean --target x86_64 --nodeps /builddir/build/SPECS/eth-tools.spec'] with env {'TERM': 'vt100', 'SHELL': '/bin/bash', 'HOME': '/builddir', 'HOSTNAME': 'mock', 'PATH': '/usr/bin:/bin:/usr/sbin:/sbin', 'PROMPT_COMMAND': 'printf "\\033]0;<mock-chroot>\\007"', 'PS1': '<mock-chroot> \\s-\\v\\$ ', 'LANG': 'C.UTF-8'} and shell False
Building target platforms: x86_64
Building for target x86_64
Executing(%prep): /bin/sh -e /var/tmp/rpm-tmp.mVllsq
+ umask 022
+ cd /builddir/build/BUILD
+ cd /builddir/build/BUILD
+ rm -rf eth-fast-fabric-11.7.0.0
+ /usr/lib/rpm/rpmuncompress -x /builddir/build/SOURCES/eth-fast-fabric-11.7.0.0.tar.gz
+ STATUS=0
+ '[' 0 -ne 0 ']'
+ cd eth-fast-fabric-11.7.0.0
+ /usr/bin/chmod -Rf a+rX,u+w,g-w,o-w .
+ RPM_EC=0
++ jobs -p
+ exit 0
Executing(%build): /bin/sh -e /var/tmp/rpm-tmp.oYZT0b
+ umask 022
+ cd /builddir/build/BUILD
+ CFLAGS='-O2 -flto=auto -ffat-lto-objects -fexceptions -g -grecord-gcc-switches -pipe -Wall -Werror=format-security -Wp,-D_FORTIFY_SOURCE=2 -Wp,-D_GLIBCXX_ASSERTIONS -specs=/usr/lib/rpm/OpenCloudOS/OpenCloudOS-hardened-cc1 -fstack-protector-strong  -m64 -march=x86-64-v2 -mtune=generic -fasynchronous-unwind-tables -fstack-clash-protection -fcf-protection'
+ export CFLAGS
+ CXXFLAGS='-O2 -flto=auto -ffat-lto-objects -fexceptions -g -grecord-gcc-switches -pipe -Wall -Werror=format-security -Wp,-D_FORTIFY_SOURCE=2 -Wp,-D_GLIBCXX_ASSERTIONS -specs=/usr/lib/rpm/OpenCloudOS/OpenCloudOS-hardened-cc1 -fstack-protector-strong  -m64 -march=x86-64-v2 -mtune=generic -fasynchronous-unwind-tables -fstack-clash-protection -fcf-protection'
+ export CXXFLAGS
+ FFLAGS='-O2 -flto=auto -ffat-lto-objects -fexceptions -g -grecord-gcc-switches -pipe -Wall -Werror=format-security -Wp,-D_FORTIFY_SOURCE=2 -Wp,-D_GLIBCXX_ASSERTIONS -specs=/usr/lib/rpm/OpenCloudOS/OpenCloudOS-hardened-cc1 -fstack-protector-strong  -m64 -march=x86-64-v2 -mtune=generic -fasynchronous-unwind-tables -fstack-clash-protection -fcf-protection -I/usr/lib64/gfortran/modules'
+ export FFLAGS
+ FCFLAGS='-O2 -flto=auto -ffat-lto-objects -fexceptions -g -grecord-gcc-switches -pipe -Wall -Werror=format-security -Wp,-D_FORTIFY_SOURCE=2 -Wp,-D_GLIBCXX_ASSERTIONS -specs=/usr/lib/rpm/OpenCloudOS/OpenCloudOS-hardened-cc1 -fstack-protector-strong  -m64 -march=x86-64-v2 -mtune=generic -fasynchronous-unwind-tables -fstack-clash-protection -fcf-protection -I/usr/lib64/gfortran/modules'
+ export FCFLAGS
+ LDFLAGS='-Wl,-z,relro -Wl,--as-needed  -Wl,-z,now -specs=/usr/lib/rpm/OpenCloudOS/OpenCloudOS-hardened-ld  -Wl,--build-id=sha1'
+ export LDFLAGS
+ LT_SYS_LIBRARY_PATH=/usr/lib64:
+ export LT_SYS_LIBRARY_PATH
+ CC=gcc
+ export CC
+ CXX=g++
+ export CXX
+ cd eth-fast-fabric-11.7.0.0
+ cd OpenIb_Host
+ OPA_FEATURE_SET=
+ CLOCAL='-O2 -flto=auto -ffat-lto-objects -fexceptions -g -grecord-gcc-switches -pipe -Wall -Werror=format-security -Wp,-D_FORTIFY_SOURCE=2 -Wp,-D_GLIBCXX_ASSERTIONS -specs=/usr/lib/rpm/OpenCloudOS/OpenCloudOS-hardened-cc1 -fstack-protector-strong  -m64 -march=x86-64-v2 -mtune=generic -fasynchronous-unwind-tables -fstack-clash-protection -fcf-protection'
+ CCLOCAL='-O2 -flto=auto -ffat-lto-objects -fexceptions -g -grecord-gcc-switches -pipe -Wall -Werror=format-security -Wp,-D_FORTIFY_SOURCE=2 -Wp,-D_GLIBCXX_ASSERTIONS -specs=/usr/lib/rpm/OpenCloudOS/OpenCloudOS-hardened-cc1 -fstack-protector-strong  -m64 -march=x86-64-v2 -mtune=generic -fasynchronous-unwind-tables -fstack-clash-protection -fcf-protection'
+ LDLOCAL='-Wl,-z,relro -Wl,--as-needed  -Wl,-z,now -specs=/usr/lib/rpm/OpenCloudOS/OpenCloudOS-hardened-ld  -Wl,--build-id=sha1'
+ ./ff_build.sh /builddir/build/BUILD
Build target operating system set to LINUX
Build target set to X86_64 
Setting os version to opencloudos 6.6.6-2401.0.1.1.ocs23.x86_64 (26=0).
rm -f /builddir/build/BUILD/RELEASE_PATH /builddir/build/BUILD/LIB_PATH
echo "stage.OPENIB_FF.release.opa10/opencloudos/X86_64/IntelEth-Tools-FF.opencloudos.ES23-x86_64.11.7.0.0.111" > /builddir/build/BUILD/RELEASE_PATH
echo "../bin/X86_64/opencloudos.ES23/lib/release/" > /builddir/build/BUILD/LIB_PATH
+ tee build.res
+ echo Environment:
Environment:
+ env
SHELL=/bin/bash
RPM_SOURCE_DIR=/builddir/build/SOURCES
RELEASE_STRING=IntelEth-Tools-FF.opencloudos.ES23-x86_64.11.7.0.0.111
HISTCONTROL=ignoredups
PKG_CONFIG_PATH=:/usr/lib64/pkgconfig:/usr/share/pkgconfig
HISTSIZE=1000
HOSTNAME=builder1.x64.stream.opencloudos.tech
BUILD_PLATFORM_OS_VENDOR=opencloudos
BUILD_SKIP_ULPS=none
BUILD_TARGET_OS_VENDOR_VERSION=ES23
LDLOCAL=-Wl,-z,relro -Wl,--as-needed  -Wl,-z,now -specs=/usr/lib/rpm/OpenCloudOS/OpenCloudOS-hardened-ld  -Wl,--build-id=sha1
FFLAGS=-O2 -flto=auto -ffat-lto-objects -fexceptions -g -grecord-gcc-switches -pipe -Wall -Werror=format-security -Wp,-D_FORTIFY_SOURCE=2 -Wp,-D_GLIBCXX_ASSERTIONS -specs=/usr/lib/rpm/OpenCloudOS/OpenCloudOS-hardened-cc1 -fstack-protector-strong  -m64 -march=x86-64-v2 -mtune=generic -fasynchronous-unwind-tables -fstack-clash-protection -fcf-protection -I/usr/lib64/gfortran/modules
PWD=/builddir/build/BUILD/eth-fast-fabric-11.7.0.0/OpenIb_Host
LOGNAME=mockbuild
CXX=g++
CXXFLAGS=-O2 -flto=auto -ffat-lto-objects -fexceptions -g -grecord-gcc-switches -pipe -Wall -Werror=format-security -Wp,-D_FORTIFY_SOURCE=2 -Wp,-D_GLIBCXX_ASSERTIONS -specs=/usr/lib/rpm/OpenCloudOS/OpenCloudOS-hardened-cc1 -fstack-protector-strong  -m64 -march=x86-64-v2 -mtune=generic -fasynchronous-unwind-tables -fstack-clash-protection -fcf-protection
RPM_ARCH=x86_64
BUILD_TARGET_TOOLCHAIN=GNU
BUILD_TARGET_OS_VENDOR=opencloudos
LDFLAGS=-Wl,-z,relro -Wl,--as-needed  -Wl,-z,now -specs=/usr/lib/rpm/OpenCloudOS/OpenCloudOS-hardened-ld  -Wl,--build-id=sha1
HOME=/builddir
BUILD_PLATFORM=LINUX
LANG=C
BUILD_TARGET_OS_ID=opencloudos.ES23-x86_64
RPM_LD_FLAGS=-Wl,-z,relro -Wl,--as-needed  -Wl,-z,now -specs=/usr/lib/rpm/OpenCloudOS/OpenCloudOS-hardened-ld  -Wl,--build-id=sha1
WRS_BIN=/builddir/build/BUILD/eth-fast-fabric-11.7.0.0/host/unix/bin
BUILD_TARGET=X86_64
BUILD_TARGET_OS_VERSION=6.6.6-2401.0.1.1.ocs23.x86_64
PROMPT_COMMAND=printf "\033]0;<mock-chroot>\007"
WIND_BASE=/builddir/build/BUILD/eth-fast-fabric-11.7.0.0
RPM_PACKAGE_RELEASE=1.ocs23
BUILD_WITH_STACK=OPENIB
RPM_OS=linux
LDENVFS=
CCLOCAL=-O2 -flto=auto -ffat-lto-objects -fexceptions -g -grecord-gcc-switches -pipe -Wall -Werror=format-security -Wp,-D_FORTIFY_SOURCE=2 -Wp,-D_GLIBCXX_ASSERTIONS -specs=/usr/lib/rpm/OpenCloudOS/OpenCloudOS-hardened-cc1 -fstack-protector-strong  -m64 -march=x86-64-v2 -mtune=generic -fasynchronous-unwind-tables -fstack-clash-protection -fcf-protection
LT_SYS_LIBRARY_PATH=/usr/lib64:
CLOCAL=-O2 -flto=auto -ffat-lto-objects -fexceptions -g -grecord-gcc-switches -pipe -Wall -Werror=format-security -Wp,-D_FORTIFY_SOURCE=2 -Wp,-D_GLIBCXX_ASSERTIONS -specs=/usr/lib/rpm/OpenCloudOS/OpenCloudOS-hardened-cc1 -fstack-protector-strong  -m64 -march=x86-64-v2 -mtune=generic -fasynchronous-unwind-tables -fstack-clash-protection -fcf-protection
WRS_HOST=/builddir/build/BUILD/eth-fast-fabric-11.7.0.0/host/unix
FCFLAGS=-O2 -flto=auto -ffat-lto-objects -fexceptions -g -grecord-gcc-switches -pipe -Wall -Werror=format-security -Wp,-D_FORTIFY_SOURCE=2 -Wp,-D_GLIBCXX_ASSERTIONS -specs=/usr/lib/rpm/OpenCloudOS/OpenCloudOS-hardened-cc1 -fstack-protector-strong  -m64 -march=x86-64-v2 -mtune=generic -fasynchronous-unwind-tables -fstack-clash-protection -fcf-protection -I/usr/lib64/gfortran/modules
TL_DIR=/builddir/build/BUILD/eth-fast-fabric-11.7.0.0
BUILD_ULPS=all
TERM=vt100
PATHDIR=/builddir/build/BUILD
LESSOPEN=||/usr/bin/lesspipe.sh %s
USER=mockbuild
PRODUCT=OPENIB_FF
OPA_FEATURE_SET=opa10
RELEASE_TAG=11_7_0_0_111
SHLVL=2
RPM_BUILD_DIR=/builddir/build/BUILD
RPM_OPT_FLAGS=-O2 -flto=auto -ffat-lto-objects -fexceptions -g -grecord-gcc-switches -pipe -Wall -Werror=format-security -Wp,-D_FORTIFY_SOURCE=2 -Wp,-D_GLIBCXX_ASSERTIONS -specs=/usr/lib/rpm/OpenCloudOS/OpenCloudOS-hardened-cc1 -fstack-protector-strong  -m64 -march=x86-64-v2 -mtune=generic -fasynchronous-unwind-tables -fstack-clash-protection -fcf-protection
RPM_DOC_DIR=/usr/share/doc
RPM_PACKAGE_VERSION=11.7.0.0
which_declare=declare -f
WIND_HOST_TYPE=unix
CONFIG_SITE=NONE
BUILD_PLATFORM_OS_VENDOR_VERSION=ES23
PATH=/usr/bin:/bin:/usr/sbin:/sbin:/usr/local/sbin
CC=gcc
CFLAGS=-O2 -flto=auto -ffat-lto-objects -fexceptions -g -grecord-gcc-switches -pipe -Wall -Werror=format-security -Wp,-D_FORTIFY_SOURCE=2 -Wp,-D_GLIBCXX_ASSERTIONS -specs=/usr/lib/rpm/OpenCloudOS/OpenCloudOS-hardened-cc1 -fstack-protector-strong  -m64 -march=x86-64-v2 -mtune=generic -fasynchronous-unwind-tables -fstack-clash-protection -fcf-protection
MAIL=/var/spool/mail/mockbuild
RPM_BUILD_NCPUS=32
RPM_PACKAGE_NAME=eth-tools
BUILD_TARGET_OS=LINUX
RPM_BUILD_ROOT=/builddir/build/BUILDROOT/eth-tools-11.7.0.0-1.ocs23.x86_64
OLDPWD=/builddir/build/BUILD/eth-fast-fabric-11.7.0.0
BUILD_CONFIG=release
BASH_FUNC_which%%=() {  ( alias;
 eval ${which_declare} ) | /usr/bin/which --tty-only --read-alias --read-functions --show-tilde --show-dot $@
}
_=/usr/bin/env
+ echo ----------------------------------------------------------------------------
----------------------------------------------------------------------------
+ echo
+ ./rpm_runmake -B release
Stack to build for: OPENIB
Building for  X86_64 release Fri Jul 19 02:59:30 CST 2024...
SHELL=/bin/bash
RPM_SOURCE_DIR=/builddir/build/SOURCES
RELEASE_STRING=IntelEth-Tools-FF.opencloudos.ES23-x86_64.11.7.0.0.111
HISTCONTROL=ignoredups
PKG_CONFIG_PATH=:/usr/lib64/pkgconfig:/usr/share/pkgconfig
HOSTNAME=builder1.x64.stream.opencloudos.tech
HISTSIZE=1000
BUILD_PLATFORM_OS_VENDOR=opencloudos
BUILD_TARGET_OS_VENDOR_VERSION=ES23
BUILD_SKIP_ULPS=none
LDLOCAL=-Wl,-z,relro -Wl,--as-needed  -Wl,-z,now -specs=/usr/lib/rpm/OpenCloudOS/OpenCloudOS-hardened-ld  -Wl,--build-id=sha1
FFLAGS=-O2 -flto=auto -ffat-lto-objects -fexceptions -g -grecord-gcc-switches -pipe -Wall -Werror=format-security -Wp,-D_FORTIFY_SOURCE=2 -Wp,-D_GLIBCXX_ASSERTIONS -specs=/usr/lib/rpm/OpenCloudOS/OpenCloudOS-hardened-cc1 -fstack-protector-strong  -m64 -march=x86-64-v2 -mtune=generic -fasynchronous-unwind-tables -fstack-clash-protection -fcf-protection -I/usr/lib64/gfortran/modules
PWD=/builddir/build/BUILD/eth-fast-fabric-11.7.0.0/OpenIb_Host
LOGNAME=mockbuild
CXX=g++
CXXFLAGS=-O2 -flto=auto -ffat-lto-objects -fexceptions -g -grecord-gcc-switches -pipe -Wall -Werror=format-security -Wp,-D_FORTIFY_SOURCE=2 -Wp,-D_GLIBCXX_ASSERTIONS -specs=/usr/lib/rpm/OpenCloudOS/OpenCloudOS-hardened-cc1 -fstack-protector-strong  -m64 -march=x86-64-v2 -mtune=generic -fasynchronous-unwind-tables -fstack-clash-protection -fcf-protection
OFED_STACK_PREFIX=/usr
RPM_ARCH=x86_64
BUILD_TARGET_TOOLCHAIN=GNU
BUILD_TARGET_OS_VENDOR=opencloudos
LDFLAGS=-Wl,-z,relro -Wl,--as-needed  -Wl,-z,now -specs=/usr/lib/rpm/OpenCloudOS/OpenCloudOS-hardened-ld  -Wl,--build-id=sha1
HOME=/builddir
BUILD_PLATFORM=LINUX
LANG=C
BUILD_TARGET_OS_ID=opencloudos.ES23-x86_64
RPM_LD_FLAGS=-Wl,-z,relro -Wl,--as-needed  -Wl,-z,now -specs=/usr/lib/rpm/OpenCloudOS/OpenCloudOS-hardened-ld  -Wl,--build-id=sha1
WRS_BIN=/builddir/build/BUILD/eth-fast-fabric-11.7.0.0/host/unix/bin
BUILD_TARGET=X86_64
BUILD_TARGET_OS_VERSION=6.6.6-2401.0.1.1.ocs23.x86_64
PROMPT_COMMAND=printf "\033]0;<mock-chroot>\007"
WIND_BASE=/builddir/build/BUILD/eth-fast-fabric-11.7.0.0
RPM_PACKAGE_RELEASE=1.ocs23
BUILD_WITH_STACK=OPENIB
RPM_OS=linux
LDENVFS=
CCLOCAL=-O2 -flto=auto -ffat-lto-objects -fexceptions -g -grecord-gcc-switches -pipe -Wall -Werror=format-security -Wp,-D_FORTIFY_SOURCE=2 -Wp,-D_GLIBCXX_ASSERTIONS -specs=/usr/lib/rpm/OpenCloudOS/OpenCloudOS-hardened-cc1 -fstack-protector-strong  -m64 -march=x86-64-v2 -mtune=generic -fasynchronous-unwind-tables -fstack-clash-protection -fcf-protection
LT_SYS_LIBRARY_PATH=/usr/lib64:
CLOCAL=-O2 -flto=auto -ffat-lto-objects -fexceptions -g -grecord-gcc-switches -pipe -Wall -Werror=format-security -Wp,-D_FORTIFY_SOURCE=2 -Wp,-D_GLIBCXX_ASSERTIONS -specs=/usr/lib/rpm/OpenCloudOS/OpenCloudOS-hardened-cc1 -fstack-protector-strong  -m64 -march=x86-64-v2 -mtune=generic -fasynchronous-unwind-tables -fstack-clash-protection -fcf-protection
WRS_HOST=/builddir/build/BUILD/eth-fast-fabric-11.7.0.0/host/unix
FCFLAGS=-O2 -flto=auto -ffat-lto-objects -fexceptions -g -grecord-gcc-switches -pipe -Wall -Werror=format-security -Wp,-D_FORTIFY_SOURCE=2 -Wp,-D_GLIBCXX_ASSERTIONS -specs=/usr/lib/rpm/OpenCloudOS/OpenCloudOS-hardened-cc1 -fstack-protector-strong  -m64 -march=x86-64-v2 -mtune=generic -fasynchronous-unwind-tables -fstack-clash-protection -fcf-protection -I/usr/lib64/gfortran/modules
TL_DIR=/builddir/build/BUILD/eth-fast-fabric-11.7.0.0
BUILD_ULPS=all
TERM=vt100
PATHDIR=/builddir/build/BUILD
LESSOPEN=||/usr/bin/lesspipe.sh %s
USER=mockbuild
PRODUCT=OPENIB_FF
OPA_FEATURE_SET=opa10
RELEASE_TAG=11_7_0_0_111
SHLVL=3
RPM_BUILD_DIR=/builddir/build/BUILD
RPM_OPT_FLAGS=-O2 -flto=auto -ffat-lto-objects -fexceptions -g -grecord-gcc-switches -pipe -Wall -Werror=format-security -Wp,-D_FORTIFY_SOURCE=2 -Wp,-D_GLIBCXX_ASSERTIONS -specs=/usr/lib/rpm/OpenCloudOS/OpenCloudOS-hardened-cc1 -fstack-protector-strong  -m64 -march=x86-64-v2 -mtune=generic -fasynchronous-unwind-tables -fstack-clash-protection -fcf-protection
RPM_DOC_DIR=/usr/share/doc
RPM_PACKAGE_VERSION=11.7.0.0
which_declare=declare -f
WIND_HOST_TYPE=unix
CONFIG_SITE=NONE
PATH=/usr/bin:/bin:/usr/sbin:/sbin:/usr/local/sbin
BUILD_PLATFORM_OS_VENDOR_VERSION=ES23
CC=gcc
CFLAGS=-O2 -flto=auto -ffat-lto-objects -fexceptions -g -grecord-gcc-switches -pipe -Wall -Werror=format-security -Wp,-D_FORTIFY_SOURCE=2 -Wp,-D_GLIBCXX_ASSERTIONS -specs=/usr/lib/rpm/OpenCloudOS/OpenCloudOS-hardened-cc1 -fstack-protector-strong  -m64 -march=x86-64-v2 -mtune=generic -fasynchronous-unwind-tables -fstack-clash-protection -fcf-protection
MAIL=/var/spool/mail/mockbuild
RPM_BUILD_NCPUS=32
RPM_PACKAGE_NAME=eth-tools
BUILD_TARGET_OS=LINUX
RPM_BUILD_ROOT=/builddir/build/BUILDROOT/eth-tools-11.7.0.0-1.ocs23.x86_64
OLDPWD=/builddir/build/BUILD/eth-fast-fabric-11.7.0.0
PROJ_FILE_DIR=OpenIb_Host
BUILD_CONFIG=release
BASH_FUNC_which%%=() {  ( alias;
 eval ${which_declare} ) | /usr/bin/which --tty-only --read-alias --read-functions --show-tilde --show-dot $@
}
_=/usr/bin/env
Updating Makefile Dependencies
> build.OPENIB_FF.release.opa10/depend.mk
/bin/chmod 666 build.OPENIB_FF.release.opa10/depend.mk
for f in Makefile build.OPENIB_FF.release.opa10 ;\
do \
            if [ ! -d $f ]; then \
	/bin/echo "include $f" >> build.OPENIB_FF.release.opa10/depend.mk ;\
    fi \
done
make -f build.OPENIB_FF.release.opa10/depend.mk ALL
make[1]: Entering directory '/builddir/build/BUILD/eth-fast-fabric-11.7.0.0/OpenIb_Host'
mkdir -p /builddir/build/BUILD/eth-fast-fabric-11.7.0.0/builtlibs.OPENIB_FF.release.opa10 /builddir/build/BUILD/eth-fast-fabric-11.7.0.0/builtlibs.OPENIB_FF.release.opa10
cd /builddir/build/BUILD/eth-fast-fabric-11.7.0.0/MakeTools && make 
make[2]: Entering directory '/builddir/build/BUILD/eth-fast-fabric-11.7.0.0/MakeTools'
Updating Makefile Dependencies
> build.OPENIB_FF.release.opa10/depend.mk
/bin/chmod 666 build.OPENIB_FF.release.opa10/depend.mk
for f in Makefile build.OPENIB_FF.release.opa10 ;\
do \
            if [ ! -d $f ]; then \
	/bin/echo "include $f" >> build.OPENIB_FF.release.opa10/depend.mk ;\
    fi \
done
make -f build.OPENIB_FF.release.opa10/depend.mk ALL
make[3]: Entering directory '/builddir/build/BUILD/eth-fast-fabric-11.7.0.0/MakeTools'
for d in patch_version installtargets stripdepends rm_version  ;\
do \
          echo "cd $d && make  includes";\
          ( cd $d && make  includes ); \
           \
done
cd patch_version && make  includes
make[4]: Entering directory '/builddir/build/BUILD/eth-fast-fabric-11.7.0.0/MakeTools/patch_version'
make[4]: Nothing to be done for 'includes'.
make[4]: Leaving directory '/builddir/build/BUILD/eth-fast-fabric-11.7.0.0/MakeTools/patch_version'
cd installtargets && make  includes
make[4]: Entering directory '/builddir/build/BUILD/eth-fast-fabric-11.7.0.0/MakeTools/installtargets'
make[4]: Nothing to be done for 'includes'.
make[4]: Leaving directory '/builddir/build/BUILD/eth-fast-fabric-11.7.0.0/MakeTools/installtargets'
cd stripdepends && make  includes
make[4]: Entering directory '/builddir/build/BUILD/eth-fast-fabric-11.7.0.0/MakeTools/stripdepends'
make[4]: Nothing to be done for 'includes'.
make[4]: Leaving directory '/builddir/build/BUILD/eth-fast-fabric-11.7.0.0/MakeTools/stripdepends'
cd rm_version && make  includes
make[4]: Entering directory '/builddir/build/BUILD/eth-fast-fabric-11.7.0.0/MakeTools/rm_version'
make[4]: Nothing to be done for 'includes'.
make[4]: Leaving directory '/builddir/build/BUILD/eth-fast-fabric-11.7.0.0/MakeTools/rm_version'
/builddir/build/BUILD/eth-fast-fabric-11.7.0.0/MakeTools/ln-install.sh   /builddir/build/BUILD/eth-fast-fabric-11.7.0.0/builtinclude.OPENIB_FF.release.opa10//   
Making directory /builddir/build/BUILD/eth-fast-fabric-11.7.0.0/builtinclude.OPENIB_FF.release.opa10//
echo done > .includes.OPENIB_FF.release.opa10
for d in patch_version installtargets stripdepends rm_version  ;\
do \
          echo "cd $d && make  libsonly";\
          ( cd $d && make  libsonly ); \
           \
done
cd patch_version && make  libsonly
make[4]: Entering directory '/builddir/build/BUILD/eth-fast-fabric-11.7.0.0/MakeTools/patch_version'
make[4]: Nothing to be done for 'libsonly'.
make[4]: Leaving directory '/builddir/build/BUILD/eth-fast-fabric-11.7.0.0/MakeTools/patch_version'
cd installtargets && make  libsonly
make[4]: Entering directory '/builddir/build/BUILD/eth-fast-fabric-11.7.0.0/MakeTools/installtargets'
make[4]: Nothing to be done for 'libsonly'.
make[4]: Leaving directory '/builddir/build/BUILD/eth-fast-fabric-11.7.0.0/MakeTools/installtargets'
cd stripdepends && make  libsonly
make[4]: Entering directory '/builddir/build/BUILD/eth-fast-fabric-11.7.0.0/MakeTools/stripdepends'
make[4]: Nothing to be done for 'libsonly'.
make[4]: Leaving directory '/builddir/build/BUILD/eth-fast-fabric-11.7.0.0/MakeTools/stripdepends'
cd rm_version && make  libsonly
make[4]: Entering directory '/builddir/build/BUILD/eth-fast-fabric-11.7.0.0/MakeTools/rm_version'
make[4]: Nothing to be done for 'libsonly'.
make[4]: Leaving directory '/builddir/build/BUILD/eth-fast-fabric-11.7.0.0/MakeTools/rm_version'
echo done > .libraries.OPENIB_FF.release.opa10
for d in patch_version installtargets stripdepends rm_version  ;\
do \
          echo "cd $d && make  cmdsonly";\
          ( cd $d && make  cmdsonly ); \
           \
done
cd patch_version && make  cmdsonly
make[4]: Entering directory '/builddir/build/BUILD/eth-fast-fabric-11.7.0.0/MakeTools/patch_version'
gcc -pipe -DTARGET_CPU_FAMILY_X86 -D__X86_64__ -DCPU_LE -m64 -fno-strict-aliasing -fstack-protector-all -fstack-clash-protection -flto -std=gnu90 -Wno-misleading-indentation -Wno-format-truncation -fcf-protection=full -Wall -Wextra -Werror -flto -Wformat -Wformat-security -Werror=format-security -z noexecstack -fPIE -pie -D_FORTIFY_SOURCE=2 -Wl,-z,relro,-z,now -fstack-protector-strong -D_UNUSED_="__attribute__((unused))" -D_FALLTHRU_="__attribute__((fallthrough))" -DLINUX -Dlinux -D__LINUX__     -O2 -flto=auto -ffat-lto-objects -fexceptions -g -grecord-gcc-switches -pipe -Wall -Werror=format-security -Wp,-D_FORTIFY_SOURCE=2 -Wp,-D_GLIBCXX_ASSERTIONS -specs=/usr/lib/rpm/OpenCloudOS/OpenCloudOS-hardened-cc1 -fstack-protector-strong  -m64 -march=x86-64-v2 -mtune=generic -fasynchronous-unwind-tables -fstack-clash-protection -fcf-protection -O3 -fno-strength-reduce -D_FORTIFY_SOURCE=2 -g -I/builddir/build/BUILD/eth-fast-fabric-11.7.0.0/builtinclude.OPENIB_FF.release.opa10 -I/builddir/build/BUILD/eth-fast-fabric-11.7.0.0/builtinclude.OPENIB_FF.release.opa10/iba -I/builddir/build/BUILD/eth-fast-fabric-11.7.0.0/builtinclude.OPENIB_FF.release.opa10/iba/public -I/usr/include/infiniband -I/usr/include -c patch_version.c -o build.OPENIB_FF.release.opa10/patch_version.o
Linking executable...
gcc  -Wl,-z,noexecstack -z relro -z now     -Wl,-z,relro -Wl,--as-needed  -Wl,-z,now -specs=/usr/lib/rpm/OpenCloudOS/OpenCloudOS-hardened-ld  -Wl,--build-id=sha1 -L/builddir/build/BUILD/eth-fast-fabric-11.7.0.0/builtlibs.OPENIB_FF.release.opa10 -Xlinker -rpath-link -Xlinker /builddir/build/BUILD/eth-fast-fabric-11.7.0.0/builtlibs.OPENIB_FF.release.opa10  -o patch_version build.OPENIB_FF.release.opa10/patch_version.o -Xlinker --start-group   -Xlinker --end-group -lpthread
/bin/cp patch_version patch_brand
make[4]: Leaving directory '/builddir/build/BUILD/eth-fast-fabric-11.7.0.0/MakeTools/patch_version'
cd installtargets && make  cmdsonly
make[4]: Entering directory '/builddir/build/BUILD/eth-fast-fabric-11.7.0.0/MakeTools/installtargets'
gcc -pipe -DTARGET_CPU_FAMILY_X86 -D__X86_64__ -DCPU_LE -m64 -fno-strict-aliasing -fstack-protector-all -fstack-clash-protection -flto -std=gnu90 -Wno-misleading-indentation -Wno-format-truncation -fcf-protection=full -Wall -Wextra -Werror -flto -Wformat -Wformat-security -Werror=format-security -z noexecstack -fPIE -pie -D_FORTIFY_SOURCE=2 -Wl,-z,relro,-z,now -fstack-protector-strong -D_UNUSED_="__attribute__((unused))" -D_FALLTHRU_="__attribute__((fallthrough))" -DLINUX -Dlinux -D__LINUX__   -DPRODUCT=OPENIB_FF -DPRODUCT_OPENIB_FF -DMODULEVERSION=11.7.0.0.111 -DIB_STACK_OPENIB -include /builddir/build/BUILD/eth-fast-fabric-11.7.0.0/Fd/buildFeatureDefs  -O2 -flto=auto -ffat-lto-objects -fexceptions -g -grecord-gcc-switches -pipe -Wall -Werror=format-security -Wp,-D_FORTIFY_SOURCE=2 -Wp,-D_GLIBCXX_ASSERTIONS -specs=/usr/lib/rpm/OpenCloudOS/OpenCloudOS-hardened-cc1 -fstack-protector-strong  -m64 -march=x86-64-v2 -mtune=generic -fasynchronous-unwind-tables -fstack-clash-protection -fcf-protection -O3 -fno-strength-reduce -D_FORTIFY_SOURCE=2 -g -I/builddir/build/BUILD/eth-fast-fabric-11.7.0.0/builtinclude.OPENIB_FF.release.opa10 -I/builddir/build/BUILD/eth-fast-fabric-11.7.0.0/builtinclude.OPENIB_FF.release.opa10/iba -I/builddir/build/BUILD/eth-fast-fabric-11.7.0.0/builtinclude.OPENIB_FF.release.opa10/iba/public -I/usr/include/infiniband -I/usr/include -c installtargets.c -o build.OPENIB_FF.release.opa10/installtargets.o
Linking executable...
gcc  -Wl,-z,noexecstack -z relro -z now     -Wl,-z,relro -Wl,--as-needed  -Wl,-z,now -specs=/usr/lib/rpm/OpenCloudOS/OpenCloudOS-hardened-ld  -Wl,--build-id=sha1 -L/builddir/build/BUILD/eth-fast-fabric-11.7.0.0/builtlibs.OPENIB_FF.release.opa10 -Xlinker -rpath-link -Xlinker /builddir/build/BUILD/eth-fast-fabric-11.7.0.0/builtlibs.OPENIB_FF.release.opa10  -o installtargets build.OPENIB_FF.release.opa10/installtargets.o -Xlinker --start-group   -Xlinker --end-group -lpthread
make[4]: Leaving directory '/builddir/build/BUILD/eth-fast-fabric-11.7.0.0/MakeTools/installtargets'
cd stripdepends && make  cmdsonly
make[4]: Entering directory '/builddir/build/BUILD/eth-fast-fabric-11.7.0.0/MakeTools/stripdepends'
g++ -pipe -DTARGET_CPU_FAMILY_X86 -D__X86_64__ -DCPU_LE -m64 -fno-strict-aliasing -fstack-protector-all -fstack-clash-protection -flto -fcheck-new -Wno-ctor-dtor-privacy -fcf-protection=full -Wall -Wextra -Werror -flto -Wformat -Wformat-security -Werror=format-security -z noexecstack -fPIE -pie -D_FORTIFY_SOURCE=2 -Wl,-z,relro,-z,now -fstack-protector-strong -D_UNUSED_="__attribute__((unused))" -D_FALLTHRU_="__attribute__((fallthrough))" -DLINUX -Dlinux -D__LINUX__   -fno-rtti -fno-exceptions -DPRODUCT=OPENIB_FF -DPRODUCT_OPENIB_FF -DMODULEVERSION=11.7.0.0.111 -DIB_STACK_OPENIB -include /builddir/build/BUILD/eth-fast-fabric-11.7.0.0/Fd/buildFeatureDefs  -O2 -flto=auto -ffat-lto-objects -fexceptions -g -grecord-gcc-switches -pipe -Wall -Werror=format-security -Wp,-D_FORTIFY_SOURCE=2 -Wp,-D_GLIBCXX_ASSERTIONS -specs=/usr/lib/rpm/OpenCloudOS/OpenCloudOS-hardened-cc1 -fstack-protector-strong  -m64 -march=x86-64-v2 -mtune=generic -fasynchronous-unwind-tables -fstack-clash-protection -fcf-protection -O3 -fno-strength-reduce -D_FORTIFY_SOURCE=2 -g -I/builddir/build/BUILD/eth-fast-fabric-11.7.0.0/builtinclude.OPENIB_FF.release.opa10 -I/builddir/build/BUILD/eth-fast-fabric-11.7.0.0/builtinclude.OPENIB_FF.release.opa10/iba -I/builddir/build/BUILD/eth-fast-fabric-11.7.0.0/builtinclude.OPENIB_FF.release.opa10/iba/public -I/usr/include/infiniband -I/usr/include -c stripdepends.cpp -o build.OPENIB_FF.release.opa10/stripdepends.o
Linking executable...
gcc  -Wl,-z,noexecstack -z relro -z now     -Wl,-z,relro -Wl,--as-needed  -Wl,-z,now -specs=/usr/lib/rpm/OpenCloudOS/OpenCloudOS-hardened-ld  -Wl,--build-id=sha1 -L/builddir/build/BUILD/eth-fast-fabric-11.7.0.0/builtlibs.OPENIB_FF.release.opa10 -Xlinker -rpath-link -Xlinker /builddir/build/BUILD/eth-fast-fabric-11.7.0.0/builtlibs.OPENIB_FF.release.opa10  -o stripdepends build.OPENIB_FF.release.opa10/stripdepends.o -Xlinker --start-group   -Xlinker --end-group -lpthread
make[4]: Leaving directory '/builddir/build/BUILD/eth-fast-fabric-11.7.0.0/MakeTools/stripdepends'
cd rm_version && make  cmdsonly
make[4]: Entering directory '/builddir/build/BUILD/eth-fast-fabric-11.7.0.0/MakeTools/rm_version'
gcc -pipe -DTARGET_CPU_FAMILY_X86 -D__X86_64__ -DCPU_LE -m64 -fno-strict-aliasing -fstack-protector-all -fstack-clash-protection -flto -std=gnu90 -Wno-misleading-indentation -Wno-format-truncation -fcf-protection=full -Wall -Wextra -Werror -flto -Wformat -Wformat-security -Werror=format-security -z noexecstack -fPIE -pie -D_FORTIFY_SOURCE=2 -Wl,-z,relro,-z,now -fstack-protector-strong -D_UNUSED_="__attribute__((unused))" -D_FALLTHRU_="__attribute__((fallthrough))" -DLINUX -Dlinux -D__LINUX__   -DPRODUCT=OPENIB_FF -DPRODUCT_OPENIB_FF -DMODULEVERSION=11.7.0.0.111 -DIB_STACK_OPENIB -include /builddir/build/BUILD/eth-fast-fabric-11.7.0.0/Fd/buildFeatureDefs  -O2 -flto=auto -ffat-lto-objects -fexceptions -g -grecord-gcc-switches -pipe -Wall -Werror=format-security -Wp,-D_FORTIFY_SOURCE=2 -Wp,-D_GLIBCXX_ASSERTIONS -specs=/usr/lib/rpm/OpenCloudOS/OpenCloudOS-hardened-cc1 -fstack-protector-strong  -m64 -march=x86-64-v2 -mtune=generic -fasynchronous-unwind-tables -fstack-clash-protection -fcf-protection -O3 -fno-strength-reduce -D_FORTIFY_SOURCE=2 -g -I/builddir/build/BUILD/eth-fast-fabric-11.7.0.0/builtinclude.OPENIB_FF.release.opa10 -I/builddir/build/BUILD/eth-fast-fabric-11.7.0.0/builtinclude.OPENIB_FF.release.opa10/iba -I/builddir/build/BUILD/eth-fast-fabric-11.7.0.0/builtinclude.OPENIB_FF.release.opa10/iba/public -I/usr/include/infiniband -I/usr/include -c rm_version.c -o build.OPENIB_FF.release.opa10/rm_version.o
Linking executable...
gcc  -Wl,-z,noexecstack -z relro -z now     -Wl,-z,relro -Wl,--as-needed  -Wl,-z,now -specs=/usr/lib/rpm/OpenCloudOS/OpenCloudOS-hardened-ld  -Wl,--build-id=sha1 -L/builddir/build/BUILD/eth-fast-fabric-11.7.0.0/builtlibs.OPENIB_FF.release.opa10 -Xlinker -rpath-link -Xlinker /builddir/build/BUILD/eth-fast-fabric-11.7.0.0/builtlibs.OPENIB_FF.release.opa10  -o rm_version build.OPENIB_FF.release.opa10/rm_version.o -Xlinker --start-group   -Xlinker --end-group -lpthread
make[4]: Leaving directory '/builddir/build/BUILD/eth-fast-fabric-11.7.0.0/MakeTools/rm_version'
cat builddsw.sh >builddsw 
chmod a+x builddsw
cat build_srpms.sh >build_srpms 
chmod a+x build_srpms
cat expand_source.sh >expand_source 
chmod a+x expand_source
cat expand_ofed.sh >expand_ofed 
chmod a+x expand_ofed
cat get_ofed_files.sh >get_ofed_files 
chmod a+x get_ofed_files
cat get_comp.sh >get_comp 
chmod a+x get_comp
cat get_input_comp_files.sh >get_input_comp_files 
chmod a+x get_input_comp_files
cat finddspfiles.sh >finddspfiles 
chmod a+x finddspfiles
cat ln-install.sh >ln-install 
chmod a+x ln-install
cat makewin32depend.sh >makewin32depend 
chmod a+x makewin32depend
cat unpack_comp.sh >unpack_comp 
chmod a+x unpack_comp
/builddir/build/BUILD/eth-fast-fabric-11.7.0.0/MakeTools/ln-install.sh   /builddir/build/BUILD/eth-fast-fabric-11.7.0.0/builtbin.OPENIB_FF.release.opa10//  builddsw build_srpms expand_source expand_ofed get_ofed_files get_comp get_input_comp_files finddspfiles ln-install makewin32depend unpack_comp 
Making directory /builddir/build/BUILD/eth-fast-fabric-11.7.0.0/builtbin.OPENIB_FF.release.opa10//
echo done > .binaries.OPENIB_FF.release.opa10
Product(s) Built
make[3]: Leaving directory '/builddir/build/BUILD/eth-fast-fabric-11.7.0.0/MakeTools'
make[2]: Leaving directory '/builddir/build/BUILD/eth-fast-fabric-11.7.0.0/MakeTools'
for d in /builddir/build/BUILD/eth-fast-fabric-11.7.0.0/Makerules /builddir/build/BUILD/eth-fast-fabric-11.7.0.0/IbAccess /builddir/build/BUILD/eth-fast-fabric-11.7.0.0/Xml /builddir/build/BUILD/eth-fast-fabric-11.7.0.0/IbaTools /builddir/build/BUILD/eth-fast-fabric-11.7.0.0/MpiApps /builddir/build/BUILD/eth-fast-fabric-11.7.0.0/TestTools /builddir/build/BUILD/eth-fast-fabric-11.7.0.0/IbPrint /builddir/build/BUILD/eth-fast-fabric-11.7.0.0/Topology LINUX ;\
do \
          echo "cd $d && make  includes";\
          ( cd $d && make  includes ); \
           \
done
cd /builddir/build/BUILD/eth-fast-fabric-11.7.0.0/Makerules && make  includes
make[2]: Entering directory '/builddir/build/BUILD/eth-fast-fabric-11.7.0.0/Makerules'
make[2]: Nothing to be done for 'includes'.
make[2]: Leaving directory '/builddir/build/BUILD/eth-fast-fabric-11.7.0.0/Makerules'
cd /builddir/build/BUILD/eth-fast-fabric-11.7.0.0/IbAccess && make  includes
make[2]: Entering directory '/builddir/build/BUILD/eth-fast-fabric-11.7.0.0/IbAccess'
for d in UserLinux ;\
do \
          echo "cd $d && make  includes";\
          ( cd $d && make  includes ); \
           \
done
cd UserLinux && make  includes
make[3]: Entering directory '/builddir/build/BUILD/eth-fast-fabric-11.7.0.0/IbAccess/UserLinux'
for d in Public Inc ;\
do \
          echo "cd $d && make  includes";\
          ( cd $d && make  includes ); \
           \
done
cd Public && make  includes
make[4]: Entering directory '/builddir/build/BUILD/eth-fast-fabric-11.7.0.0/IbAccess/UserLinux/Public'
/builddir/build/BUILD/eth-fast-fabric-11.7.0.0/MakeTools/ln-install.sh   /builddir/build/BUILD/eth-fast-fabric-11.7.0.0/builtinclude.OPENIB_FF.release.opa10/iba/public/ /builddir/build/BUILD/eth-fast-fabric-11.7.0.0/IbAccess/UserLinux/../Common/Public/datatypes.h /builddir/build/BUILD/eth-fast-fabric-11.7.0.0/IbAccess/UserLinux/../Common/Public/iarray.h /builddir/build/BUILD/eth-fast-fabric-11.7.0.0/IbAccess/UserLinux/../Common/Public/ibitvector.h /builddir/build/BUILD/eth-fast-fabric-11.7.0.0/IbAccess/UserLinux/../Common/Public/ibyteswap.h /builddir/build/BUILD/eth-fast-fabric-11.7.0.0/IbAccess/UserLinux/../Common/Public/idebug.h /builddir/build/BUILD/eth-fast-fabric-11.7.0.0/IbAccess/UserLinux/../Common/Public/iethernet.h /builddir/build/BUILD/eth-fast-fabric-11.7.0.0/IbAccess/UserLinux/../Common/Public/iheapmanager.h /builddir/build/BUILD/eth-fast-fabric-11.7.0.0/IbAccess/UserLinux/../Common/Public/ilist.h /builddir/build/BUILD/eth-fast-fabric-11.7.0.0/IbAccess/UserLinux/../Common/Public/imath.h /builddir/build/BUILD/eth-fast-fabric-11.7.0.0/IbAccess/UserLinux/../Common/Public/imemory.h /builddir/build/BUILD/eth-fast-fabric-11.7.0.0/IbAccess/UserLinux/../Common/Public/imemtrack.h /builddir/build/BUILD/eth-fast-fabric-11.7.0.0/IbAccess/UserLinux/../Common/Public/imutex.h /builddir/build/BUILD/eth-fast-fabric-11.7.0.0/IbAccess/UserLinux/../Common/Public/iobjmgr.h /builddir/build/BUILD/eth-fast-fabric-11.7.0.0/IbAccess/UserLinux/../Common/Public/iquickmap.h /builddir/build/BUILD/eth-fast-fabric-11.7.0.0/IbAccess/UserLinux/../Common/Public/ispinlock.h /builddir/build/BUILD/eth-fast-fabric-11.7.0.0/IbAccess/UserLinux/../Common/Public/itcpip.h /builddir/build/BUILD/eth-fast-fabric-11.7.0.0/IbAccess/UserLinux/../Common/Public/itimer.h /builddir/build/BUILD/eth-fast-fabric-11.7.0.0/IbAccess/UserLinux/../Common/Public/statustext.h datatypes_osd.h idebug_osd.h imemory_osd.h imutex_osd.h ipackoff.h ipackon.h ispinlock_osd.h itimer_osd.h ibyteswap_osd.h  
Making directory /builddir/build/BUILD/eth-fast-fabric-11.7.0.0/builtinclude.OPENIB_FF.release.opa10/iba/public/
echo done > .includes.OPENIB_FF.release.opa10
make[4]: Leaving directory '/builddir/build/BUILD/eth-fast-fabric-11.7.0.0/IbAccess/UserLinux/Public'
cd Inc && make  includes
make[4]: Entering directory '/builddir/build/BUILD/eth-fast-fabric-11.7.0.0/IbAccess/UserLinux/Inc'
/builddir/build/BUILD/eth-fast-fabric-11.7.0.0/MakeTools/ln-install.sh   /builddir/build/BUILD/eth-fast-fabric-11.7.0.0/builtinclude.OPENIB_FF.release.opa10/iba/ /builddir/build/BUILD/eth-fast-fabric-11.7.0.0/IbAccess/UserLinux/../Common/Inc/ib_debug.h /builddir/build/BUILD/eth-fast-fabric-11.7.0.0/IbAccess/UserLinux/../Common/Inc/ib_dm.h /builddir/build/BUILD/eth-fast-fabric-11.7.0.0/IbAccess/UserLinux/../Common/Inc/ib_generalServices.h /builddir/build/BUILD/eth-fast-fabric-11.7.0.0/IbAccess/UserLinux/../Common/Inc/ib_helper.h /builddir/build/BUILD/eth-fast-fabric-11.7.0.0/IbAccess/UserLinux/../Common/Inc/ib_mad.h /builddir/build/BUILD/eth-fast-fabric-11.7.0.0/IbAccess/UserLinux/../Common/Inc/ib_pkt.h /builddir/build/BUILD/eth-fast-fabric-11.7.0.0/IbAccess/UserLinux/../Common/Inc/ib_rmpp.h /builddir/build/BUILD/eth-fast-fabric-11.7.0.0/IbAccess/UserLinux/../Common/Inc/ib_sa_records.h /builddir/build/BUILD/eth-fast-fabric-11.7.0.0/IbAccess/UserLinux/../Common/Inc/ib_sa_records_priv.h /builddir/build/BUILD/eth-fast-fabric-11.7.0.0/IbAccess/UserLinux/../Common/Inc/ib_sd.h /builddir/build/BUILD/eth-fast-fabric-11.7.0.0/IbAccess/UserLinux/../Common/Inc/ib_sd_priv.h /builddir/build/BUILD/eth-fast-fabric-11.7.0.0/IbAccess/UserLinux/../Common/Inc/ib_cm.h /builddir/build/BUILD/eth-fast-fabric-11.7.0.0/IbAccess/UserLinux/../Common/Inc/ib_sm_priv.h /builddir/build/BUILD/eth-fast-fabric-11.7.0.0/IbAccess/UserLinux/../Common/Inc/ib_sm_types.h /builddir/build/BUILD/eth-fast-fabric-11.7.0.0/IbAccess/UserLinux/../Common/Inc/ib_status.h /builddir/build/BUILD/eth-fast-fabric-11.7.0.0/IbAccess/UserLinux/../Common/Inc/ib_types.h /builddir/build/BUILD/eth-fast-fabric-11.7.0.0/IbAccess/UserLinux/../Common/Inc/ipublic.h /builddir/build/BUILD/eth-fast-fabric-11.7.0.0/IbAccess/UserLinux/../Common/Inc/stl_helper.h /builddir/build/BUILD/eth-fast-fabric-11.7.0.0/IbAccess/UserLinux/../Common/Inc/stl_mad_priv.h /builddir/build/BUILD/eth-fast-fabric-11.7.0.0/IbAccess/UserLinux/../Common/Inc/stl_mad_types.h /builddir/build/BUILD/eth-fast-fabric-11.7.0.0/IbAccess/UserLinux/../Common/Inc/stl_pa_priv.h /builddir/build/BUILD/eth-fast-fabric-11.7.0.0/IbAccess/UserLinux/../Common/Inc/stl_pa_types.h /builddir/build/BUILD/eth-fast-fabric-11.7.0.0/IbAccess/UserLinux/../Common/Inc/stl_pkt.h /builddir/build/BUILD/eth-fast-fabric-11.7.0.0/IbAccess/UserLinux/../Common/Inc/stl_sm_types.h /builddir/build/BUILD/eth-fast-fabric-11.7.0.0/IbAccess/UserLinux/../Common/Inc/stl_sa_types.h /builddir/build/BUILD/eth-fast-fabric-11.7.0.0/IbAccess/UserLinux/../Common/Inc/stl_sd.h /builddir/build/BUILD/eth-fast-fabric-11.7.0.0/IbAccess/UserLinux/../Common/Inc/stl_t.h /builddir/build/BUILD/eth-fast-fabric-11.7.0.0/IbAccess/UserLinux/../Common/Inc/stl_types.h /builddir/build/BUILD/eth-fast-fabric-11.7.0.0/IbAccess/UserLinux/../Common/Inc/stl_em_eostl.h /builddir/build/BUILD/eth-fast-fabric-11.7.0.0/IbAccess/UserLinux/../Common/Inc/stl_ea_eostl.h /builddir/build/BUILD/eth-fast-fabric-11.7.0.0/IbAccess/UserLinux/../Common/Inc/stl_eepha_eostl.h /builddir/build/BUILD/eth-fast-fabric-11.7.0.0/IbAccess/UserLinux/../Common/Inc/stl_rmpp.h /builddir/build/BUILD/eth-fast-fabric-11.7.0.0/IbAccess/UserLinux/../Common/Inc/eth_link_types.h ib_debug_osd.h  /builddir/build/BUILD/eth-fast-fabric-11.7.0.0/IbAccess/UserLinux/../UserCommon/Inc/ibt.h /builddir/build/BUILD/eth-fast-fabric-11.7.0.0/IbAccess/UserLinux/../Common/Inc/ib_avtracker.h /builddir/build/BUILD/eth-fast-fabric-11.7.0.0/IbAccess/UserLinux/../Common/Inc/ib_ibt.h /builddir/build/BUILD/eth-fast-fabric-11.7.0.0/IbAccess/UserLinux/../Common/Inc/umadt.h /builddir/build/BUILD/eth-fast-fabric-11.7.0.0/IbAccess/UserLinux/../Common/Inc/vpi.h /builddir/build/BUILD/eth-fast-fabric-11.7.0.0/IbAccess/UserLinux/../Common/Inc/vpi_export.h   
echo done > .includes.OPENIB_FF.release.opa10
make[4]: Leaving directory '/builddir/build/BUILD/eth-fast-fabric-11.7.0.0/IbAccess/UserLinux/Inc'
/builddir/build/BUILD/eth-fast-fabric-11.7.0.0/MakeTools/ln-install.sh   /builddir/build/BUILD/eth-fast-fabric-11.7.0.0/builtinclude.OPENIB_FF.release.opa10/iba/   
echo done > .includes.OPENIB_FF.release.opa10
make[3]: Leaving directory '/builddir/build/BUILD/eth-fast-fabric-11.7.0.0/IbAccess/UserLinux'
make[2]: Leaving directory '/builddir/build/BUILD/eth-fast-fabric-11.7.0.0/IbAccess'
cd /builddir/build/BUILD/eth-fast-fabric-11.7.0.0/Xml && make  includes
make[2]: Entering directory '/builddir/build/BUILD/eth-fast-fabric-11.7.0.0/Xml'
for d in xml_sample xml_sample2 ethxmlindent ;\
do \
          echo "cd $d && make  includes";\
          ( cd $d && make  includes ); \
           \
done
cd xml_sample && make  includes
make[3]: Entering directory '/builddir/build/BUILD/eth-fast-fabric-11.7.0.0/Xml/xml_sample'
/builddir/build/BUILD/eth-fast-fabric-11.7.0.0/MakeTools/ln-install.sh   /builddir/build/BUILD/eth-fast-fabric-11.7.0.0/builtinclude.OPENIB_FF.release.opa10//   
echo done > .includes.OPENIB_FF.release.opa10
make[3]: Leaving directory '/builddir/build/BUILD/eth-fast-fabric-11.7.0.0/Xml/xml_sample'
cd xml_sample2 && make  includes
make[3]: Entering directory '/builddir/build/BUILD/eth-fast-fabric-11.7.0.0/Xml/xml_sample2'
/builddir/build/BUILD/eth-fast-fabric-11.7.0.0/MakeTools/ln-install.sh   /builddir/build/BUILD/eth-fast-fabric-11.7.0.0/builtinclude.OPENIB_FF.release.opa10//   
echo done > .includes.OPENIB_FF.release.opa10
make[3]: Leaving directory '/builddir/build/BUILD/eth-fast-fabric-11.7.0.0/Xml/xml_sample2'
cd ethxmlindent && make  includes
make[3]: Entering directory '/builddir/build/BUILD/eth-fast-fabric-11.7.0.0/Xml/ethxmlindent'
/builddir/build/BUILD/eth-fast-fabric-11.7.0.0/MakeTools/ln-install.sh   /builddir/build/BUILD/eth-fast-fabric-11.7.0.0/builtinclude.OPENIB_FF.release.opa10//   
echo done > .includes.OPENIB_FF.release.opa10
make[3]: Leaving directory '/builddir/build/BUILD/eth-fast-fabric-11.7.0.0/Xml/ethxmlindent'
/builddir/build/BUILD/eth-fast-fabric-11.7.0.0/MakeTools/ln-install.sh   /builddir/build/BUILD/eth-fast-fabric-11.7.0.0/builtinclude.OPENIB_FF.release.opa10// ixml.h ixml_ib.h   
echo done > .includes.OPENIB_FF.release.opa10
make[2]: Leaving directory '/builddir/build/BUILD/eth-fast-fabric-11.7.0.0/Xml'
cd /builddir/build/BUILD/eth-fast-fabric-11.7.0.0/IbaTools && make  includes
make[2]: Entering directory '/builddir/build/BUILD/eth-fast-fabric-11.7.0.0/IbaTools'
for d in disable_ports dsa_setup FastFabric fabric_info setup_self_ssh stream ethipcalc ethgetipaddrtype ethmon ethreport eth2rm ethbw ethxmlextract ethxmlfilter ethxmlgenerate ethxlattopology ethfindgood ethlinkanalysis ethcabletest ethcheckload nodeverify usemem ethudstress ethshmcleanup man ;\
do \
          echo "cd $d && make  includes";\
          ( cd $d && make  includes ); \
           \
done
cd disable_ports && make  includes
make[3]: Entering directory '/builddir/build/BUILD/eth-fast-fabric-11.7.0.0/IbaTools/disable_ports'
/builddir/build/BUILD/eth-fast-fabric-11.7.0.0/MakeTools/ln-install.sh   /builddir/build/BUILD/eth-fast-fabric-11.7.0.0/builtinclude.OPENIB_FF.release.opa10//   
echo done > .includes.OPENIB_FF.release.opa10
make[3]: Leaving directory '/builddir/build/BUILD/eth-fast-fabric-11.7.0.0/IbaTools/disable_ports'
cd dsa_setup && make  includes
make[3]: Entering directory '/builddir/build/BUILD/eth-fast-fabric-11.7.0.0/IbaTools/dsa_setup'
/builddir/build/BUILD/eth-fast-fabric-11.7.0.0/MakeTools/ln-install.sh   /builddir/build/BUILD/eth-fast-fabric-11.7.0.0/builtinclude.OPENIB_FF.release.opa10//   
echo done > .includes.OPENIB_FF.release.opa10
make[3]: Leaving directory '/builddir/build/BUILD/eth-fast-fabric-11.7.0.0/IbaTools/dsa_setup'
cd FastFabric && make  includes
make[3]: Entering directory '/builddir/build/BUILD/eth-fast-fabric-11.7.0.0/IbaTools/FastFabric'
/builddir/build/BUILD/eth-fast-fabric-11.7.0.0/MakeTools/ln-install.sh   /builddir/build/BUILD/eth-fast-fabric-11.7.0.0/builtinclude.OPENIB_FF.release.opa10//   
echo done > .includes.OPENIB_FF.release.opa10
make[3]: Leaving directory '/builddir/build/BUILD/eth-fast-fabric-11.7.0.0/IbaTools/FastFabric'
cd fabric_info && make  includes
make[3]: Entering directory '/builddir/build/BUILD/eth-fast-fabric-11.7.0.0/IbaTools/fabric_info'
/builddir/build/BUILD/eth-fast-fabric-11.7.0.0/MakeTools/ln-install.sh   /builddir/build/BUILD/eth-fast-fabric-11.7.0.0/builtinclude.OPENIB_FF.release.opa10//   
echo done > .includes.OPENIB_FF.release.opa10
make[3]: Leaving directory '/builddir/build/BUILD/eth-fast-fabric-11.7.0.0/IbaTools/fabric_info'
cd setup_self_ssh && make  includes
make[3]: Entering directory '/builddir/build/BUILD/eth-fast-fabric-11.7.0.0/IbaTools/setup_self_ssh'
/builddir/build/BUILD/eth-fast-fabric-11.7.0.0/MakeTools/ln-install.sh   /builddir/build/BUILD/eth-fast-fabric-11.7.0.0/builtinclude.OPENIB_FF.release.opa10//   
echo done > .includes.OPENIB_FF.release.opa10
make[3]: Leaving directory '/builddir/build/BUILD/eth-fast-fabric-11.7.0.0/IbaTools/setup_self_ssh'
cd stream && make  includes
make[3]: Entering directory '/builddir/build/BUILD/eth-fast-fabric-11.7.0.0/IbaTools/stream'
/builddir/build/BUILD/eth-fast-fabric-11.7.0.0/MakeTools/ln-install.sh   /builddir/build/BUILD/eth-fast-fabric-11.7.0.0/builtinclude.OPENIB_FF.release.opa10//   
echo done > .includes.OPENIB_FF.release.opa10
make[3]: Leaving directory '/builddir/build/BUILD/eth-fast-fabric-11.7.0.0/IbaTools/stream'
cd ethipcalc && make  includes
make[3]: Entering directory '/builddir/build/BUILD/eth-fast-fabric-11.7.0.0/IbaTools/ethipcalc'
/builddir/build/BUILD/eth-fast-fabric-11.7.0.0/MakeTools/ln-install.sh   /builddir/build/BUILD/eth-fast-fabric-11.7.0.0/builtinclude.OPENIB_FF.release.opa10//   
echo done > .includes.OPENIB_FF.release.opa10
make[3]: Leaving directory '/builddir/build/BUILD/eth-fast-fabric-11.7.0.0/IbaTools/ethipcalc'
cd ethgetipaddrtype && make  includes
make[3]: Entering directory '/builddir/build/BUILD/eth-fast-fabric-11.7.0.0/IbaTools/ethgetipaddrtype'
/builddir/build/BUILD/eth-fast-fabric-11.7.0.0/MakeTools/ln-install.sh   /builddir/build/BUILD/eth-fast-fabric-11.7.0.0/builtinclude.OPENIB_FF.release.opa10//   
echo done > .includes.OPENIB_FF.release.opa10
make[3]: Leaving directory '/builddir/build/BUILD/eth-fast-fabric-11.7.0.0/IbaTools/ethgetipaddrtype'
cd ethmon && make  includes
make[3]: Entering directory '/builddir/build/BUILD/eth-fast-fabric-11.7.0.0/IbaTools/ethmon'
/builddir/build/BUILD/eth-fast-fabric-11.7.0.0/MakeTools/ln-install.sh   /builddir/build/BUILD/eth-fast-fabric-11.7.0.0/builtinclude.OPENIB_FF.release.opa10//   
echo done > .includes.OPENIB_FF.release.opa10
make[3]: Leaving directory '/builddir/build/BUILD/eth-fast-fabric-11.7.0.0/IbaTools/ethmon'
cd ethreport && make  includes
make[3]: Entering directory '/builddir/build/BUILD/eth-fast-fabric-11.7.0.0/IbaTools/ethreport'
/builddir/build/BUILD/eth-fast-fabric-11.7.0.0/MakeTools/ln-install.sh   /builddir/build/BUILD/eth-fast-fabric-11.7.0.0/builtinclude.OPENIB_FF.release.opa10//   
echo done > .includes.OPENIB_FF.release.opa10
make[3]: Leaving directory '/builddir/build/BUILD/eth-fast-fabric-11.7.0.0/IbaTools/ethreport'
cd eth2rm && make  includes
make[3]: Entering directory '/builddir/build/BUILD/eth-fast-fabric-11.7.0.0/IbaTools/eth2rm'
/builddir/build/BUILD/eth-fast-fabric-11.7.0.0/MakeTools/ln-install.sh   /builddir/build/BUILD/eth-fast-fabric-11.7.0.0/builtinclude.OPENIB_FF.release.opa10//   
echo done > .includes.OPENIB_FF.release.opa10
make[3]: Leaving directory '/builddir/build/BUILD/eth-fast-fabric-11.7.0.0/IbaTools/eth2rm'
cd ethbw && make  includes
make[3]: Entering directory '/builddir/build/BUILD/eth-fast-fabric-11.7.0.0/IbaTools/ethbw'
/builddir/build/BUILD/eth-fast-fabric-11.7.0.0/MakeTools/ln-install.sh   /builddir/build/BUILD/eth-fast-fabric-11.7.0.0/builtinclude.OPENIB_FF.release.opa10//   
echo done > .includes.OPENIB_FF.release.opa10
make[3]: Leaving directory '/builddir/build/BUILD/eth-fast-fabric-11.7.0.0/IbaTools/ethbw'
cd ethxmlextract && make  includes
make[3]: Entering directory '/builddir/build/BUILD/eth-fast-fabric-11.7.0.0/IbaTools/ethxmlextract'
/builddir/build/BUILD/eth-fast-fabric-11.7.0.0/MakeTools/ln-install.sh   /builddir/build/BUILD/eth-fast-fabric-11.7.0.0/builtinclude.OPENIB_FF.release.opa10//   
echo done > .includes.OPENIB_FF.release.opa10
make[3]: Leaving directory '/builddir/build/BUILD/eth-fast-fabric-11.7.0.0/IbaTools/ethxmlextract'
cd ethxmlfilter && make  includes
make[3]: Entering directory '/builddir/build/BUILD/eth-fast-fabric-11.7.0.0/IbaTools/ethxmlfilter'
/builddir/build/BUILD/eth-fast-fabric-11.7.0.0/MakeTools/ln-install.sh   /builddir/build/BUILD/eth-fast-fabric-11.7.0.0/builtinclude.OPENIB_FF.release.opa10//   
echo done > .includes.OPENIB_FF.release.opa10
make[3]: Leaving directory '/builddir/build/BUILD/eth-fast-fabric-11.7.0.0/IbaTools/ethxmlfilter'
cd ethxmlgenerate && make  includes
make[3]: Entering directory '/builddir/build/BUILD/eth-fast-fabric-11.7.0.0/IbaTools/ethxmlgenerate'
/builddir/build/BUILD/eth-fast-fabric-11.7.0.0/MakeTools/ln-install.sh   /builddir/build/BUILD/eth-fast-fabric-11.7.0.0/builtinclude.OPENIB_FF.release.opa10//   
echo done > .includes.OPENIB_FF.release.opa10
make[3]: Leaving directory '/builddir/build/BUILD/eth-fast-fabric-11.7.0.0/IbaTools/ethxmlgenerate'
cd ethxlattopology && make  includes
make[3]: Entering directory '/builddir/build/BUILD/eth-fast-fabric-11.7.0.0/IbaTools/ethxlattopology'
/builddir/build/BUILD/eth-fast-fabric-11.7.0.0/MakeTools/ln-install.sh   /builddir/build/BUILD/eth-fast-fabric-11.7.0.0/builtinclude.OPENIB_FF.release.opa10//   
echo done > .includes.OPENIB_FF.release.opa10
make[3]: Leaving directory '/builddir/build/BUILD/eth-fast-fabric-11.7.0.0/IbaTools/ethxlattopology'
cd ethfindgood && make  includes
make[3]: Entering directory '/builddir/build/BUILD/eth-fast-fabric-11.7.0.0/IbaTools/ethfindgood'
/builddir/build/BUILD/eth-fast-fabric-11.7.0.0/MakeTools/ln-install.sh   /builddir/build/BUILD/eth-fast-fabric-11.7.0.0/builtinclude.OPENIB_FF.release.opa10//   
echo done > .includes.OPENIB_FF.release.opa10
make[3]: Leaving directory '/builddir/build/BUILD/eth-fast-fabric-11.7.0.0/IbaTools/ethfindgood'
cd ethlinkanalysis && make  includes
make[3]: Entering directory '/builddir/build/BUILD/eth-fast-fabric-11.7.0.0/IbaTools/ethlinkanalysis'
/builddir/build/BUILD/eth-fast-fabric-11.7.0.0/MakeTools/ln-install.sh   /builddir/build/BUILD/eth-fast-fabric-11.7.0.0/builtinclude.OPENIB_FF.release.opa10//   
echo done > .includes.OPENIB_FF.release.opa10
make[3]: Leaving directory '/builddir/build/BUILD/eth-fast-fabric-11.7.0.0/IbaTools/ethlinkanalysis'
cd ethcabletest && make  includes
make[3]: Entering directory '/builddir/build/BUILD/eth-fast-fabric-11.7.0.0/IbaTools/ethcabletest'
/builddir/build/BUILD/eth-fast-fabric-11.7.0.0/MakeTools/ln-install.sh   /builddir/build/BUILD/eth-fast-fabric-11.7.0.0/builtinclude.OPENIB_FF.release.opa10//   
echo done > .includes.OPENIB_FF.release.opa10
make[3]: Leaving directory '/builddir/build/BUILD/eth-fast-fabric-11.7.0.0/IbaTools/ethcabletest'
cd ethcheckload && make  includes
make[3]: Entering directory '/builddir/build/BUILD/eth-fast-fabric-11.7.0.0/IbaTools/ethcheckload'
/builddir/build/BUILD/eth-fast-fabric-11.7.0.0/MakeTools/ln-install.sh   /builddir/build/BUILD/eth-fast-fabric-11.7.0.0/builtinclude.OPENIB_FF.release.opa10//   
echo done > .includes.OPENIB_FF.release.opa10
make[3]: Leaving directory '/builddir/build/BUILD/eth-fast-fabric-11.7.0.0/IbaTools/ethcheckload'
cd nodeverify && make  includes
make[3]: Entering directory '/builddir/build/BUILD/eth-fast-fabric-11.7.0.0/IbaTools/nodeverify'
/builddir/build/BUILD/eth-fast-fabric-11.7.0.0/MakeTools/ln-install.sh   /builddir/build/BUILD/eth-fast-fabric-11.7.0.0/builtinclude.OPENIB_FF.release.opa10//   
echo done > .includes.OPENIB_FF.release.opa10
make[3]: Leaving directory '/builddir/build/BUILD/eth-fast-fabric-11.7.0.0/IbaTools/nodeverify'
cd usemem && make  includes
make[3]: Entering directory '/builddir/build/BUILD/eth-fast-fabric-11.7.0.0/IbaTools/usemem'
/builddir/build/BUILD/eth-fast-fabric-11.7.0.0/MakeTools/ln-install.sh   /builddir/build/BUILD/eth-fast-fabric-11.7.0.0/builtinclude.OPENIB_FF.release.opa10//   
echo done > .includes.OPENIB_FF.release.opa10
make[3]: Leaving directory '/builddir/build/BUILD/eth-fast-fabric-11.7.0.0/IbaTools/usemem'
cd ethudstress && make  includes
make[3]: Entering directory '/builddir/build/BUILD/eth-fast-fabric-11.7.0.0/IbaTools/ethudstress'
/builddir/build/BUILD/eth-fast-fabric-11.7.0.0/MakeTools/ln-install.sh   /builddir/build/BUILD/eth-fast-fabric-11.7.0.0/builtinclude.OPENIB_FF.release.opa10//   
echo done > .includes.OPENIB_FF.release.opa10
make[3]: Leaving directory '/builddir/build/BUILD/eth-fast-fabric-11.7.0.0/IbaTools/ethudstress'
cd ethshmcleanup && make  includes
make[3]: Entering directory '/builddir/build/BUILD/eth-fast-fabric-11.7.0.0/IbaTools/ethshmcleanup'
/builddir/build/BUILD/eth-fast-fabric-11.7.0.0/MakeTools/ln-install.sh   /builddir/build/BUILD/eth-fast-fabric-11.7.0.0/builtinclude.OPENIB_FF.release.opa10//   
echo done > .includes.OPENIB_FF.release.opa10
make[3]: Leaving directory '/builddir/build/BUILD/eth-fast-fabric-11.7.0.0/IbaTools/ethshmcleanup'
cd man && make  includes
make[3]: Entering directory '/builddir/build/BUILD/eth-fast-fabric-11.7.0.0/IbaTools/man'
/builddir/build/BUILD/eth-fast-fabric-11.7.0.0/MakeTools/ln-install.sh   /builddir/build/BUILD/eth-fast-fabric-11.7.0.0/builtinclude.OPENIB_FF.release.opa10//   
echo done > .includes.OPENIB_FF.release.opa10
make[3]: Leaving directory '/builddir/build/BUILD/eth-fast-fabric-11.7.0.0/IbaTools/man'
/builddir/build/BUILD/eth-fast-fabric-11.7.0.0/MakeTools/ln-install.sh   /builddir/build/BUILD/eth-fast-fabric-11.7.0.0/builtinclude.OPENIB_FF.release.opa10//   
echo done > .includes.OPENIB_FF.release.opa10
make[2]: Leaving directory '/builddir/build/BUILD/eth-fast-fabric-11.7.0.0/IbaTools'
cd /builddir/build/BUILD/eth-fast-fabric-11.7.0.0/MpiApps && make  includes
make[2]: Entering directory '/builddir/build/BUILD/eth-fast-fabric-11.7.0.0/MpiApps'
make[2]: Nothing to be done for 'includes'.
make[2]: Leaving directory '/builddir/build/BUILD/eth-fast-fabric-11.7.0.0/MpiApps'
cd /builddir/build/BUILD/eth-fast-fabric-11.7.0.0/TestTools && make  includes
make[2]: Entering directory '/builddir/build/BUILD/eth-fast-fabric-11.7.0.0/TestTools'
/builddir/build/BUILD/eth-fast-fabric-11.7.0.0/MakeTools/ln-install.sh   /builddir/build/BUILD/eth-fast-fabric-11.7.0.0/builtinclude.OPENIB_FF.release.opa10//   
echo done > .includes.OPENIB_FF.release.opa10
make[2]: Leaving directory '/builddir/build/BUILD/eth-fast-fabric-11.7.0.0/TestTools'
cd /builddir/build/BUILD/eth-fast-fabric-11.7.0.0/IbPrint && make  includes
make[2]: Entering directory '/builddir/build/BUILD/eth-fast-fabric-11.7.0.0/IbPrint'
/builddir/build/BUILD/eth-fast-fabric-11.7.0.0/MakeTools/ln-install.sh   /builddir/build/BUILD/eth-fast-fabric-11.7.0.0/builtinclude.OPENIB_FF.release.opa10// ibprint.h   
echo done > .includes.OPENIB_FF.release.opa10
make[2]: Leaving directory '/builddir/build/BUILD/eth-fast-fabric-11.7.0.0/IbPrint'
cd /builddir/build/BUILD/eth-fast-fabric-11.7.0.0/Topology && make  includes
make[2]: Entering directory '/builddir/build/BUILD/eth-fast-fabric-11.7.0.0/Topology'
/builddir/build/BUILD/eth-fast-fabric-11.7.0.0/MakeTools/ln-install.sh   /builddir/build/BUILD/eth-fast-fabric-11.7.0.0/builtinclude.OPENIB_FF.release.opa10// topology.h hpnmgt.h port_num_gen.h  
echo done > .includes.OPENIB_FF.release.opa10
make[2]: Leaving directory '/builddir/build/BUILD/eth-fast-fabric-11.7.0.0/Topology'
cd LINUX && make  includes
make[2]: Entering directory '/builddir/build/BUILD/eth-fast-fabric-11.7.0.0/OpenIb_Host/LINUX'
Makefile:104: *** recipe commences before first target.  Stop.
make[2]: Leaving directory '/builddir/build/BUILD/eth-fast-fabric-11.7.0.0/OpenIb_Host/LINUX'
make[1]: *** [/builddir/build/BUILD/eth-fast-fabric-11.7.0.0/Makerules/Maketargets.toplevel:138: INCLUDES] Error 2
make[1]: Leaving directory '/builddir/build/BUILD/eth-fast-fabric-11.7.0.0/OpenIb_Host'
make: *** [/builddir/build/BUILD/eth-fast-fabric-11.7.0.0/Makerules/Rules.Common:226: buildall] Error 2
Done LINUX X86_64 Fast Fabric  Fri Jul 19 03:00:10 CST 2024
==============================================================
Preping Files for LINUX X86_64 Fri Jul 19 03:00:10 CST 2024...
/builddir/build/BUILD/eth-fast-fabric-11.7.0.0/MakeTools/format_releasetag.sh 11_7_0_0_111 > /builddir/build/BUILD/eth-fast-fabric-11.7.0.0/stage.OPENIB_FF.release.opa10/opencloudos/X86_64/IntelEth-Tools-FF.opencloudos.ES23-x86_64.11.7.0.0.111/version
/bin/bash: line 1: /builddir/build/BUILD/eth-fast-fabric-11.7.0.0/stage.OPENIB_FF.release.opa10/opencloudos/X86_64/IntelEth-Tools-FF.opencloudos.ES23-x86_64.11.7.0.0.111/version: No such file or directory
make: *** [Makefile:184: prepfiles] Error 1
+ set +x
egrep: warning: egrep is obsolescent; using grep -E
Build Errors:
Makefile:104: *** recipe commences before first target.  Stop.
make: *** [/builddir/build/BUILD/eth-fast-fabric-11.7.0.0/Makerules/Rules.Common:226: buildall] Error 2
make: *** [Makefile:184: prepfiles] Error 1
make[1]: *** [/builddir/build/BUILD/eth-fast-fabric-11.7.0.0/Makerules/Maketargets.toplevel:138: INCLUDES] Error 2
FAILED Build, errors detected: OPENIB_FF  X86_64 release
error: Bad exit status from /var/tmp/rpm-tmp.oYZT0b (%build)
RPM build errors:
    Bad exit status from /var/tmp/rpm-tmp.oYZT0b (%build)
Child return code was: 1
EXCEPTION: [Error('Command failed: \n # bash --login -c /usr/bin/rpmbuild -bb --noclean --target x86_64 --nodeps /builddir/build/SPECS/eth-tools.spec\n', 1)]
Traceback (most recent call last):
  File "/usr/lib/python3.11/site-packages/mockbuild/trace_decorator.py", line 93, in trace
    result = func(*args, **kw)
             ^^^^^^^^^^^^^^^^^
  File "/usr/lib/python3.11/site-packages/mockbuild/util.py", line 597, in do_with_status
    raise exception.Error("Command failed: \n # %s\n%s" % (command, output), child.returncode)
mockbuild.exception.Error: Command failed: 
 # bash --login -c /usr/bin/rpmbuild -bb --noclean --target x86_64 --nodeps /builddir/build/SPECS/eth-tools.spec